[dpdk-test-report] |FAILURE| pw70420[5/5] examples/l2fwd-crypto: free resources in case of error

sys_stv at intel.com sys_stv at intel.com
Tue May 19 12:27:39 CEST 2020


Test-Label: Intel-compilation
Test-Status: FAILURE
http://dpdk.org/patch/70420

_Compilation issues_

Submitter: Muhammad Bilal <m.bilal at emumba.com>
Date: 2020-05-19 08:54:44
Reply_mail: 20200519085444.4562-5-m.bilal at emumba.com
DPDK git baseline: Repo:dpdk, CommitID: aee2733fe327643af3aabafcf45480017e619fc5

Makefile build Summary: 23 Builds Done, 23 Successful, 0 Failures

Meson build Summary: 9 Builds Done, 2 Successful, 7 Failures

               +==============================================+===========+==========+
               |                   Makefile                   |   Meson   | Document |
+----------------+------+-------+------+------------+-----------+-----------+----------+
| os             | gcc  | clang | icc  | gcc+shared | gcc+debug | gcc/clang | pdf/html |
+----------------+------+-------+------+------------+-----------+-----------+----------+
| RHEL80-64      | pass |       |      |            |           |           |          |
| UB2004-64      | pass | pass  | pass |            |           | FAIL      |          |
| UB1804-64      | pass | pass  | pass |            |           | FAIL      | pass     |
| FC32-64        |      | pass  |      |            |           |           |          |
| CENTOS77-64    | pass |       |      |            |           |           |          |
| WIN10-64       |      |       |      |            |           | pass      |          |
| CENTOS80-64    | pass | pass  | pass | pass       | pass      | FAIL      |          |
| FC31-64        | pass |       |      |            |           | FAIL      |          |
| UB1804-32      | pass |       |      |            |           | FAIL      |          |
| FreeBSD1201-64 | pass | pass  |      | pass       | pass      | FAIL      |          |
| RHEL77-64      | pass |       |      |            |           |           |          |
| SUSE15-64      | pass | pass  |      |            |           | FAIL      |          |
+----------------+------+-------+------+------------+-----------+-----------+----------+

Test environment and configuration as below:

** Makefile build **


OS: UB2004-64
	Kernel Version: 5.4.0-26-generic
	CPU info: Intel(R) Xeon(R) Platinum 8180 CPU @ 2.50GHz
	GCC Version: gcc (Ubuntu 9.3.0-10ubuntu2) 9.3.0
	Clang Version: 10.0.0-4ubuntu1
	x86_64-native-linuxapp-gcc
	x86_64-native-linuxapp-icc
	x86_64-native-linuxapp-clang


OS: UB1804-64
	Kernel Version: 4.15.0-20-generic
	CPU info: Intel(R) Xeon(R) CPU E5-2699 v3 @ 2.30GHz
	GCC Version: gcc (Ubuntu 7.3.0-16ubuntu3) 7.3.0
	Clang Version: 6.0.0-1ubuntu2 (tags/RELEASE_600/final)
	x86_64-native-linuxapp-clang
	x86_64-native-linuxapp-icc
	x86_64-native-linuxapp-gcc


OS: FC32-64
	Kernel Version: 5.6.0-0.rc7.git0.2.fc32.x86_64
	CPU info: Intel(R) Xeon(R) CPU E5-2699 v4 @ 2.20GHz
	GCC Version: gcc (GCC) 10.0.1 20200311 (Red Hat 10.0.1-0.9)
	Clang Version: 10.0.0 (Fedora 10.0.0-0.3.rc4.fc32)
	x86_64-native-linuxapp-clang


OS: CENTOS77-64
	Kernel Version: 3.10.0-1062.9.1.el7.x86_64
	CPU info: Intel(R) Xeon(R) CPU E5-2699 v3 @ 2.30GHz
	GCC Version: gcc (GCC) 4.8.5 20150623 (Red Hat 4.8.5-39)
	Clang Version: 3.4.2 (tags/RELEASE_34/dot2-final)
	x86_64-native-linuxapp-gcc


OS: CENTOS80-64
	Kernel Version: 4.18.0-80.11.2.el8_0.x86_64
	CPU info: Intel(R) Xeon(R) CPU E5-2699 v3 @ 2.30GHz
	GCC Version: gcc (GCC) 8.2.1 20180905 (Red Hat 8.2.1-3)
	Clang Version: 7.0.1 (tags/RELEASE_701/final)
	x86_64-native-linuxapp-gcc
	x86_64-native-linuxapp-gcc+debug
	x86_64-native-linuxapp-gcc+shared
	x86_64-native-linuxapp-icc
	x86_64-native-linuxapp-clang


OS: UB1804-32
	Kernel Version: 4.15.0-20-generic
	CPU info: Intel(R) Xeon(R) Platinum 8180 CPU @ 2.50GHz
	GCC Version: gcc (Ubuntu 7.5.0-3ubuntu1~18.04) 7.5.0
	Clang Version: 6.0.0-1ubuntu2 (tags/RELEASE_600/final)
	i686-native-linuxapp-gcc


OS: FC31-64
	Kernel Version: 5.3.15-300.fc31.x86_64
	CPU info: Intel(R) Xeon(R) CPU E5-2699 v4 @ 2.20GHz
	GCC Version: gcc (GCC) 9.2.1 20190827 (Red Hat 9.2.1-1)
	Clang Version: 9.0.0 (Fedora 9.0.0-1.fc31)
	x86_64-native-linuxapp-gcc


OS: RHEL80-64
	Kernel Version: 4.18.0-80.el8.x86_64
	CPU info: Intel(R) Xeon(R) CPU E5-2699 v4 @ 2.20GHz
	GCC Version: gcc (GCC) 8.2.1 20180905 (Red Hat 8.2.1-3)
	Clang Version: 6.0.1 (tags/RELEASE_601/final)
	x86_64-native-linuxapp-gcc


OS: FreeBSD1201-64
	Kernel Version: 12.1-RELEASE
	CPU info: Intel(R) Xeon(R) CPU E5-2699 v3 @ 2.30GHz (2294.74-MHz K8-class CPU)
	GCC Version: gcc (FreeBSD Ports Collection) 9.2.0
	Clang Version: 8.0.1 (tags/RELEASE_801/final 366581) (based on LLVM 8.0.1)
	x86_64-native-bsdapp-gcc
	x86_64-native-bsdapp-clang
	x86_64-native-bsdapp-gcc+shared
	x86_64-native-bsdapp-gcc+debug


OS: RHEL77-64
	Kernel Version: 3.10.0-1062.9.1.el7.x86_64
	CPU info: Intel(R) Xeon(R) CPU E5-2699 v3 @ 2.30GHz
	GCC Version: gcc (GCC) 4.8.5 20150623 (Red Hat 4.8.5-39)
	Clang Version: 3.4.2 (tags/RELEASE_34/dot2-final)
	x86_64-native-linuxapp-gcc


OS: SUSE15-64
	Kernel Version: 4.12.14-lp150.11-default
	CPU info: Intel(R) Xeon(R) CPU E5-2699 v4 @ 2.20GHz
	GCC Version: gcc (SUSE Linux) 7.3.1 20180323 [gcc-7-branch revision 258812]
	Clang Version: 5.0.1 (tags/RELEASE_501/final 312548)
	x86_64-native-linuxapp-gcc
	x86_64-native-linuxapp-clang


** Meson build **


OS: UB2004-64
	Kernel Version: 5.4.0-26-generic
	CPU info: Intel(R) Xeon(R) CPU E5-2699 v4 @ 2.20GHz
	GCC Version: gcc (Ubuntu 9.3.0-10ubuntu2) 9.3.0
	Clang Version: 10.0.0-4ubuntu1
	./build-gcc-static
	./build-gcc-shared
	./build-clang-static
	./build-clang-shared
	./build-x86-default


OS: UB1804-64
	Kernel Version: 4.15.0-20-generic
	CPU info: Intel(R) Xeon(R) Platinum 8180 CPU @ 2.50GHz
	GCC Version: gcc (Ubuntu 7.3.0-16ubuntu3) 7.3.0
	Clang Version: 6.0.0-1ubuntu2 (tags/RELEASE_600/final)
	x86_64-native-linuxapp-doc
	./build-gcc-static
	./build-gcc-shared
	./build-clang-static
	./build-clang-shared
	./build-x86-default


OS: FC31-64
	Kernel Version: 5.4.18-200.fc31.x86_64
	CPU info: Intel(R) Xeon(R) Platinum 8180 CPU @ 2.50GHz
	GCC Version: gcc (GCC) 9.2.1 20190827 (Red Hat 9.2.1-1)
	Clang Version: 9.0.0 (Fedora 9.0.0-1.fc31)
	./build-gcc-static
	./build-gcc-shared
	./build-clang-static
	./build-clang-shared
	./build-x86-default


OS: CENTOS80-64
	Kernel Version: 4.18.0-80.11.2.el8_0.x86_64
	CPU info: Intel(R) Xeon(R) CPU E5-2699 v3 @ 2.30GHz
	GCC Version: gcc (GCC) 8.2.1 20180905 (Red Hat 8.2.1-3)
	Clang Version: 7.0.1 (tags/RELEASE_701/final)
	./build-gcc-static
	./build-gcc-shared
	./build-clang-static
	./build-clang-shared
	./build-x86-default


OS: UB1804-32
	Kernel Version: 4.15.0-20-generic
	CPU info: Intel(R) Xeon(R) CPU E5-2699 v4 @ 2.20GHz
	GCC Version: gcc (Ubuntu 7.5.0-3ubuntu1~18.04) 7.5.0
	Clang Version: 6.0.0-1ubuntu2 (tags/RELEASE_600/final)
	./build-gcc-static
	./build-gcc-shared
	./build-clang-static
	./build-clang-shared
	./build-x86-default


OS: WIN10-64
	Kernel Version: N/A
	CPU info: N/A
	GCC Version: N/A
	Clang Version: Clang 8.0.0
	x86_64-windows-clang


OS: FreeBSD1201-64
	Kernel Version: 12.1-RELEASE
	CPU info: Intel(R) Xeon(R) CPU E5-2699 v4 @ 2.20GHz (2194.97-MHz K8-class CPU)
	GCC Version: gcc (FreeBSD Ports Collection) 9.2.0
	Clang Version: 8.0.1 (tags/RELEASE_801/final 366581) (based on LLVM 8.0.1)
	./build-gcc-static
	./build-gcc-shared
	./build-clang-static
	./build-clang-shared
	./build-x86-default


OS: SUSE15-64
	Kernel Version: 4.12.14-lp150.12.82-default
	CPU info: Intel(R) Xeon(R) CPU E5-2699 v4 @ 2.20GHz
	GCC Version: gcc (SUSE Linux) 7.4.1 20190905 [gcc-7-branch revision 275407]
	Clang Version: 5.0.1 (tags/RELEASE_501/final 312548)
	./build-gcc-static
	./build-gcc-shared
	./build-clang-static
	./build-clang-shared
	./build-x86-default


*Meson Build Failed #1:
OS: CENTOS80-64
Target:./build-gcc-static
[2285/2404] Compiling C object 'examples/c590b3c@@dpdk-l2fwd-keepalive at exe/l2fwd-keepalive_shm.c.o'.
[2286/2404] Compiling C object 'examples/c590b3c@@dpdk-l3fwd at exe/l3fwd_l3fwd_event.c.o'.
[2287/2404] Compiling C object 'examples/c590b3c@@dpdk-l2fwd-event at exe/l2fwd-event_l2fwd_event_generic.c.o'.
[2288/2404] Compiling C object 'examples/c590b3c@@dpdk-l2fwd-event at exe/l2fwd-event_l2fwd_event.c.o'.
[2289/2404] Compiling C object 'examples/c590b3c@@dpdk-l2fwd-keepalive at exe/l2fwd-keepalive_main.c.o'.
FAILED: examples/c590b3c@@dpdk-l2fwd-keepalive at exe/l2fwd-keepalive_main.c.o 
gcc -Iexamples/c590b3c@@dpdk-l2fwd-keepalive at exe -Iexamples -I../examples -Iexamples/l2fwd-keepalive -I../examples/l2fwd-keepalive -I. -I../ -Iconfig -I../config -Ilib/librte_eal/include -I../lib/librte_eal/include -Ilib/librte_eal/linux/include -I../lib/librte_eal/linux/include -Ilib/librte_eal/x86/include -I../lib/librte_eal/x86/include -Ilib/librte_eal/common -I../lib/librte_eal/common -Ilib/librte_eal -I../lib/librte_eal -Ilib/librte_kvargs -I../lib/librte_kvargs -Ilib/librte_telemetry/../librte_metrics -I../lib/librte_telemetry/../librte_metrics -Ilib/librte_telemetry -I../lib/librte_telemetry -Ilib/librte_mempool -I../lib/librte_mempool -Ilib/librte_ring -I../lib/librte_ring -Ilib/librte_net -I../lib/librte_net -Ilib/librte_mbuf -I../lib/librte_mbuf -Ilib/librte_ethdev -I../lib/librte_ethdev -Ilib/librte_meter -I../lib/librte_meter -Ilib/librte_cmdline -I../lib/librte_cmdline -Ilib/librte_timer -I../lib/librte_timer -fdiagnostics-color=always -pipe -D_FILE_OFFSET_BITS=64 -Wall -Winvalid-pch -Werror -O2 -g -include rte_config.h -Wextra -Wcast-qual -Wdeprecated -Wformat-nonliteral -Wformat-security -Wmissing-declarations -Wmissing-prototypes -Wnested-externs -Wold-style-definition -Wpointer-arith -Wsign-compare -Wstrict-prototypes -Wundef -Wwrite-strings -Wno-packed-not-aligned -Wno-missing-field-initializers -D_GNU_SOURCE -march=native -mno-avx512f -Wno-format-truncation -DALLOW_EXPERIMENTAL_API -MD -MQ 'examples/c590b3c@@dpdk-l2fwd-keepalive at exe/l2fwd-keepalive_main.c.o' -MF 'examples/c590b3c@@dpdk-l2fwd-keepalive at exe/l2fwd-keepalive_main.c.o.d' -o 'examples/c590b3c@@dpdk-l2fwd-keepalive at exe/l2fwd-keepalive_main.c.o' -c ../examples/l2fwd-keepalive/main.c
../examples/l2fwd-keepalive/main.c: In function ‘main’:
../examples/l2fwd-keepalive/main.c:585:60: error: ‘NB_MBUF’ undeclared (first use in this function)
  l2fwd_pktmbuf_pool = rte_pktmbuf_pool_create("mbuf_pool", NB_MBUF, 32,
                                                            ^~~~~~~
../examples/l2fwd-keepalive/main.c:585:60: note: each undeclared identifier is reported only once for each function it appears in
../examples/l2fwd-keepalive/main.c:552:15: error: unused variable ‘total_nb_mbufs’ [-Werror=unused-variable]
  unsigned int total_nb_mbufs;
               ^~~~~~~~~~~~~~
cc1: all warnings being treated as errors
[2290/2404] Linking target examples/dpdk-l2fwd-event.
[2291/2404] Compiling C object 'examples/c590b3c@@dpdk-l2fwd-jobstats at exe/l2fwd-jobstats_main.c.o'.
--
[2296/2404] Compiling C object 'examples/c590b3c@@dpdk-l3fwd at exe/l3fwd_l3fwd_em.c.o'.
[2297/2404] Compiling C object 'examples/c590b3c@@dpdk-l2fwd-crypto at exe/l2fwd-crypto_main.c.o'.
[2298/2404] Compiling C object 'drivers/a715181@@tmp_rte_pmd_octeontx2_event at sta/event_octeontx2_otx2_worker_dual.c.o'.
[2299/2404] Compiling C object 'drivers/a715181@@tmp_rte_pmd_octeontx2_event at sta/event_octeontx2_otx2_worker.c.o'.
[2300/2404] Compiling C object 'app/test/3062f5d@@dpdk-test at exe/test_ring.c.o'.
ninja: build stopped: subcommand failed.
meson  --werror -Dexamples=l3fwd --buildtype=debugoptimized --default-library=static /root/CENTOS80-64_K4.18.0_GCC8.2.1/x86_64-native-linuxapp-gcc/7c5831e1495b41cb9ceccfa953f7852d/dpdk/devtools/.. ./build-clang-static
The Meson build system
Version: 0.52.1
Source dir: /root/CENTOS80-64_K4.18.0_GCC8.2.1/x86_64-native-linuxapp-gcc/7c5831e1495b41cb9ceccfa953f7852d/dpdk
Build dir: /root/CENTOS80-64_K4.18.0_GCC8.2.1/x86_64-native-linuxapp-gcc/7c5831e1495b41cb9ceccfa953f7852d/dpdk/build-clang-static
--
[2289/2404] Compiling C object 'examples/c590b3c@@dpdk-l2fwd-event at exe/l2fwd-event_main.c.o'.
[2290/2404] Compiling C object 'examples/c590b3c@@dpdk-l2fwd-event at exe/l2fwd-event_l2fwd_event_internal_port.c.o'.
[2291/2404] Linking target examples/dpdk-ipsec-secgw.
[2292/2404] Compiling C object 'examples/c590b3c@@dpdk-l3fwd at exe/l3fwd_l3fwd_event.c.o'.
[2293/2404] Compiling C object 'examples/c590b3c@@dpdk-l2fwd-keepalive at exe/l2fwd-keepalive_main.c.o'.
FAILED: examples/c590b3c@@dpdk-l2fwd-keepalive at exe/l2fwd-keepalive_main.c.o 
clang -Iexamples/c590b3c@@dpdk-l2fwd-keepalive at exe -Iexamples -I../examples -Iexamples/l2fwd-keepalive -I../examples/l2fwd-keepalive -I. -I../ -Iconfig -I../config -Ilib/librte_eal/include -I../lib/librte_eal/include -Ilib/librte_eal/linux/include -I../lib/librte_eal/linux/include -Ilib/librte_eal/x86/include -I../lib/librte_eal/x86/include -Ilib/librte_eal/common -I../lib/librte_eal/common -Ilib/librte_eal -I../lib/librte_eal -Ilib/librte_kvargs -I../lib/librte_kvargs -Ilib/librte_telemetry/../librte_metrics -I../lib/librte_telemetry/../librte_metrics -Ilib/librte_telemetry -I../lib/librte_telemetry -Ilib/librte_mempool -I../lib/librte_mempool -Ilib/librte_ring -I../lib/librte_ring -Ilib/librte_net -I../lib/librte_net -Ilib/librte_mbuf -I../lib/librte_mbuf -Ilib/librte_ethdev -I../lib/librte_ethdev -Ilib/librte_meter -I../lib/librte_meter -Ilib/librte_cmdline -I../lib/librte_cmdline -Ilib/librte_timer -I../lib/librte_timer -Xclang -fcolor-diagnostics -pipe -D_FILE_OFFSET_BITS=64 -Wall -Winvalid-pch -Werror -O2 -g -include rte_config.h -Wextra -Wcast-qual -Wdeprecated -Wformat-nonliteral -Wformat-security -Wmissing-declarations -Wmissing-prototypes -Wnested-externs -Wold-style-definition -Wpointer-arith -Wsign-compare -Wstrict-prototypes -Wundef -Wwrite-strings -Wno-address-of-packed-member -Wno-missing-field-initializers -D_GNU_SOURCE -march=native -mno-avx512f -DALLOW_EXPERIMENTAL_API -MD -MQ 'examples/c590b3c@@dpdk-l2fwd-keepalive at exe/l2fwd-keepalive_main.c.o' -MF 'examples/c590b3c@@dpdk-l2fwd-keepalive at exe/l2fwd-keepalive_main.c.o.d' -o 'examples/c590b3c@@dpdk-l2fwd-keepalive at exe/l2fwd-keepalive_main.c.o' -c ../examples/l2fwd-keepalive/main.c
../examples/l2fwd-keepalive/main.c:585:60: error: use of undeclared identifier 'NB_MBUF'
        l2fwd_pktmbuf_pool = rte_pktmbuf_pool_create("mbuf_pool", NB_MBUF, 32,
                                                                  ^
1 error generated.
[2294/2404] Compiling C object 'examples/c590b3c@@dpdk-l2fwd-keepalive at exe/l2fwd-keepalive_shm.c.o'.
[2295/2404] Compiling C object 'examples/c590b3c@@dpdk-l2fwd-event at exe/l2fwd-event_l2fwd_common.c.o'.
--
[2300/2404] Compiling C object 'examples/c590b3c@@dpdk-l3fwd at exe/l3fwd_l3fwd_lpm.c.o'.
[2301/2404] Compiling C object 'examples/c590b3c@@dpdk-l3fwd at exe/l3fwd_l3fwd_em.c.o'.
[2302/2404] Compiling C object 'examples/c590b3c@@dpdk-l2fwd-crypto at exe/l2fwd-crypto_main.c.o'.
[2303/2404] Compiling C object 'app/test/3062f5d@@dpdk-test at exe/test_ring_perf.c.o'.
[2304/2404] Compiling C object 'app/test/3062f5d@@dpdk-test at exe/test_ring.c.o'.
ninja: build stopped: subcommand failed.
meson  --werror -Dexamples=all --buildtype=debugoptimized -Dlibdir=lib -Dmachine=nehalem --default-library=shared /root/CENTOS80-64_K4.18.0_GCC8.2.1/x86_64-native-linuxapp-gcc/7c5831e1495b41cb9ceccfa953f7852d/dpdk/devtools/.. ./build-x86-default
The Meson build system
Version: 0.52.1
Source dir: /root/CENTOS80-64_K4.18.0_GCC8.2.1/x86_64-native-linuxapp-gcc/7c5831e1495b41cb9ceccfa953f7852d/dpdk
Build dir: /root/CENTOS80-64_K4.18.0_GCC8.2.1/x86_64-native-linuxapp-gcc/7c5831e1495b41cb9ceccfa953f7852d/dpdk/build-x86-default
--
[2281/2409] Linking target examples/dpdk-kni.
[2282/2409] Linking target examples/dpdk-ipsec-secgw.
[2283/2409] Compiling C object 'examples/c590b3c@@dpdk-l2fwd-keepalive at exe/l2fwd-keepalive_shm.c.o'.
[2284/2409] Compiling C object 'examples/c590b3c@@dpdk-l2fwd-event at exe/l2fwd-event_l2fwd_event_generic.c.o'.
[2285/2409] Compiling C object 'examples/c590b3c@@dpdk-l2fwd-keepalive at exe/l2fwd-keepalive_main.c.o'.
FAILED: examples/c590b3c@@dpdk-l2fwd-keepalive at exe/l2fwd-keepalive_main.c.o 
cc -Iexamples/c590b3c@@dpdk-l2fwd-keepalive at exe -Iexamples -I../examples -Iexamples/l2fwd-keepalive -I../examples/l2fwd-keepalive -I. -I../ -Iconfig -I../config -Ilib/librte_eal/include -I../lib/librte_eal/include -Ilib/librte_eal/linux/include -I../lib/librte_eal/linux/include -Ilib/librte_eal/x86/include -I../lib/librte_eal/x86/include -Ilib/librte_eal/common -I../lib/librte_eal/common -Ilib/librte_eal -I../lib/librte_eal -Ilib/librte_kvargs -I../lib/librte_kvargs -Ilib/librte_telemetry/../librte_metrics -I../lib/librte_telemetry/../librte_metrics -Ilib/librte_telemetry -I../lib/librte_telemetry -Ilib/librte_mempool -I../lib/librte_mempool -Ilib/librte_ring -I../lib/librte_ring -Ilib/librte_net -I../lib/librte_net -Ilib/librte_mbuf -I../lib/librte_mbuf -Ilib/librte_ethdev -I../lib/librte_ethdev -Ilib/librte_meter -I../lib/librte_meter -Ilib/librte_cmdline -I../lib/librte_cmdline -Ilib/librte_timer -I../lib/librte_timer -fdiagnostics-color=always -pipe -D_FILE_OFFSET_BITS=64 -Wall -Winvalid-pch -Werror -O2 -g -include rte_config.h -Wextra -Wcast-qual -Wdeprecated -Wformat-nonliteral -Wformat-security -Wmissing-declarations -Wmissing-prototypes -Wnested-externs -Wold-style-definition -Wpointer-arith -Wsign-compare -Wstrict-prototypes -Wundef -Wwrite-strings -Wno-packed-not-aligned -Wno-missing-field-initializers -D_GNU_SOURCE -march=nehalem -mno-avx512f -Wno-format-truncation -DALLOW_EXPERIMENTAL_API -MD -MQ 'examples/c590b3c@@dpdk-l2fwd-keepalive at exe/l2fwd-keepalive_main.c.o' -MF 'examples/c590b3c@@dpdk-l2fwd-keepalive at exe/l2fwd-keepalive_main.c.o.d' -o 'examples/c590b3c@@dpdk-l2fwd-keepalive at exe/l2fwd-keepalive_main.c.o' -c ../examples/l2fwd-keepalive/main.c
../examples/l2fwd-keepalive/main.c: In function ‘main’:
../examples/l2fwd-keepalive/main.c:585:60: error: ‘NB_MBUF’ undeclared (first use in this function)
  l2fwd_pktmbuf_pool = rte_pktmbuf_pool_create("mbuf_pool", NB_MBUF, 32,
                                                            ^~~~~~~
../examples/l2fwd-keepalive/main.c:585:60: note: each undeclared identifier is reported only once for each function it appears in
../examples/l2fwd-keepalive/main.c:552:15: error: unused variable ‘total_nb_mbufs’ [-Werror=unused-variable]
  unsigned int total_nb_mbufs;
               ^~~~~~~~~~~~~~
cc1: all warnings being treated as errors
[2286/2409] Compiling C object 'examples/c590b3c@@dpdk-l2fwd-jobstats at exe/l2fwd-jobstats_main.c.o'.
[2287/2409] Compiling C object 'examples/c590b3c@@dpdk-l3fwd at exe/l3fwd_l3fwd_lpm.c.o'.
--
[2292/2409] Compiling C object 'examples/c590b3c@@dpdk-l2fwd-crypto at exe/l2fwd-crypto_main.c.o'.
[2293/2409] Compiling C object 'app/test/3062f5d@@dpdk-test at exe/test_ring.c.o'.
[2294/2409] Compiling C object 'drivers/a715181@@tmp_rte_pmd_octeontx2_event at sta/event_octeontx2_otx2_worker.c.o'.
[2295/2409] Compiling C object 'drivers/a715181@@tmp_rte_pmd_octeontx2_event at sta/event_octeontx2_otx2_worker_dual.c.o'.
[2296/2409] Compiling C object 'lib/76b5a35@@rte_pipeline at sta/librte_pipeline_rte_table_action.c.o'.
ninja: build stopped: subcommand failed.
DESTDIR=/root/CENTOS80-64_K4.18.0_GCC8.2.1/x86_64-native-linuxapp-gcc/7c5831e1495b41cb9ceccfa953f7852d/dpdk/build-x86-default/install ninja -C /root/CENTOS80-64_K4.18.0_GCC8.2.1/x86_64-native-linuxapp-gcc/7c5831e1495b41cb9ceccfa953f7852d/dpdk/build-x86-default install >/dev/null
find: ‘/root/CENTOS80-64_K4.18.0_GCC8.2.1/x86_64-native-linuxapp-gcc/7c5831e1495b41cb9ceccfa953f7852d/dpdk/build-x86-default/install’: No such file or directory
dirname: missing operand
Try 'dirname --help' for more information.


*Meson Build Failed #2:
OS: FC31-64
Target:./build-gcc-static
[2284/2405] Compiling C object 'examples/c590b3c@@dpdk-l2fwd-event at exe/l2fwd-event_l2fwd_event_internal_port.c.o'.
[2285/2405] Compiling C object 'examples/c590b3c@@dpdk-l2fwd-event at exe/l2fwd-event_l2fwd_common.c.o'.
[2286/2405] Compiling C object 'examples/c590b3c@@dpdk-l2fwd-event at exe/l2fwd-event_l2fwd_event_generic.c.o'.
[2287/2405] Compiling C object 'examples/c590b3c@@dpdk-l2fwd-keepalive at exe/l2fwd-keepalive_shm.c.o'.
[2288/2405] Compiling C object 'examples/c590b3c@@dpdk-l2fwd-keepalive at exe/l2fwd-keepalive_main.c.o'.
FAILED: examples/c590b3c@@dpdk-l2fwd-keepalive at exe/l2fwd-keepalive_main.c.o 
gcc -Iexamples/c590b3c@@dpdk-l2fwd-keepalive at exe -Iexamples -I../examples -Iexamples/l2fwd-keepalive -I../examples/l2fwd-keepalive -I. -I../ -Iconfig -I../config -Ilib/librte_eal/include -I../lib/librte_eal/include -Ilib/librte_eal/linux/include -I../lib/librte_eal/linux/include -Ilib/librte_eal/x86/include -I../lib/librte_eal/x86/include -Ilib/librte_eal/common -I../lib/librte_eal/common -Ilib/librte_eal -I../lib/librte_eal -Ilib/librte_kvargs -I../lib/librte_kvargs -Ilib/librte_telemetry/../librte_metrics -I../lib/librte_telemetry/../librte_metrics -Ilib/librte_telemetry -I../lib/librte_telemetry -Ilib/librte_mempool -I../lib/librte_mempool -Ilib/librte_ring -I../lib/librte_ring -Ilib/librte_net -I../lib/librte_net -Ilib/librte_mbuf -I../lib/librte_mbuf -Ilib/librte_ethdev -I../lib/librte_ethdev -Ilib/librte_meter -I../lib/librte_meter -Ilib/librte_cmdline -I../lib/librte_cmdline -Ilib/librte_timer -I../lib/librte_timer -fdiagnostics-color=always -pipe -D_FILE_OFFSET_BITS=64 -Wall -Winvalid-pch -Werror -O2 -g -include rte_config.h -Wextra -Wcast-qual -Wdeprecated -Wformat-nonliteral -Wformat-security -Wmissing-declarations -Wmissing-prototypes -Wnested-externs -Wold-style-definition -Wpointer-arith -Wsign-compare -Wstrict-prototypes -Wundef -Wwrite-strings -Wno-address-of-packed-member -Wno-packed-not-aligned -Wno-missing-field-initializers -D_GNU_SOURCE -march=native -Wno-format-truncation -DALLOW_EXPERIMENTAL_API -MD -MQ 'examples/c590b3c@@dpdk-l2fwd-keepalive at exe/l2fwd-keepalive_main.c.o' -MF 'examples/c590b3c@@dpdk-l2fwd-keepalive at exe/l2fwd-keepalive_main.c.o.d' -o 'examples/c590b3c@@dpdk-l2fwd-keepalive at exe/l2fwd-keepalive_main.c.o' -c ../examples/l2fwd-keepalive/main.c
../examples/l2fwd-keepalive/main.c: In function ‘main’:
../examples/l2fwd-keepalive/main.c:585:60: error: ‘NB_MBUF’ undeclared (first use in this function)
  585 |  l2fwd_pktmbuf_pool = rte_pktmbuf_pool_create("mbuf_pool", NB_MBUF, 32,
      |                                                            ^~~~~~~
../examples/l2fwd-keepalive/main.c:585:60: note: each undeclared identifier is reported only once for each function it appears in
../examples/l2fwd-keepalive/main.c:552:15: error: unused variable ‘total_nb_mbufs’ [-Werror=unused-variable]
  552 |  unsigned int total_nb_mbufs;
      |               ^~~~~~~~~~~~~~
cc1: all warnings being treated as errors
[2289/2405] Compiling C object 'examples/c590b3c@@dpdk-l3fwd at exe/l3fwd_l3fwd_event.c.o'.
[2290/2405] Compiling C object 'examples/c590b3c@@dpdk-l2fwd-event at exe/l2fwd-event_l2fwd_event.c.o'.
--
[2293/2405] Compiling C object 'examples/c590b3c@@dpdk-l3fwd at exe/l3fwd_l3fwd_em.c.o'.
[2294/2405] Compiling C object 'examples/c590b3c@@dpdk-l2fwd-crypto at exe/l2fwd-crypto_main.c.o'.
[2295/2405] Compiling C object 'drivers/a715181@@tmp_rte_pmd_octeontx2_event at sta/event_octeontx2_otx2_worker.c.o'.
[2296/2405] Compiling C object 'drivers/a715181@@tmp_rte_pmd_octeontx2_event at sta/event_octeontx2_otx2_worker_dual.c.o'.
[2297/2405] Compiling C object 'app/test/3062f5d@@dpdk-test at exe/test_ring.c.o'.
ninja: build stopped: subcommand failed.
meson  --werror -Dexamples=l3fwd --buildtype=debugoptimized --default-library=static /root/FC31-64_K5.3.14_GCC9.2.1/x86_64-native-linuxapp-gcc/7c5831e1495b41cb9ceccfa953f7852d/dpdk/devtools/.. ./build-clang-static
The Meson build system
Version: 0.52.1
Source dir: /root/FC31-64_K5.3.14_GCC9.2.1/x86_64-native-linuxapp-gcc/7c5831e1495b41cb9ceccfa953f7852d/dpdk
Build dir: /root/FC31-64_K5.3.14_GCC9.2.1/x86_64-native-linuxapp-gcc/7c5831e1495b41cb9ceccfa953f7852d/dpdk/build-clang-static
--
[2296/2405] Compiling C object 'examples/c590b3c@@dpdk-l2fwd-keepalive at exe/l2fwd-keepalive_shm.c.o'.
[2297/2405] Compiling C object 'examples/c590b3c@@dpdk-l2fwd-event at exe/l2fwd-event_l2fwd_event_generic.c.o'.
[2298/2405] Compiling C object 'examples/c590b3c@@dpdk-l3fwd at exe/l3fwd_l3fwd_event.c.o'.
[2299/2405] Compiling C object 'examples/c590b3c@@dpdk-l2fwd-event at exe/l2fwd-event_l2fwd_event.c.o'.
[2300/2405] Compiling C object 'examples/c590b3c@@dpdk-l2fwd-keepalive at exe/l2fwd-keepalive_main.c.o'.
FAILED: examples/c590b3c@@dpdk-l2fwd-keepalive at exe/l2fwd-keepalive_main.c.o 
clang -Iexamples/c590b3c@@dpdk-l2fwd-keepalive at exe -Iexamples -I../examples -Iexamples/l2fwd-keepalive -I../examples/l2fwd-keepalive -I. -I../ -Iconfig -I../config -Ilib/librte_eal/include -I../lib/librte_eal/include -Ilib/librte_eal/linux/include -I../lib/librte_eal/linux/include -Ilib/librte_eal/x86/include -I../lib/librte_eal/x86/include -Ilib/librte_eal/common -I../lib/librte_eal/common -Ilib/librte_eal -I../lib/librte_eal -Ilib/librte_kvargs -I../lib/librte_kvargs -Ilib/librte_telemetry/../librte_metrics -I../lib/librte_telemetry/../librte_metrics -Ilib/librte_telemetry -I../lib/librte_telemetry -Ilib/librte_mempool -I../lib/librte_mempool -Ilib/librte_ring -I../lib/librte_ring -Ilib/librte_net -I../lib/librte_net -Ilib/librte_mbuf -I../lib/librte_mbuf -Ilib/librte_ethdev -I../lib/librte_ethdev -Ilib/librte_meter -I../lib/librte_meter -Ilib/librte_cmdline -I../lib/librte_cmdline -Ilib/librte_timer -I../lib/librte_timer -Xclang -fcolor-diagnostics -pipe -D_FILE_OFFSET_BITS=64 -Wall -Winvalid-pch -Werror -O2 -g -include rte_config.h -Wextra -Wcast-qual -Wdeprecated -Wformat-nonliteral -Wformat-security -Wmissing-declarations -Wmissing-prototypes -Wnested-externs -Wold-style-definition -Wpointer-arith -Wsign-compare -Wstrict-prototypes -Wundef -Wwrite-strings -Wno-address-of-packed-member -Wno-missing-field-initializers -D_GNU_SOURCE -march=native -DALLOW_EXPERIMENTAL_API -MD -MQ 'examples/c590b3c@@dpdk-l2fwd-keepalive at exe/l2fwd-keepalive_main.c.o' -MF 'examples/c590b3c@@dpdk-l2fwd-keepalive at exe/l2fwd-keepalive_main.c.o.d' -o 'examples/c590b3c@@dpdk-l2fwd-keepalive at exe/l2fwd-keepalive_main.c.o' -c ../examples/l2fwd-keepalive/main.c
../examples/l2fwd-keepalive/main.c:585:60: error: use of undeclared identifier 'NB_MBUF'
        l2fwd_pktmbuf_pool = rte_pktmbuf_pool_create("mbuf_pool", NB_MBUF, 32,
                                                                  ^
1 error generated.
[2301/2405] Linking target examples/dpdk-l2fwd-event.
[2302/2405] Compiling C object 'examples/c590b3c@@dpdk-l2fwd-jobstats at exe/l2fwd-jobstats_main.c.o'.
--
[2305/2405] Compiling C object 'examples/c590b3c@@dpdk-l3fwd at exe/l3fwd_l3fwd_lpm.c.o'.
[2306/2405] Compiling C object 'examples/c590b3c@@dpdk-l3fwd at exe/l3fwd_l3fwd_em.c.o'.
[2307/2405] Compiling C object 'examples/c590b3c@@dpdk-l2fwd-crypto at exe/l2fwd-crypto_main.c.o'.
[2308/2405] Compiling C object 'app/test/3062f5d@@dpdk-test at exe/test_ring_perf.c.o'.
[2309/2405] Compiling C object 'app/test/3062f5d@@dpdk-test at exe/test_ring.c.o'.
ninja: build stopped: subcommand failed.
meson  --werror -Dexamples=all --buildtype=debugoptimized -Dlibdir=lib -Dmachine=nehalem --default-library=shared /root/FC31-64_K5.3.14_GCC9.2.1/x86_64-native-linuxapp-gcc/7c5831e1495b41cb9ceccfa953f7852d/dpdk/devtools/.. ./build-x86-default
The Meson build system
Version: 0.52.1
Source dir: /root/FC31-64_K5.3.14_GCC9.2.1/x86_64-native-linuxapp-gcc/7c5831e1495b41cb9ceccfa953f7852d/dpdk
Build dir: /root/FC31-64_K5.3.14_GCC9.2.1/x86_64-native-linuxapp-gcc/7c5831e1495b41cb9ceccfa953f7852d/dpdk/build-x86-default
--
[2290/2410] Compiling C object 'examples/c590b3c@@dpdk-l2fwd-event at exe/l2fwd-event_l2fwd_common.c.o'.
[2291/2410] Compiling C object 'examples/c590b3c@@dpdk-l2fwd-keepalive at exe/l2fwd-keepalive_shm.c.o'.
[2292/2410] Compiling C object 'examples/c590b3c@@dpdk-l2fwd-event at exe/l2fwd-event_l2fwd_event_generic.c.o'.
[2293/2410] Compiling C object 'examples/c590b3c@@dpdk-l3fwd at exe/l3fwd_l3fwd_event.c.o'.
[2294/2410] Compiling C object 'examples/c590b3c@@dpdk-l2fwd-keepalive at exe/l2fwd-keepalive_main.c.o'.
FAILED: examples/c590b3c@@dpdk-l2fwd-keepalive at exe/l2fwd-keepalive_main.c.o 
cc -Iexamples/c590b3c@@dpdk-l2fwd-keepalive at exe -Iexamples -I../examples -Iexamples/l2fwd-keepalive -I../examples/l2fwd-keepalive -I. -I../ -Iconfig -I../config -Ilib/librte_eal/include -I../lib/librte_eal/include -Ilib/librte_eal/linux/include -I../lib/librte_eal/linux/include -Ilib/librte_eal/x86/include -I../lib/librte_eal/x86/include -Ilib/librte_eal/common -I../lib/librte_eal/common -Ilib/librte_eal -I../lib/librte_eal -Ilib/librte_kvargs -I../lib/librte_kvargs -Ilib/librte_telemetry/../librte_metrics -I../lib/librte_telemetry/../librte_metrics -Ilib/librte_telemetry -I../lib/librte_telemetry -Ilib/librte_mempool -I../lib/librte_mempool -Ilib/librte_ring -I../lib/librte_ring -Ilib/librte_net -I../lib/librte_net -Ilib/librte_mbuf -I../lib/librte_mbuf -Ilib/librte_ethdev -I../lib/librte_ethdev -Ilib/librte_meter -I../lib/librte_meter -Ilib/librte_cmdline -I../lib/librte_cmdline -Ilib/librte_timer -I../lib/librte_timer -fdiagnostics-color=always -pipe -D_FILE_OFFSET_BITS=64 -Wall -Winvalid-pch -Werror -O2 -g -include rte_config.h -Wextra -Wcast-qual -Wdeprecated -Wformat-nonliteral -Wformat-security -Wmissing-declarations -Wmissing-prototypes -Wnested-externs -Wold-style-definition -Wpointer-arith -Wsign-compare -Wstrict-prototypes -Wundef -Wwrite-strings -Wno-address-of-packed-member -Wno-packed-not-aligned -Wno-missing-field-initializers -D_GNU_SOURCE -march=nehalem -Wno-format-truncation -DALLOW_EXPERIMENTAL_API -MD -MQ 'examples/c590b3c@@dpdk-l2fwd-keepalive at exe/l2fwd-keepalive_main.c.o' -MF 'examples/c590b3c@@dpdk-l2fwd-keepalive at exe/l2fwd-keepalive_main.c.o.d' -o 'examples/c590b3c@@dpdk-l2fwd-keepalive at exe/l2fwd-keepalive_main.c.o' -c ../examples/l2fwd-keepalive/main.c
../examples/l2fwd-keepalive/main.c: In function ‘main’:
../examples/l2fwd-keepalive/main.c:585:60: error: ‘NB_MBUF’ undeclared (first use in this function)
  585 |  l2fwd_pktmbuf_pool = rte_pktmbuf_pool_create("mbuf_pool", NB_MBUF, 32,
      |                                                            ^~~~~~~
../examples/l2fwd-keepalive/main.c:585:60: note: each undeclared identifier is reported only once for each function it appears in
../examples/l2fwd-keepalive/main.c:552:15: error: unused variable ‘total_nb_mbufs’ [-Werror=unused-variable]
  552 |  unsigned int total_nb_mbufs;
      |               ^~~~~~~~~~~~~~
cc1: all warnings being treated as errors
[2295/2410] Compiling C object 'examples/c590b3c@@dpdk-l2fwd-event at exe/l2fwd-event_l2fwd_event.c.o'.
[2296/2410] Compiling C object 'examples/c590b3c@@dpdk-l3fwd at exe/l3fwd_l3fwd_event_generic.c.o'.
--
[2299/2410] Compiling C object 'drivers/a715181@@tmp_rte_pmd_octeontx2_event at sta/event_octeontx2_otx2_worker_dual.c.o'.
[2300/2410] Compiling C object 'examples/c590b3c@@dpdk-l3fwd at exe/l3fwd_l3fwd_em.c.o'.
[2301/2410] Compiling C object 'examples/c590b3c@@dpdk-l2fwd-crypto at exe/l2fwd-crypto_main.c.o'.
[2302/2410] Compiling C object 'app/test/3062f5d@@dpdk-test at exe/test_memcpy_perf.c.o'.
[2303/2410] Compiling C object 'app/test/3062f5d@@dpdk-test at exe/test_ring.c.o'.
ninja: build stopped: subcommand failed.
DESTDIR=/root/FC31-64_K5.3.14_GCC9.2.1/x86_64-native-linuxapp-gcc/7c5831e1495b41cb9ceccfa953f7852d/dpdk/build-x86-default/install ninja -C /root/FC31-64_K5.3.14_GCC9.2.1/x86_64-native-linuxapp-gcc/7c5831e1495b41cb9ceccfa953f7852d/dpdk/build-x86-default install >/dev/null
find: ‘/root/FC31-64_K5.3.14_GCC9.2.1/x86_64-native-linuxapp-gcc/7c5831e1495b41cb9ceccfa953f7852d/dpdk/build-x86-default/install’: No such file or directory
dirname: missing operand
Try 'dirname --help' for more information.


*Meson Build Failed #3:
OS: UB1804-64
Target:./build-gcc-static
[2155/2280] Compiling C object 'examples/c590b3c@@dpdk-l2fwd-event at exe/l2fwd-event_l2fwd_event_internal_port.c.o'.
[2156/2280] Linking target examples/dpdk-kni.
[2157/2280] Compiling C object 'examples/c590b3c@@dpdk-l2fwd-event at exe/l2fwd-event_l2fwd_event_generic.c.o'.
[2158/2280] Compiling C object 'examples/c590b3c@@dpdk-l2fwd at exe/l2fwd_main.c.o'.
[2159/2280] Compiling C object 'examples/c590b3c@@dpdk-l2fwd-keepalive at exe/l2fwd-keepalive_main.c.o'.
FAILED: examples/c590b3c@@dpdk-l2fwd-keepalive at exe/l2fwd-keepalive_main.c.o 
gcc -Iexamples/c590b3c@@dpdk-l2fwd-keepalive at exe -Iexamples -I../examples -Iexamples/l2fwd-keepalive -I../examples/l2fwd-keepalive -I. -I../ -Iconfig -I../config -Ilib/librte_eal/include -I../lib/librte_eal/include -Ilib/librte_eal/linux/include -I../lib/librte_eal/linux/include -Ilib/librte_eal/x86/include -I../lib/librte_eal/x86/include -Ilib/librte_eal/common -I../lib/librte_eal/common -Ilib/librte_eal -I../lib/librte_eal -Ilib/librte_kvargs -I../lib/librte_kvargs -Ilib/librte_telemetry/../librte_metrics -I../lib/librte_telemetry/../librte_metrics -Ilib/librte_telemetry -I../lib/librte_telemetry -Ilib/librte_mempool -I../lib/librte_mempool -Ilib/librte_ring -I../lib/librte_ring -Ilib/librte_net -I../lib/librte_net -Ilib/librte_mbuf -I../lib/librte_mbuf -Ilib/librte_ethdev -I../lib/librte_ethdev -Ilib/librte_meter -I../lib/librte_meter -Ilib/librte_cmdline -I../lib/librte_cmdline -Ilib/librte_timer -I../lib/librte_timer -fdiagnostics-color=always -pipe -D_FILE_OFFSET_BITS=64 -Wall -Winvalid-pch -Werror -O2 -g -include rte_config.h -Wextra -Wcast-qual -Wdeprecated -Wformat-nonliteral -Wformat-security -Wmissing-declarations -Wmissing-prototypes -Wnested-externs -Wold-style-definition -Wpointer-arith -Wsign-compare -Wstrict-prototypes -Wundef -Wwrite-strings -Wno-missing-field-initializers -D_GNU_SOURCE -march=native -mno-avx512f -Wno-format-truncation -DALLOW_EXPERIMENTAL_API -MD -MQ 'examples/c590b3c@@dpdk-l2fwd-keepalive at exe/l2fwd-keepalive_main.c.o' -MF 'examples/c590b3c@@dpdk-l2fwd-keepalive at exe/l2fwd-keepalive_main.c.o.d' -o 'examples/c590b3c@@dpdk-l2fwd-keepalive at exe/l2fwd-keepalive_main.c.o' -c ../examples/l2fwd-keepalive/main.c
../examples/l2fwd-keepalive/main.c: In function ‘main’:
../examples/l2fwd-keepalive/main.c:585:60: error: ‘NB_MBUF’ undeclared (first use in this function)
  l2fwd_pktmbuf_pool = rte_pktmbuf_pool_create("mbuf_pool", NB_MBUF, 32,
                                                            ^~~~~~~
../examples/l2fwd-keepalive/main.c:585:60: note: each undeclared identifier is reported only once for each function it appears in
../examples/l2fwd-keepalive/main.c:552:15: error: unused variable ‘total_nb_mbufs’ [-Werror=unused-variable]
  unsigned int total_nb_mbufs;
               ^~~~~~~~~~~~~~
cc1: all warnings being treated as errors
[2160/2280] Linking target examples/dpdk-l2fwd.
[2161/2280] Compiling C object 'examples/c590b3c@@dpdk-l3fwd at exe/l3fwd_l3fwd_event.c.o'.
--
[2164/2280] Compiling C object 'examples/c590b3c@@dpdk-ipv4_multicast at exe/ipv4_multicast_main.c.o'.
[2165/2280] Compiling C object 'examples/c590b3c@@dpdk-ipsec-secgw at exe/ipsec-secgw_ipsec-secgw.c.o'.
[2166/2280] Compiling C object 'drivers/a715181@@tmp_rte_pmd_octeontx2_event at sta/event_octeontx2_otx2_worker_dual.c.o'.
[2167/2280] Compiling C object 'examples/c590b3c@@dpdk-l2fwd-crypto at exe/l2fwd-crypto_main.c.o'.
[2168/2280] Compiling C object 'app/test/3062f5d@@dpdk-test at exe/test_ring.c.o'.
ninja: build stopped: subcommand failed.
meson  --werror -Dexamples=l3fwd --buildtype=debugoptimized --default-library=static /root/UB1804-64_K4.15.0_GCC7.3.0/x86_64-native-linuxapp-gcc/7c5831e1495b41cb9ceccfa953f7852d/dpdk/devtools/.. ./build-clang-static
The Meson build system
Version: 0.52.0
Source dir: /root/UB1804-64_K4.15.0_GCC7.3.0/x86_64-native-linuxapp-gcc/7c5831e1495b41cb9ceccfa953f7852d/dpdk
Build dir: /root/UB1804-64_K4.15.0_GCC7.3.0/x86_64-native-linuxapp-gcc/7c5831e1495b41cb9ceccfa953f7852d/dpdk/build-clang-static
--
[2169/2280] Compiling C object 'examples/c590b3c@@dpdk-l2fwd-event at exe/l2fwd-event_main.c.o'.
[2170/2280] Compiling C object 'examples/c590b3c@@dpdk-l2fwd-event at exe/l2fwd-event_l2fwd_common.c.o'.
[2171/2280] Compiling C object 'examples/c590b3c@@dpdk-l3fwd at exe/l3fwd_l3fwd_event.c.o'.
[2172/2280] Compiling C object 'examples/c590b3c@@dpdk-l2fwd-keepalive at exe/l2fwd-keepalive_shm.c.o'.
[2173/2280] Compiling C object 'examples/c590b3c@@dpdk-l2fwd-keepalive at exe/l2fwd-keepalive_main.c.o'.
FAILED: examples/c590b3c@@dpdk-l2fwd-keepalive at exe/l2fwd-keepalive_main.c.o 
clang -Iexamples/c590b3c@@dpdk-l2fwd-keepalive at exe -Iexamples -I../examples -Iexamples/l2fwd-keepalive -I../examples/l2fwd-keepalive -I. -I../ -Iconfig -I../config -Ilib/librte_eal/include -I../lib/librte_eal/include -Ilib/librte_eal/linux/include -I../lib/librte_eal/linux/include -Ilib/librte_eal/x86/include -I../lib/librte_eal/x86/include -Ilib/librte_eal/common -I../lib/librte_eal/common -Ilib/librte_eal -I../lib/librte_eal -Ilib/librte_kvargs -I../lib/librte_kvargs -Ilib/librte_telemetry/../librte_metrics -I../lib/librte_telemetry/../librte_metrics -Ilib/librte_telemetry -I../lib/librte_telemetry -Ilib/librte_mempool -I../lib/librte_mempool -Ilib/librte_ring -I../lib/librte_ring -Ilib/librte_net -I../lib/librte_net -Ilib/librte_mbuf -I../lib/librte_mbuf -Ilib/librte_ethdev -I../lib/librte_ethdev -Ilib/librte_meter -I../lib/librte_meter -Ilib/librte_cmdline -I../lib/librte_cmdline -Ilib/librte_timer -I../lib/librte_timer -Xclang -fcolor-diagnostics -pipe -D_FILE_OFFSET_BITS=64 -Wall -Winvalid-pch -Werror -O2 -g -include rte_config.h -Wextra -Wcast-qual -Wdeprecated -Wformat-nonliteral -Wformat-security -Wmissing-declarations -Wmissing-prototypes -Wnested-externs -Wold-style-definition -Wpointer-arith -Wsign-compare -Wstrict-prototypes -Wundef -Wwrite-strings -Wno-address-of-packed-member -Wno-missing-field-initializers -D_GNU_SOURCE -march=native -mno-avx512f -DALLOW_EXPERIMENTAL_API -MD -MQ 'examples/c590b3c@@dpdk-l2fwd-keepalive at exe/l2fwd-keepalive_main.c.o' -MF 'examples/c590b3c@@dpdk-l2fwd-keepalive at exe/l2fwd-keepalive_main.c.o.d' -o 'examples/c590b3c@@dpdk-l2fwd-keepalive at exe/l2fwd-keepalive_main.c.o' -c ../examples/l2fwd-keepalive/main.c
../examples/l2fwd-keepalive/main.c:585:60: error: use of undeclared identifier 'NB_MBUF'
        l2fwd_pktmbuf_pool = rte_pktmbuf_pool_create("mbuf_pool", NB_MBUF, 32,
                                                                  ^
1 error generated.
[2174/2280] Compiling C object 'examples/c590b3c@@dpdk-l2fwd-event at exe/l2fwd-event_l2fwd_event.c.o'.
[2175/2280] Compiling C object 'examples/c590b3c@@dpdk-l3fwd at exe/l3fwd_l3fwd_event_generic.c.o'.
--
[2178/2280] Compiling C object 'examples/c590b3c@@dpdk-l3fwd at exe/l3fwd_l3fwd_lpm.c.o'.
[2179/2280] Compiling C object 'examples/c590b3c@@dpdk-l2fwd-crypto at exe/l2fwd-crypto_main.c.o'.
[2180/2280] Compiling C object 'examples/c590b3c@@dpdk-l3fwd at exe/l3fwd_l3fwd_em.c.o'.
[2181/2280] Compiling C object 'app/test/3062f5d@@dpdk-test at exe/test_ring_perf.c.o'.
[2182/2280] Compiling C object 'app/test/3062f5d@@dpdk-test at exe/test_ring.c.o'.
ninja: build stopped: subcommand failed.
meson  --werror -Dexamples=all --buildtype=debugoptimized -Dlibdir=lib -Dmachine=nehalem --default-library=shared /root/UB1804-64_K4.15.0_GCC7.3.0/x86_64-native-linuxapp-gcc/7c5831e1495b41cb9ceccfa953f7852d/dpdk/devtools/.. ./build-x86-default
The Meson build system
Version: 0.52.0
Source dir: /root/UB1804-64_K4.15.0_GCC7.3.0/x86_64-native-linuxapp-gcc/7c5831e1495b41cb9ceccfa953f7852d/dpdk
Build dir: /root/UB1804-64_K4.15.0_GCC7.3.0/x86_64-native-linuxapp-gcc/7c5831e1495b41cb9ceccfa953f7852d/dpdk/build-x86-default
--
[2162/2285] Compiling C object 'examples/c590b3c@@dpdk-l2fwd-event at exe/l2fwd-event_l2fwd_poll.c.o'.
[2163/2285] Linking target examples/dpdk-ipv4_multicast.
[2164/2285] Compiling C object 'examples/c590b3c@@dpdk-l3fwd at exe/l3fwd_l3fwd_event.c.o'.
[2165/2285] Compiling C object 'examples/c590b3c@@dpdk-l2fwd-event at exe/l2fwd-event_l2fwd_event.c.o'.
[2166/2285] Compiling C object 'examples/c590b3c@@dpdk-l2fwd-keepalive at exe/l2fwd-keepalive_main.c.o'.
FAILED: examples/c590b3c@@dpdk-l2fwd-keepalive at exe/l2fwd-keepalive_main.c.o 
cc -Iexamples/c590b3c@@dpdk-l2fwd-keepalive at exe -Iexamples -I../examples -Iexamples/l2fwd-keepalive -I../examples/l2fwd-keepalive -I. -I../ -Iconfig -I../config -Ilib/librte_eal/include -I../lib/librte_eal/include -Ilib/librte_eal/linux/include -I../lib/librte_eal/linux/include -Ilib/librte_eal/x86/include -I../lib/librte_eal/x86/include -Ilib/librte_eal/common -I../lib/librte_eal/common -Ilib/librte_eal -I../lib/librte_eal -Ilib/librte_kvargs -I../lib/librte_kvargs -Ilib/librte_telemetry/../librte_metrics -I../lib/librte_telemetry/../librte_metrics -Ilib/librte_telemetry -I../lib/librte_telemetry -Ilib/librte_mempool -I../lib/librte_mempool -Ilib/librte_ring -I../lib/librte_ring -Ilib/librte_net -I../lib/librte_net -Ilib/librte_mbuf -I../lib/librte_mbuf -Ilib/librte_ethdev -I../lib/librte_ethdev -Ilib/librte_meter -I../lib/librte_meter -Ilib/librte_cmdline -I../lib/librte_cmdline -Ilib/librte_timer -I../lib/librte_timer -fdiagnostics-color=always -pipe -D_FILE_OFFSET_BITS=64 -Wall -Winvalid-pch -Werror -O2 -g -include rte_config.h -Wextra -Wcast-qual -Wdeprecated -Wformat-nonliteral -Wformat-security -Wmissing-declarations -Wmissing-prototypes -Wnested-externs -Wold-style-definition -Wpointer-arith -Wsign-compare -Wstrict-prototypes -Wundef -Wwrite-strings -Wno-missing-field-initializers -D_GNU_SOURCE -march=nehalem -mno-avx512f -Wno-format-truncation -DALLOW_EXPERIMENTAL_API -MD -MQ 'examples/c590b3c@@dpdk-l2fwd-keepalive at exe/l2fwd-keepalive_main.c.o' -MF 'examples/c590b3c@@dpdk-l2fwd-keepalive at exe/l2fwd-keepalive_main.c.o.d' -o 'examples/c590b3c@@dpdk-l2fwd-keepalive at exe/l2fwd-keepalive_main.c.o' -c ../examples/l2fwd-keepalive/main.c
../examples/l2fwd-keepalive/main.c: In function ‘main’:
../examples/l2fwd-keepalive/main.c:585:60: error: ‘NB_MBUF’ undeclared (first use in this function)
  l2fwd_pktmbuf_pool = rte_pktmbuf_pool_create("mbuf_pool", NB_MBUF, 32,
                                                            ^~~~~~~
../examples/l2fwd-keepalive/main.c:585:60: note: each undeclared identifier is reported only once for each function it appears in
../examples/l2fwd-keepalive/main.c:552:15: error: unused variable ‘total_nb_mbufs’ [-Werror=unused-variable]
  unsigned int total_nb_mbufs;
               ^~~~~~~~~~~~~~
cc1: all warnings being treated as errors
[2167/2285] Compiling C object 'examples/c590b3c@@dpdk-l2fwd-keepalive at exe/l2fwd-keepalive_shm.c.o'.
[2168/2285] Linking target examples/dpdk-l2fwd-event.
--
[2171/2285] Compiling C object 'examples/c590b3c@@dpdk-l3fwd at exe/l3fwd_l3fwd_lpm.c.o'.
[2172/2285] Compiling C object 'examples/c590b3c@@dpdk-l2fwd-crypto at exe/l2fwd-crypto_main.c.o'.
[2173/2285] Compiling C object 'app/test/3062f5d@@dpdk-test at exe/test_memcpy_perf.c.o'.
[2174/2285] Compiling C object 'lib/76b5a35@@rte_pipeline at sta/librte_pipeline_rte_table_action.c.o'.
[2175/2285] Compiling C object 'app/test/3062f5d@@dpdk-test at exe/test_ring.c.o'.
ninja: build stopped: subcommand failed.
DESTDIR=/root/UB1804-64_K4.15.0_GCC7.3.0/x86_64-native-linuxapp-gcc/7c5831e1495b41cb9ceccfa953f7852d/dpdk/build-x86-default/install ninja -C /root/UB1804-64_K4.15.0_GCC7.3.0/x86_64-native-linuxapp-gcc/7c5831e1495b41cb9ceccfa953f7852d/dpdk/build-x86-default install >/dev/null
find: ‘/root/UB1804-64_K4.15.0_GCC7.3.0/x86_64-native-linuxapp-gcc/7c5831e1495b41cb9ceccfa953f7852d/dpdk/build-x86-default/install’: No such file or directory
dirname: missing operand
Try 'dirname --help' for more information.


*Meson Build Failed #4:
OS: UB1804-32
Target:./build-gcc-static
[2033/2139] Compiling C object 'examples/c590b3c@@dpdk-l2fwd-event at exe/l2fwd-event_l2fwd_poll.c.o'.
[2034/2139] Compiling C object 'examples/c590b3c@@dpdk-l2fwd-event at exe/l2fwd-event_l2fwd_event_internal_port.c.o'.
[2035/2139] Compiling C object 'examples/c590b3c@@dpdk-l2fwd-event at exe/l2fwd-event_main.c.o'.
[2036/2139] Linking target examples/dpdk-ipsec-secgw.
[2037/2139] Compiling C object 'examples/c590b3c@@dpdk-l2fwd-keepalive at exe/l2fwd-keepalive_main.c.o'.
FAILED: examples/c590b3c@@dpdk-l2fwd-keepalive at exe/l2fwd-keepalive_main.c.o 
gcc -Iexamples/c590b3c@@dpdk-l2fwd-keepalive at exe -Iexamples -I../examples -Iexamples/l2fwd-keepalive -I../examples/l2fwd-keepalive -I. -I../ -Iconfig -I../config -Ilib/librte_eal/include -I../lib/librte_eal/include -Ilib/librte_eal/linux/include -I../lib/librte_eal/linux/include -Ilib/librte_eal/x86/include -I../lib/librte_eal/x86/include -Ilib/librte_eal/common -I../lib/librte_eal/common -Ilib/librte_eal -I../lib/librte_eal -Ilib/librte_kvargs -I../lib/librte_kvargs -Ilib/librte_telemetry/../librte_metrics -I../lib/librte_telemetry/../librte_metrics -Ilib/librte_telemetry -I../lib/librte_telemetry -Ilib/librte_mempool -I../lib/librte_mempool -Ilib/librte_ring -I../lib/librte_ring -Ilib/librte_net -I../lib/librte_net -Ilib/librte_mbuf -I../lib/librte_mbuf -Ilib/librte_ethdev -I../lib/librte_ethdev -Ilib/librte_meter -I../lib/librte_meter -Ilib/librte_cmdline -I../lib/librte_cmdline -Ilib/librte_timer -I../lib/librte_timer -fdiagnostics-color=always -pipe -D_FILE_OFFSET_BITS=64 -Wall -Winvalid-pch -Werror -O2 -g -include rte_config.h -Wextra -Wcast-qual -Wdeprecated -Wformat-nonliteral -Wformat-security -Wmissing-declarations -Wmissing-prototypes -Wnested-externs -Wold-style-definition -Wpointer-arith -Wsign-compare -Wstrict-prototypes -Wundef -Wwrite-strings -Wno-missing-field-initializers -Wno-pointer-to-int-cast -D_GNU_SOURCE -m32 -march=native -Wno-format-truncation -DALLOW_EXPERIMENTAL_API -MD -MQ 'examples/c590b3c@@dpdk-l2fwd-keepalive at exe/l2fwd-keepalive_main.c.o' -MF 'examples/c590b3c@@dpdk-l2fwd-keepalive at exe/l2fwd-keepalive_main.c.o.d' -o 'examples/c590b3c@@dpdk-l2fwd-keepalive at exe/l2fwd-keepalive_main.c.o' -c ../examples/l2fwd-keepalive/main.c
../examples/l2fwd-keepalive/main.c: In function ‘main’:
../examples/l2fwd-keepalive/main.c:585:60: error: ‘NB_MBUF’ undeclared (first use in this function)
  l2fwd_pktmbuf_pool = rte_pktmbuf_pool_create("mbuf_pool", NB_MBUF, 32,
                                                            ^~~~~~~
../examples/l2fwd-keepalive/main.c:585:60: note: each undeclared identifier is reported only once for each function it appears in
../examples/l2fwd-keepalive/main.c:552:15: error: unused variable ‘total_nb_mbufs’ [-Werror=unused-variable]
  unsigned int total_nb_mbufs;
               ^~~~~~~~~~~~~~
cc1: all warnings being treated as errors
[2038/2139] Compiling C object 'examples/c590b3c@@dpdk-l2fwd-keepalive at exe/l2fwd-keepalive_shm.c.o'.
[2039/2139] Compiling C object 'examples/c590b3c@@dpdk-l2fwd-event at exe/l2fwd-event_l2fwd_event_generic.c.o'.
--
[2044/2139] Compiling C object 'examples/c590b3c@@dpdk-l3fwd at exe/l3fwd_l3fwd_lpm.c.o'.
[2045/2139] Compiling C object 'examples/c590b3c@@dpdk-l2fwd-crypto at exe/l2fwd-crypto_main.c.o'.
[2046/2139] Compiling C object 'drivers/a715181@@tmp_rte_pmd_octeontx2_event at sta/event_octeontx2_otx2_worker.c.o'.
[2047/2139] Compiling C object 'drivers/a715181@@tmp_rte_pmd_octeontx2_event at sta/event_octeontx2_otx2_worker_dual.c.o'.
[2048/2139] Compiling C object 'app/test/3062f5d@@dpdk-test at exe/test_ring.c.o'.
ninja: build stopped: subcommand failed.
meson  --werror -Dexamples=l3fwd --buildtype=debugoptimized --default-library=static /root/UB1804-32_K4.15.0_GCC7.3.0/i686-native-linuxapp-gcc/7c5831e1495b41cb9ceccfa953f7852d/dpdk/devtools/.. ./build-clang-static
The Meson build system
Version: 0.50.0
Source dir: /root/UB1804-32_K4.15.0_GCC7.3.0/i686-native-linuxapp-gcc/7c5831e1495b41cb9ceccfa953f7852d/dpdk
Build dir: /root/UB1804-32_K4.15.0_GCC7.3.0/i686-native-linuxapp-gcc/7c5831e1495b41cb9ceccfa953f7852d/dpdk/build-clang-static
--
[2037/2139] Compiling C object 'examples/c590b3c@@dpdk-l2fwd-event at exe/l2fwd-event_l2fwd_event_internal_port.c.o'.
[2038/2139] Compiling C object 'examples/c590b3c@@dpdk-l2fwd-keepalive at exe/l2fwd-keepalive_shm.c.o'.
[2039/2139] Compiling C object 'examples/c590b3c@@dpdk-l3fwd at exe/l3fwd_l3fwd_event.c.o'.
[2040/2139] Compiling C object 'examples/c590b3c@@dpdk-l2fwd-event at exe/l2fwd-event_l2fwd_event.c.o'.
[2041/2139] Compiling C object 'examples/c590b3c@@dpdk-l2fwd-keepalive at exe/l2fwd-keepalive_main.c.o'.
FAILED: examples/c590b3c@@dpdk-l2fwd-keepalive at exe/l2fwd-keepalive_main.c.o 
clang -Iexamples/c590b3c@@dpdk-l2fwd-keepalive at exe -Iexamples -I../examples -Iexamples/l2fwd-keepalive -I../examples/l2fwd-keepalive -I. -I../ -Iconfig -I../config -Ilib/librte_eal/include -I../lib/librte_eal/include -Ilib/librte_eal/linux/include -I../lib/librte_eal/linux/include -Ilib/librte_eal/x86/include -I../lib/librte_eal/x86/include -Ilib/librte_eal/common -I../lib/librte_eal/common -Ilib/librte_eal -I../lib/librte_eal -Ilib/librte_kvargs -I../lib/librte_kvargs -Ilib/librte_telemetry/../librte_metrics -I../lib/librte_telemetry/../librte_metrics -Ilib/librte_telemetry -I../lib/librte_telemetry -Ilib/librte_mempool -I../lib/librte_mempool -Ilib/librte_ring -I../lib/librte_ring -Ilib/librte_net -I../lib/librte_net -Ilib/librte_mbuf -I../lib/librte_mbuf -Ilib/librte_ethdev -I../lib/librte_ethdev -Ilib/librte_meter -I../lib/librte_meter -Ilib/librte_cmdline -I../lib/librte_cmdline -Ilib/librte_timer -I../lib/librte_timer -Xclang -fcolor-diagnostics -pipe -D_FILE_OFFSET_BITS=64 -Wall -Winvalid-pch -Werror -O2 -g -include rte_config.h -Wextra -Wcast-qual -Wdeprecated -Wformat-nonliteral -Wformat-security -Wmissing-declarations -Wmissing-prototypes -Wnested-externs -Wold-style-definition -Wpointer-arith -Wsign-compare -Wstrict-prototypes -Wundef -Wwrite-strings -Wno-address-of-packed-member -Wno-missing-field-initializers -Wno-pointer-to-int-cast -D_GNU_SOURCE -m32 -march=native -DALLOW_EXPERIMENTAL_API -MD -MQ 'examples/c590b3c@@dpdk-l2fwd-keepalive at exe/l2fwd-keepalive_main.c.o' -MF 'examples/c590b3c@@dpdk-l2fwd-keepalive at exe/l2fwd-keepalive_main.c.o.d' -o 'examples/c590b3c@@dpdk-l2fwd-keepalive at exe/l2fwd-keepalive_main.c.o' -c ../examples/l2fwd-keepalive/main.c
../examples/l2fwd-keepalive/main.c:585:60: error: use of undeclared identifier 'NB_MBUF'
        l2fwd_pktmbuf_pool = rte_pktmbuf_pool_create("mbuf_pool", NB_MBUF, 32,
                                                                  ^
1 error generated.
[2042/2139] Compiling C object 'examples/c590b3c@@dpdk-l2fwd-event at exe/l2fwd-event_l2fwd_event_generic.c.o'.
[2043/2139] Compiling C object 'examples/c590b3c@@dpdk-l2fwd-jobstats at exe/l2fwd-jobstats_main.c.o'.
--
[2048/2139] Compiling C object 'examples/c590b3c@@dpdk-l3fwd at exe/l3fwd_l3fwd_em.c.o'.
[2049/2139] Compiling C object 'drivers/a715181@@tmp_rte_pmd_octeontx2_event at sta/event_octeontx2_otx2_worker.c.o'.
[2050/2139] Compiling C object 'drivers/a715181@@tmp_rte_pmd_octeontx2_event at sta/event_octeontx2_otx2_worker_dual.c.o'.
[2051/2139] Compiling C object 'app/test/3062f5d@@dpdk-test at exe/test_ring_perf.c.o'.
[2052/2139] Compiling C object 'app/test/3062f5d@@dpdk-test at exe/test_ring.c.o'.
ninja: build stopped: subcommand failed.
meson  --werror -Dexamples=all --buildtype=debugoptimized -Dlibdir=lib -Dmachine=nehalem --default-library=shared /root/UB1804-32_K4.15.0_GCC7.3.0/i686-native-linuxapp-gcc/7c5831e1495b41cb9ceccfa953f7852d/dpdk/devtools/.. ./build-x86-default
The Meson build system
Version: 0.50.0
Source dir: /root/UB1804-32_K4.15.0_GCC7.3.0/i686-native-linuxapp-gcc/7c5831e1495b41cb9ceccfa953f7852d/dpdk
Build dir: /root/UB1804-32_K4.15.0_GCC7.3.0/i686-native-linuxapp-gcc/7c5831e1495b41cb9ceccfa953f7852d/dpdk/build-x86-default
--
[2027/2143] Compiling C object 'examples/c590b3c@@dpdk-l2fwd-event at exe/l2fwd-event_l2fwd_poll.c.o'.
[2028/2143] Linking target examples/dpdk-ipsec-secgw.
[2029/2143] Compiling C object 'examples/c590b3c@@dpdk-l2fwd-event at exe/l2fwd-event_l2fwd_event_internal_port.c.o'.
[2030/2143] Compiling C object 'examples/c590b3c@@dpdk-ipv4_multicast at exe/ipv4_multicast_main.c.o'.
[2031/2143] Compiling C object 'examples/c590b3c@@dpdk-l2fwd-keepalive at exe/l2fwd-keepalive_main.c.o'.
FAILED: examples/c590b3c@@dpdk-l2fwd-keepalive at exe/l2fwd-keepalive_main.c.o 
cc -Iexamples/c590b3c@@dpdk-l2fwd-keepalive at exe -Iexamples -I../examples -Iexamples/l2fwd-keepalive -I../examples/l2fwd-keepalive -I. -I../ -Iconfig -I../config -Ilib/librte_eal/include -I../lib/librte_eal/include -Ilib/librte_eal/linux/include -I../lib/librte_eal/linux/include -Ilib/librte_eal/x86/include -I../lib/librte_eal/x86/include -Ilib/librte_eal/common -I../lib/librte_eal/common -Ilib/librte_eal -I../lib/librte_eal -Ilib/librte_kvargs -I../lib/librte_kvargs -Ilib/librte_telemetry/../librte_metrics -I../lib/librte_telemetry/../librte_metrics -Ilib/librte_telemetry -I../lib/librte_telemetry -Ilib/librte_mempool -I../lib/librte_mempool -Ilib/librte_ring -I../lib/librte_ring -Ilib/librte_net -I../lib/librte_net -Ilib/librte_mbuf -I../lib/librte_mbuf -Ilib/librte_ethdev -I../lib/librte_ethdev -Ilib/librte_meter -I../lib/librte_meter -Ilib/librte_cmdline -I../lib/librte_cmdline -Ilib/librte_timer -I../lib/librte_timer -fdiagnostics-color=always -pipe -D_FILE_OFFSET_BITS=64 -Wall -Winvalid-pch -Werror -O2 -g -include rte_config.h -Wextra -Wcast-qual -Wdeprecated -Wformat-nonliteral -Wformat-security -Wmissing-declarations -Wmissing-prototypes -Wnested-externs -Wold-style-definition -Wpointer-arith -Wsign-compare -Wstrict-prototypes -Wundef -Wwrite-strings -Wno-missing-field-initializers -Wno-pointer-to-int-cast -D_GNU_SOURCE -m32 -march=nehalem -Wno-format-truncation -DALLOW_EXPERIMENTAL_API -MD -MQ 'examples/c590b3c@@dpdk-l2fwd-keepalive at exe/l2fwd-keepalive_main.c.o' -MF 'examples/c590b3c@@dpdk-l2fwd-keepalive at exe/l2fwd-keepalive_main.c.o.d' -o 'examples/c590b3c@@dpdk-l2fwd-keepalive at exe/l2fwd-keepalive_main.c.o' -c ../examples/l2fwd-keepalive/main.c
../examples/l2fwd-keepalive/main.c: In function ‘main’:
../examples/l2fwd-keepalive/main.c:585:60: error: ‘NB_MBUF’ undeclared (first use in this function)
  l2fwd_pktmbuf_pool = rte_pktmbuf_pool_create("mbuf_pool", NB_MBUF, 32,
                                                            ^~~~~~~
../examples/l2fwd-keepalive/main.c:585:60: note: each undeclared identifier is reported only once for each function it appears in
../examples/l2fwd-keepalive/main.c:552:15: error: unused variable ‘total_nb_mbufs’ [-Werror=unused-variable]
  unsigned int total_nb_mbufs;
               ^~~~~~~~~~~~~~
cc1: all warnings being treated as errors
[2032/2143] Linking target examples/dpdk-ipv4_multicast.
[2033/2143] Compiling C object 'examples/c590b3c@@dpdk-l2fwd-event at exe/l2fwd-event_l2fwd_event_generic.c.o'.
--
[2038/2143] Compiling C object 'app/test/3062f5d@@dpdk-test at exe/test_memcpy_perf.c.o'.
[2039/2143] Compiling C object 'drivers/a715181@@tmp_rte_pmd_octeontx2_event at sta/event_octeontx2_otx2_worker.c.o'.
[2040/2143] Compiling C object 'drivers/a715181@@tmp_rte_pmd_octeontx2_event at sta/event_octeontx2_otx2_worker_dual.c.o'.
[2041/2143] Compiling C object 'lib/76b5a35@@rte_pipeline at sta/librte_pipeline_rte_table_action.c.o'.
[2042/2143] Compiling C object 'app/test/3062f5d@@dpdk-test at exe/test_ring.c.o'.
ninja: build stopped: subcommand failed.
DESTDIR=/root/UB1804-32_K4.15.0_GCC7.3.0/i686-native-linuxapp-gcc/7c5831e1495b41cb9ceccfa953f7852d/dpdk/build-x86-default/install ninja -C /root/UB1804-32_K4.15.0_GCC7.3.0/i686-native-linuxapp-gcc/7c5831e1495b41cb9ceccfa953f7852d/dpdk/build-x86-default install >/dev/null
find: ‘/root/UB1804-32_K4.15.0_GCC7.3.0/i686-native-linuxapp-gcc/7c5831e1495b41cb9ceccfa953f7852d/dpdk/build-x86-default/install’: No such file or directory
dirname: missing operand
Try 'dirname --help' for more information.


*Meson Build Failed #5:
OS: UB2004-64
Target:./build-gcc-static
[2276/2396] Linking target examples/dpdk-ipv4_multicast.
[2277/2396] Compiling C object 'examples/c590b3c@@dpdk-l3fwd at exe/l3fwd_l3fwd_event.c.o'.
[2278/2396] Compiling C object 'examples/c590b3c@@dpdk-l2fwd-keepalive at exe/l2fwd-keepalive_shm.c.o'.
[2279/2396] Compiling C object 'examples/c590b3c@@dpdk-l2fwd-event at exe/l2fwd-event_l2fwd_event.c.o'.
[2280/2396] Compiling C object 'examples/c590b3c@@dpdk-l2fwd-keepalive at exe/l2fwd-keepalive_main.c.o'.
FAILED: examples/c590b3c@@dpdk-l2fwd-keepalive at exe/l2fwd-keepalive_main.c.o 
gcc -Iexamples/c590b3c@@dpdk-l2fwd-keepalive at exe -Iexamples -I../examples -Iexamples/l2fwd-keepalive -I../examples/l2fwd-keepalive -I. -I../ -Iconfig -I../config -Ilib/librte_eal/include -I../lib/librte_eal/include -Ilib/librte_eal/linux/include -I../lib/librte_eal/linux/include -Ilib/librte_eal/x86/include -I../lib/librte_eal/x86/include -Ilib/librte_eal/common -I../lib/librte_eal/common -Ilib/librte_eal -I../lib/librte_eal -Ilib/librte_kvargs -I../lib/librte_kvargs -Ilib/librte_telemetry/../librte_metrics -I../lib/librte_telemetry/../librte_metrics -Ilib/librte_telemetry -I../lib/librte_telemetry -Ilib/librte_mempool -I../lib/librte_mempool -Ilib/librte_ring -I../lib/librte_ring -Ilib/librte_net -I../lib/librte_net -Ilib/librte_mbuf -I../lib/librte_mbuf -Ilib/librte_ethdev -I../lib/librte_ethdev -Ilib/librte_meter -I../lib/librte_meter -Ilib/librte_cmdline -I../lib/librte_cmdline -Ilib/librte_timer -I../lib/librte_timer -fdiagnostics-color=always -pipe -D_FILE_OFFSET_BITS=64 -Wall -Winvalid-pch -Werror -O2 -g -include rte_config.h -Wextra -Wcast-qual -Wdeprecated -Wformat-nonliteral -Wformat-security -Wmissing-declarations -Wmissing-prototypes -Wnested-externs -Wold-style-definition -Wpointer-arith -Wsign-compare -Wstrict-prototypes -Wundef -Wwrite-strings -Wno-address-of-packed-member -Wno-packed-not-aligned -Wno-missing-field-initializers -D_GNU_SOURCE -march=native -Wno-format-truncation -DALLOW_EXPERIMENTAL_API -MD -MQ 'examples/c590b3c@@dpdk-l2fwd-keepalive at exe/l2fwd-keepalive_main.c.o' -MF 'examples/c590b3c@@dpdk-l2fwd-keepalive at exe/l2fwd-keepalive_main.c.o.d' -o 'examples/c590b3c@@dpdk-l2fwd-keepalive at exe/l2fwd-keepalive_main.c.o' -c ../examples/l2fwd-keepalive/main.c
../examples/l2fwd-keepalive/main.c: In function ‘main’:
../examples/l2fwd-keepalive/main.c:585:60: error: ‘NB_MBUF’ undeclared (first use in this function)
  585 |  l2fwd_pktmbuf_pool = rte_pktmbuf_pool_create("mbuf_pool", NB_MBUF, 32,
      |                                                            ^~~~~~~
../examples/l2fwd-keepalive/main.c:585:60: note: each undeclared identifier is reported only once for each function it appears in
../examples/l2fwd-keepalive/main.c:552:15: error: unused variable ‘total_nb_mbufs’ [-Werror=unused-variable]
  552 |  unsigned int total_nb_mbufs;
      |               ^~~~~~~~~~~~~~
cc1: all warnings being treated as errors
[2281/2396] Compiling C object 'examples/c590b3c@@dpdk-l2fwd-event at exe/l2fwd-event_l2fwd_event_generic.c.o'.
[2282/2396] Compiling C object 'examples/c590b3c@@dpdk-l2fwd-jobstats at exe/l2fwd-jobstats_main.c.o'.
--
[2285/2396] Compiling C object 'examples/c590b3c@@dpdk-l3fwd at exe/l3fwd_l3fwd_em.c.o'.
[2286/2396] Compiling C object 'examples/c590b3c@@dpdk-l2fwd-crypto at exe/l2fwd-crypto_main.c.o'.
[2287/2396] Compiling C object 'drivers/a715181@@tmp_rte_pmd_octeontx2_event at sta/event_octeontx2_otx2_worker.c.o'.
[2288/2396] Compiling C object 'drivers/a715181@@tmp_rte_pmd_octeontx2_event at sta/event_octeontx2_otx2_worker_dual.c.o'.
[2289/2396] Compiling C object 'app/test/3062f5d@@dpdk-test at exe/test_ring.c.o'.
ninja: build stopped: subcommand failed.
meson  --werror -Dexamples=l3fwd --buildtype=debugoptimized --default-library=static /root/UB2004-64_K5.4.0_GCC9.3.0/x86_64-native-linuxapp-gcc/7c5831e1495b41cb9ceccfa953f7852d/dpdk/devtools/.. ./build-clang-static
The Meson build system
Version: 0.52.1
Source dir: /root/UB2004-64_K5.4.0_GCC9.3.0/x86_64-native-linuxapp-gcc/7c5831e1495b41cb9ceccfa953f7852d/dpdk
Build dir: /root/UB2004-64_K5.4.0_GCC9.3.0/x86_64-native-linuxapp-gcc/7c5831e1495b41cb9ceccfa953f7852d/dpdk/build-clang-static
--
[2285/2396] Linking target examples/dpdk-ipv4_multicast.
[2286/2396] Compiling C object 'examples/c590b3c@@dpdk-l2fwd-keepalive at exe/l2fwd-keepalive_shm.c.o'.
[2287/2396] Compiling C object 'examples/c590b3c@@dpdk-l2fwd-event at exe/l2fwd-event_l2fwd_event.c.o'.
[2288/2396] Compiling C object 'examples/c590b3c@@dpdk-l3fwd at exe/l3fwd_l3fwd_event.c.o'.
[2289/2396] Compiling C object 'examples/c590b3c@@dpdk-l2fwd-keepalive at exe/l2fwd-keepalive_main.c.o'.
FAILED: examples/c590b3c@@dpdk-l2fwd-keepalive at exe/l2fwd-keepalive_main.c.o 
clang -Iexamples/c590b3c@@dpdk-l2fwd-keepalive at exe -Iexamples -I../examples -Iexamples/l2fwd-keepalive -I../examples/l2fwd-keepalive -I. -I../ -Iconfig -I../config -Ilib/librte_eal/include -I../lib/librte_eal/include -Ilib/librte_eal/linux/include -I../lib/librte_eal/linux/include -Ilib/librte_eal/x86/include -I../lib/librte_eal/x86/include -Ilib/librte_eal/common -I../lib/librte_eal/common -Ilib/librte_eal -I../lib/librte_eal -Ilib/librte_kvargs -I../lib/librte_kvargs -Ilib/librte_telemetry/../librte_metrics -I../lib/librte_telemetry/../librte_metrics -Ilib/librte_telemetry -I../lib/librte_telemetry -Ilib/librte_mempool -I../lib/librte_mempool -Ilib/librte_ring -I../lib/librte_ring -Ilib/librte_net -I../lib/librte_net -Ilib/librte_mbuf -I../lib/librte_mbuf -Ilib/librte_ethdev -I../lib/librte_ethdev -Ilib/librte_meter -I../lib/librte_meter -Ilib/librte_cmdline -I../lib/librte_cmdline -Ilib/librte_timer -I../lib/librte_timer -Xclang -fcolor-diagnostics -pipe -D_FILE_OFFSET_BITS=64 -Wall -Winvalid-pch -Werror -O2 -g -include rte_config.h -Wextra -Wcast-qual -Wdeprecated -Wformat-nonliteral -Wformat-security -Wmissing-declarations -Wmissing-prototypes -Wnested-externs -Wold-style-definition -Wpointer-arith -Wsign-compare -Wstrict-prototypes -Wundef -Wwrite-strings -Wno-address-of-packed-member -Wno-missing-field-initializers -D_GNU_SOURCE -march=native -DALLOW_EXPERIMENTAL_API -MD -MQ 'examples/c590b3c@@dpdk-l2fwd-keepalive at exe/l2fwd-keepalive_main.c.o' -MF 'examples/c590b3c@@dpdk-l2fwd-keepalive at exe/l2fwd-keepalive_main.c.o.d' -o 'examples/c590b3c@@dpdk-l2fwd-keepalive at exe/l2fwd-keepalive_main.c.o' -c ../examples/l2fwd-keepalive/main.c
../examples/l2fwd-keepalive/main.c:585:60: error: use of undeclared identifier 'NB_MBUF'
        l2fwd_pktmbuf_pool = rte_pktmbuf_pool_create("mbuf_pool", NB_MBUF, 32,
                                                                  ^
1 error generated.
[2290/2396] Compiling C object 'examples/c590b3c@@dpdk-l2fwd-event at exe/l2fwd-event_l2fwd_event_generic.c.o'.
[2291/2396] Compiling C object 'examples/c590b3c@@dpdk-l3fwd at exe/l3fwd_l3fwd_event_generic.c.o'.
--
[2294/2396] Compiling C object 'examples/c590b3c@@dpdk-l3fwd at exe/l3fwd_l3fwd_lpm.c.o'.
[2295/2396] Compiling C object 'examples/c590b3c@@dpdk-l3fwd at exe/l3fwd_l3fwd_em.c.o'.
[2296/2396] Compiling C object 'examples/c590b3c@@dpdk-l2fwd-crypto at exe/l2fwd-crypto_main.c.o'.
[2297/2396] Compiling C object 'app/test/3062f5d@@dpdk-test at exe/test_ring_perf.c.o'.
[2298/2396] Compiling C object 'app/test/3062f5d@@dpdk-test at exe/test_ring.c.o'.
ninja: build stopped: subcommand failed.
meson  --werror -Dexamples=all --buildtype=debugoptimized -Dlibdir=lib -Dmachine=nehalem --default-library=shared /root/UB2004-64_K5.4.0_GCC9.3.0/x86_64-native-linuxapp-gcc/7c5831e1495b41cb9ceccfa953f7852d/dpdk/devtools/.. ./build-x86-default
The Meson build system
Version: 0.52.1
Source dir: /root/UB2004-64_K5.4.0_GCC9.3.0/x86_64-native-linuxapp-gcc/7c5831e1495b41cb9ceccfa953f7852d/dpdk
Build dir: /root/UB2004-64_K5.4.0_GCC9.3.0/x86_64-native-linuxapp-gcc/7c5831e1495b41cb9ceccfa953f7852d/dpdk/build-x86-default
--
[2281/2401] Compiling C object 'examples/c590b3c@@dpdk-l2fwd-event at exe/l2fwd-event_l2fwd_event_internal_port.c.o'.
[2282/2401] Compiling C object 'examples/c590b3c@@dpdk-l3fwd at exe/l3fwd_l3fwd_event.c.o'.
[2283/2401] Compiling C object 'examples/c590b3c@@dpdk-l2fwd-event at exe/l2fwd-event_l2fwd_event_generic.c.o'.
[2284/2401] Compiling C object 'examples/c590b3c@@dpdk-l2fwd-keepalive at exe/l2fwd-keepalive_shm.c.o'.
[2285/2401] Compiling C object 'examples/c590b3c@@dpdk-l2fwd-keepalive at exe/l2fwd-keepalive_main.c.o'.
FAILED: examples/c590b3c@@dpdk-l2fwd-keepalive at exe/l2fwd-keepalive_main.c.o 
cc -Iexamples/c590b3c@@dpdk-l2fwd-keepalive at exe -Iexamples -I../examples -Iexamples/l2fwd-keepalive -I../examples/l2fwd-keepalive -I. -I../ -Iconfig -I../config -Ilib/librte_eal/include -I../lib/librte_eal/include -Ilib/librte_eal/linux/include -I../lib/librte_eal/linux/include -Ilib/librte_eal/x86/include -I../lib/librte_eal/x86/include -Ilib/librte_eal/common -I../lib/librte_eal/common -Ilib/librte_eal -I../lib/librte_eal -Ilib/librte_kvargs -I../lib/librte_kvargs -Ilib/librte_telemetry/../librte_metrics -I../lib/librte_telemetry/../librte_metrics -Ilib/librte_telemetry -I../lib/librte_telemetry -Ilib/librte_mempool -I../lib/librte_mempool -Ilib/librte_ring -I../lib/librte_ring -Ilib/librte_net -I../lib/librte_net -Ilib/librte_mbuf -I../lib/librte_mbuf -Ilib/librte_ethdev -I../lib/librte_ethdev -Ilib/librte_meter -I../lib/librte_meter -Ilib/librte_cmdline -I../lib/librte_cmdline -Ilib/librte_timer -I../lib/librte_timer -fdiagnostics-color=always -pipe -D_FILE_OFFSET_BITS=64 -Wall -Winvalid-pch -Werror -O2 -g -include rte_config.h -Wextra -Wcast-qual -Wdeprecated -Wformat-nonliteral -Wformat-security -Wmissing-declarations -Wmissing-prototypes -Wnested-externs -Wold-style-definition -Wpointer-arith -Wsign-compare -Wstrict-prototypes -Wundef -Wwrite-strings -Wno-address-of-packed-member -Wno-packed-not-aligned -Wno-missing-field-initializers -D_GNU_SOURCE -march=nehalem -Wno-format-truncation -DALLOW_EXPERIMENTAL_API -MD -MQ 'examples/c590b3c@@dpdk-l2fwd-keepalive at exe/l2fwd-keepalive_main.c.o' -MF 'examples/c590b3c@@dpdk-l2fwd-keepalive at exe/l2fwd-keepalive_main.c.o.d' -o 'examples/c590b3c@@dpdk-l2fwd-keepalive at exe/l2fwd-keepalive_main.c.o' -c ../examples/l2fwd-keepalive/main.c
../examples/l2fwd-keepalive/main.c: In function ‘main’:
../examples/l2fwd-keepalive/main.c:585:60: error: ‘NB_MBUF’ undeclared (first use in this function)
  585 |  l2fwd_pktmbuf_pool = rte_pktmbuf_pool_create("mbuf_pool", NB_MBUF, 32,
      |                                                            ^~~~~~~
../examples/l2fwd-keepalive/main.c:585:60: note: each undeclared identifier is reported only once for each function it appears in
../examples/l2fwd-keepalive/main.c:552:15: error: unused variable ‘total_nb_mbufs’ [-Werror=unused-variable]
  552 |  unsigned int total_nb_mbufs;
      |               ^~~~~~~~~~~~~~
cc1: all warnings being treated as errors
[2286/2401] Compiling C object 'examples/c590b3c@@dpdk-l2fwd-event at exe/l2fwd-event_l2fwd_event.c.o'.
[2287/2401] Compiling C object 'examples/c590b3c@@dpdk-l2fwd-jobstats at exe/l2fwd-jobstats_main.c.o'.
--
[2290/2401] Compiling C object 'examples/c590b3c@@dpdk-l3fwd at exe/l3fwd_l3fwd_em.c.o'.
[2291/2401] Compiling C object 'drivers/a715181@@tmp_rte_pmd_octeontx2_event at sta/event_octeontx2_otx2_worker_dual.c.o'.
[2292/2401] Compiling C object 'examples/c590b3c@@dpdk-l2fwd-crypto at exe/l2fwd-crypto_main.c.o'.
[2293/2401] Compiling C object 'app/test/3062f5d@@dpdk-test at exe/test_memcpy_perf.c.o'.
[2294/2401] Compiling C object 'app/test/3062f5d@@dpdk-test at exe/test_ring.c.o'.
ninja: build stopped: subcommand failed.
DESTDIR=/root/UB2004-64_K5.4.0_GCC9.3.0/x86_64-native-linuxapp-gcc/7c5831e1495b41cb9ceccfa953f7852d/dpdk/build-x86-default/install ninja -C /root/UB2004-64_K5.4.0_GCC9.3.0/x86_64-native-linuxapp-gcc/7c5831e1495b41cb9ceccfa953f7852d/dpdk/build-x86-default install >/dev/null
find: ‘/root/UB2004-64_K5.4.0_GCC9.3.0/x86_64-native-linuxapp-gcc/7c5831e1495b41cb9ceccfa953f7852d/dpdk/build-x86-default/install’: No such file or directory
dirname: missing operand
Try 'dirname --help' for more information.


*Meson Build Failed #6:
OS: SUSE15-64
Target:./build-gcc-static
[2184/2308] Compiling C object 'examples/c590b3c@@dpdk-l2fwd-event at exe/l2fwd-event_l2fwd_event_internal_port.c.o'.
[2185/2308] Compiling C object 'examples/c590b3c@@dpdk-l2fwd-event at exe/l2fwd-event_l2fwd_event_generic.c.o'.
[2186/2308] Compiling C object 'examples/c590b3c@@dpdk-ipv4_multicast at exe/ipv4_multicast_main.c.o'.
[2187/2308] Compiling C object 'examples/c590b3c@@dpdk-l3fwd at exe/l3fwd_l3fwd_event.c.o'.
[2188/2308] Compiling C object 'examples/c590b3c@@dpdk-l2fwd-keepalive at exe/l2fwd-keepalive_main.c.o'.
FAILED: examples/c590b3c@@dpdk-l2fwd-keepalive at exe/l2fwd-keepalive_main.c.o 
gcc -Iexamples/c590b3c@@dpdk-l2fwd-keepalive at exe -Iexamples -I../examples -Iexamples/l2fwd-keepalive -I../examples/l2fwd-keepalive -I. -I../ -Iconfig -I../config -Ilib/librte_eal/include -I../lib/librte_eal/include -Ilib/librte_eal/linux/include -I../lib/librte_eal/linux/include -Ilib/librte_eal/x86/include -I../lib/librte_eal/x86/include -Ilib/librte_eal/common -I../lib/librte_eal/common -Ilib/librte_eal -I../lib/librte_eal -Ilib/librte_kvargs -I../lib/librte_kvargs -Ilib/librte_telemetry/../librte_metrics -I../lib/librte_telemetry/../librte_metrics -Ilib/librte_telemetry -I../lib/librte_telemetry -Ilib/librte_mempool -I../lib/librte_mempool -Ilib/librte_ring -I../lib/librte_ring -Ilib/librte_net -I../lib/librte_net -Ilib/librte_mbuf -I../lib/librte_mbuf -Ilib/librte_ethdev -I../lib/librte_ethdev -Ilib/librte_meter -I../lib/librte_meter -Ilib/librte_cmdline -I../lib/librte_cmdline -Ilib/librte_timer -I../lib/librte_timer -fdiagnostics-color=always -pipe -D_FILE_OFFSET_BITS=64 -Wall -Winvalid-pch -Werror -O2 -g -include rte_config.h -Wextra -Wcast-qual -Wdeprecated -Wformat-nonliteral -Wformat-security -Wmissing-declarations -Wmissing-prototypes -Wnested-externs -Wold-style-definition -Wpointer-arith -Wsign-compare -Wstrict-prototypes -Wundef -Wwrite-strings -Wno-missing-field-initializers -D_GNU_SOURCE -march=native -Wno-format-truncation -DALLOW_EXPERIMENTAL_API -MD -MQ 'examples/c590b3c@@dpdk-l2fwd-keepalive at exe/l2fwd-keepalive_main.c.o' -MF 'examples/c590b3c@@dpdk-l2fwd-keepalive at exe/l2fwd-keepalive_main.c.o.d' -o 'examples/c590b3c@@dpdk-l2fwd-keepalive at exe/l2fwd-keepalive_main.c.o' -c ../examples/l2fwd-keepalive/main.c
../examples/l2fwd-keepalive/main.c: In function ‘main’:
../examples/l2fwd-keepalive/main.c:585:60: error: ‘NB_MBUF’ undeclared (first use in this function)
  l2fwd_pktmbuf_pool = rte_pktmbuf_pool_create("mbuf_pool", NB_MBUF, 32,
                                                            ^~~~~~~
../examples/l2fwd-keepalive/main.c:585:60: note: each undeclared identifier is reported only once for each function it appears in
../examples/l2fwd-keepalive/main.c:552:15: error: unused variable ‘total_nb_mbufs’ [-Werror=unused-variable]
  unsigned int total_nb_mbufs;
               ^~~~~~~~~~~~~~
cc1: all warnings being treated as errors
[2189/2308] Compiling C object 'examples/c590b3c@@dpdk-l2fwd-event at exe/l2fwd-event_l2fwd_event.c.o'.
[2190/2308] Linking target examples/dpdk-ipv4_multicast.
--
[2193/2308] Compiling C object 'examples/c590b3c@@dpdk-l2fwd-jobstats at exe/l2fwd-jobstats_main.c.o'.
[2194/2308] Compiling C object 'examples/c590b3c@@dpdk-l2fwd-crypto at exe/l2fwd-crypto_main.c.o'.
[2195/2308] Compiling C object 'drivers/a715181@@tmp_rte_pmd_octeontx2_event at sta/event_octeontx2_otx2_worker.c.o'.
[2196/2308] Compiling C object 'drivers/a715181@@tmp_rte_pmd_octeontx2_event at sta/event_octeontx2_otx2_worker_dual.c.o'.
[2197/2308] Compiling C object 'app/test/3062f5d@@dpdk-test at exe/test_ring.c.o'.
ninja: build stopped: subcommand failed.
meson  --werror -Dexamples=l3fwd --buildtype=debugoptimized --default-library=static /root/SUSE15-64_K4.12.14_GCC7.3.1/x86_64-native-linuxapp-gcc/7c5831e1495b41cb9ceccfa953f7852d/dpdk/devtools/.. ./build-clang-static
The Meson build system
Version: 0.50.1
Source dir: /root/SUSE15-64_K4.12.14_GCC7.3.1/x86_64-native-linuxapp-gcc/7c5831e1495b41cb9ceccfa953f7852d/dpdk
Build dir: /root/SUSE15-64_K4.12.14_GCC7.3.1/x86_64-native-linuxapp-gcc/7c5831e1495b41cb9ceccfa953f7852d/dpdk/build-clang-static
--
[2196/2308] Compiling C object 'examples/c590b3c@@dpdk-l2fwd-keepalive at exe/l2fwd-keepalive_shm.c.o'.
[2197/2308] Compiling C object 'examples/c590b3c@@dpdk-l2fwd-event at exe/l2fwd-event_l2fwd_common.c.o'.
[2198/2308] Compiling C object 'examples/c590b3c@@dpdk-l2fwd-event at exe/l2fwd-event_l2fwd_event.c.o'.
[2199/2308] Compiling C object 'examples/c590b3c@@dpdk-l3fwd at exe/l3fwd_l3fwd_event.c.o'.
[2200/2308] Compiling C object 'examples/c590b3c@@dpdk-l2fwd-keepalive at exe/l2fwd-keepalive_main.c.o'.
FAILED: examples/c590b3c@@dpdk-l2fwd-keepalive at exe/l2fwd-keepalive_main.c.o 
clang -Iexamples/c590b3c@@dpdk-l2fwd-keepalive at exe -Iexamples -I../examples -Iexamples/l2fwd-keepalive -I../examples/l2fwd-keepalive -I. -I../ -Iconfig -I../config -Ilib/librte_eal/include -I../lib/librte_eal/include -Ilib/librte_eal/linux/include -I../lib/librte_eal/linux/include -Ilib/librte_eal/x86/include -I../lib/librte_eal/x86/include -Ilib/librte_eal/common -I../lib/librte_eal/common -Ilib/librte_eal -I../lib/librte_eal -Ilib/librte_kvargs -I../lib/librte_kvargs -Ilib/librte_telemetry/../librte_metrics -I../lib/librte_telemetry/../librte_metrics -Ilib/librte_telemetry -I../lib/librte_telemetry -Ilib/librte_mempool -I../lib/librte_mempool -Ilib/librte_ring -I../lib/librte_ring -Ilib/librte_net -I../lib/librte_net -Ilib/librte_mbuf -I../lib/librte_mbuf -Ilib/librte_ethdev -I../lib/librte_ethdev -Ilib/librte_meter -I../lib/librte_meter -Ilib/librte_cmdline -I../lib/librte_cmdline -Ilib/librte_timer -I../lib/librte_timer -Xclang -fcolor-diagnostics -pipe -D_FILE_OFFSET_BITS=64 -Wall -Winvalid-pch -Werror -O2 -g -include rte_config.h -Wextra -Wcast-qual -Wdeprecated -Wformat-nonliteral -Wformat-security -Wmissing-declarations -Wmissing-prototypes -Wnested-externs -Wold-style-definition -Wpointer-arith -Wsign-compare -Wstrict-prototypes -Wundef -Wwrite-strings -Wno-address-of-packed-member -Wno-missing-field-initializers -D_GNU_SOURCE -march=native -DALLOW_EXPERIMENTAL_API -MD -MQ 'examples/c590b3c@@dpdk-l2fwd-keepalive at exe/l2fwd-keepalive_main.c.o' -MF 'examples/c590b3c@@dpdk-l2fwd-keepalive at exe/l2fwd-keepalive_main.c.o.d' -o 'examples/c590b3c@@dpdk-l2fwd-keepalive at exe/l2fwd-keepalive_main.c.o' -c ../examples/l2fwd-keepalive/main.c
../examples/l2fwd-keepalive/main.c:585:60: error: use of undeclared identifier 'NB_MBUF'
        l2fwd_pktmbuf_pool = rte_pktmbuf_pool_create("mbuf_pool", NB_MBUF, 32,
                                                                  ^
1 error generated.
[2201/2308] Compiling C object 'examples/c590b3c@@dpdk-l2fwd-event at exe/l2fwd-event_l2fwd_event_generic.c.o'.
[2202/2308] Compiling C object 'examples/c590b3c@@dpdk-l2fwd-jobstats at exe/l2fwd-jobstats_main.c.o'.
--
[2205/2308] Compiling C object 'examples/c590b3c@@dpdk-l3fwd at exe/l3fwd_l3fwd_lpm.c.o'.
[2206/2308] Compiling C object 'examples/c590b3c@@dpdk-l2fwd-crypto at exe/l2fwd-crypto_main.c.o'.
[2207/2308] Compiling C object 'examples/c590b3c@@dpdk-l3fwd at exe/l3fwd_l3fwd_em.c.o'.
[2208/2308] Compiling C object 'app/test/3062f5d@@dpdk-test at exe/test_ring_perf.c.o'.
[2209/2308] Compiling C object 'app/test/3062f5d@@dpdk-test at exe/test_ring.c.o'.
ninja: build stopped: subcommand failed.
meson  --werror -Dexamples=all --buildtype=debugoptimized -Dlibdir=lib -Dmachine=nehalem --default-library=shared /root/SUSE15-64_K4.12.14_GCC7.3.1/x86_64-native-linuxapp-gcc/7c5831e1495b41cb9ceccfa953f7852d/dpdk/devtools/.. ./build-x86-default
The Meson build system
Version: 0.50.1
Source dir: /root/SUSE15-64_K4.12.14_GCC7.3.1/x86_64-native-linuxapp-gcc/7c5831e1495b41cb9ceccfa953f7852d/dpdk
Build dir: /root/SUSE15-64_K4.12.14_GCC7.3.1/x86_64-native-linuxapp-gcc/7c5831e1495b41cb9ceccfa953f7852d/dpdk/build-x86-default
--
[2194/2313] Linking static target drivers/librte_pmd_octeontx2_event.a.
[2195/2313] Compiling C object 'drivers/a715181@@rte_pmd_octeontx2_event at sha/meson-generated_.._rte_pmd_octeontx2_event.pmd.c.o'.
[2196/2313] Compiling C object 'examples/c590b3c@@dpdk-l2fwd-event at exe/l2fwd-event_l2fwd_event_generic.c.o'.
[2197/2313] Compiling C object 'examples/c590b3c@@dpdk-l3fwd at exe/l3fwd_l3fwd_event.c.o'.
[2198/2313] Compiling C object 'examples/c590b3c@@dpdk-l2fwd-keepalive at exe/l2fwd-keepalive_main.c.o'.
FAILED: examples/c590b3c@@dpdk-l2fwd-keepalive at exe/l2fwd-keepalive_main.c.o 
cc -Iexamples/c590b3c@@dpdk-l2fwd-keepalive at exe -Iexamples -I../examples -Iexamples/l2fwd-keepalive -I../examples/l2fwd-keepalive -I. -I../ -Iconfig -I../config -Ilib/librte_eal/include -I../lib/librte_eal/include -Ilib/librte_eal/linux/include -I../lib/librte_eal/linux/include -Ilib/librte_eal/x86/include -I../lib/librte_eal/x86/include -Ilib/librte_eal/common -I../lib/librte_eal/common -Ilib/librte_eal -I../lib/librte_eal -Ilib/librte_kvargs -I../lib/librte_kvargs -Ilib/librte_telemetry/../librte_metrics -I../lib/librte_telemetry/../librte_metrics -Ilib/librte_telemetry -I../lib/librte_telemetry -Ilib/librte_mempool -I../lib/librte_mempool -Ilib/librte_ring -I../lib/librte_ring -Ilib/librte_net -I../lib/librte_net -Ilib/librte_mbuf -I../lib/librte_mbuf -Ilib/librte_ethdev -I../lib/librte_ethdev -Ilib/librte_meter -I../lib/librte_meter -Ilib/librte_cmdline -I../lib/librte_cmdline -Ilib/librte_timer -I../lib/librte_timer -fdiagnostics-color=always -pipe -D_FILE_OFFSET_BITS=64 -Wall -Winvalid-pch -Werror -O2 -g -include rte_config.h -Wextra -Wcast-qual -Wdeprecated -Wformat-nonliteral -Wformat-security -Wmissing-declarations -Wmissing-prototypes -Wnested-externs -Wold-style-definition -Wpointer-arith -Wsign-compare -Wstrict-prototypes -Wundef -Wwrite-strings -Wno-missing-field-initializers -D_GNU_SOURCE -march=nehalem -Wno-format-truncation -DALLOW_EXPERIMENTAL_API -MD -MQ 'examples/c590b3c@@dpdk-l2fwd-keepalive at exe/l2fwd-keepalive_main.c.o' -MF 'examples/c590b3c@@dpdk-l2fwd-keepalive at exe/l2fwd-keepalive_main.c.o.d' -o 'examples/c590b3c@@dpdk-l2fwd-keepalive at exe/l2fwd-keepalive_main.c.o' -c ../examples/l2fwd-keepalive/main.c
../examples/l2fwd-keepalive/main.c: In function ‘main’:
../examples/l2fwd-keepalive/main.c:585:60: error: ‘NB_MBUF’ undeclared (first use in this function)
  l2fwd_pktmbuf_pool = rte_pktmbuf_pool_create("mbuf_pool", NB_MBUF, 32,
                                                            ^~~~~~~
../examples/l2fwd-keepalive/main.c:585:60: note: each undeclared identifier is reported only once for each function it appears in
../examples/l2fwd-keepalive/main.c:552:15: error: unused variable ‘total_nb_mbufs’ [-Werror=unused-variable]
  unsigned int total_nb_mbufs;
               ^~~~~~~~~~~~~~
cc1: all warnings being treated as errors
[2199/2313] Compiling C object 'examples/c590b3c@@dpdk-l2fwd-event at exe/l2fwd-event_l2fwd_event.c.o'.
[2200/2313] Compiling C object 'examples/c590b3c@@dpdk-l2fwd-keepalive at exe/l2fwd-keepalive_shm.c.o'.
--
[2203/2313] Generating rte_pmd_octeontx2_event.sym_chk with a meson_exe.py custom command.
[2204/2313] Compiling C object 'examples/c590b3c@@dpdk-l2fwd-jobstats at exe/l2fwd-jobstats_main.c.o'.
[2205/2313] Compiling C object 'examples/c590b3c@@dpdk-l2fwd-crypto at exe/l2fwd-crypto_main.c.o'.
[2206/2313] Compiling C object 'app/test/3062f5d@@dpdk-test at exe/test_memcpy_perf.c.o'.
[2207/2313] Compiling C object 'app/test/3062f5d@@dpdk-test at exe/test_ring.c.o'.
ninja: build stopped: subcommand failed.
DESTDIR=/root/SUSE15-64_K4.12.14_GCC7.3.1/x86_64-native-linuxapp-gcc/7c5831e1495b41cb9ceccfa953f7852d/dpdk/build-x86-default/install ninja -C /root/SUSE15-64_K4.12.14_GCC7.3.1/x86_64-native-linuxapp-gcc/7c5831e1495b41cb9ceccfa953f7852d/dpdk/build-x86-default install >/dev/null
find: ‘/root/SUSE15-64_K4.12.14_GCC7.3.1/x86_64-native-linuxapp-gcc/7c5831e1495b41cb9ceccfa953f7852d/dpdk/build-x86-default/install’: No such file or directory
dirname: missing operand
Try 'dirname --help' for more information.


*Meson Build Failed #7:
OS: FreeBSD1201-64
Target:./build-gcc-static
[1696/1795] Compiling C object 'examples/c590b3c@@dpdk-l2fwd-keepalive at exe/l2fwd-keepalive_shm.c.o'
[1697/1795] Compiling C object 'examples/c590b3c@@dpdk-l2fwd-event at exe/l2fwd-event_l2fwd_event.c.o'
[1698/1795] Compiling C object 'examples/c590b3c@@dpdk-l2fwd-event at exe/l2fwd-event_l2fwd_event_generic.c.o'
[1699/1795] Linking target examples/dpdk-l2fwd-event
[1700/1795] Compiling C object 'examples/c590b3c@@dpdk-l2fwd-keepalive at exe/l2fwd-keepalive_main.c.o'
FAILED: examples/c590b3c@@dpdk-l2fwd-keepalive at exe/l2fwd-keepalive_main.c.o 
gcc -Iexamples/c590b3c@@dpdk-l2fwd-keepalive at exe -Iexamples -I../examples -Iexamples/l2fwd-keepalive -I../examples/l2fwd-keepalive -I. -I.. -Iconfig -I../config -Ilib/librte_eal/include -I../lib/librte_eal/include -Ilib/librte_eal/freebsd/include -I../lib/librte_eal/freebsd/include -Ilib/librte_eal/x86/include -I../lib/librte_eal/x86/include -Ilib/librte_eal/common -I../lib/librte_eal/common -Ilib/librte_eal -I../lib/librte_eal -Ilib/librte_kvargs -I../lib/librte_kvargs -Ilib/librte_metrics -I../lib/librte_metrics -Ilib/librte_telemetry -I../lib/librte_telemetry -Ilib/librte_mempool -I../lib/librte_mempool -Ilib/librte_ring -I../lib/librte_ring -Ilib/librte_net -I../lib/librte_net -Ilib/librte_mbuf -I../lib/librte_mbuf -Ilib/librte_ethdev -I../lib/librte_ethdev -Ilib/librte_meter -I../lib/librte_meter -Ilib/librte_cmdline -I../lib/librte_cmdline -Ilib/librte_timer -I../lib/librte_timer -fdiagnostics-color=always -pipe -D_FILE_OFFSET_BITS=64 -Wall -Winvalid-pch -Werror -O2 -g -include rte_config.h -Wextra -Wcast-qual -Wdeprecated -Wformat-nonliteral -Wformat-security -Wmissing-declarations -Wmissing-prototypes -Wnested-externs -Wold-style-definition -Wpointer-arith -Wsign-compare -Wstrict-prototypes -Wundef -Wwrite-strings -Wno-address-of-packed-member -Wno-packed-not-aligned -Wno-missing-field-initializers -D_GNU_SOURCE -D__BSD_VISIBLE -march=native -Wno-format-truncation -DALLOW_EXPERIMENTAL_API -MD -MQ 'examples/c590b3c@@dpdk-l2fwd-keepalive at exe/l2fwd-keepalive_main.c.o' -MF 'examples/c590b3c@@dpdk-l2fwd-keepalive at exe/l2fwd-keepalive_main.c.o.d' -o 'examples/c590b3c@@dpdk-l2fwd-keepalive at exe/l2fwd-keepalive_main.c.o' -c ../examples/l2fwd-keepalive/main.c
../examples/l2fwd-keepalive/main.c: In function 'main':
../examples/l2fwd-keepalive/main.c:585:60: error: 'NB_MBUF' undeclared (first use in this function)
  585 |  l2fwd_pktmbuf_pool = rte_pktmbuf_pool_create("mbuf_pool", NB_MBUF, 32,
      |                                                            ^~~~~~~
../examples/l2fwd-keepalive/main.c:585:60: note: each undeclared identifier is reported only once for each function it appears in
../examples/l2fwd-keepalive/main.c:552:15: error: unused variable 'total_nb_mbufs' [-Werror=unused-variable]
  552 |  unsigned int total_nb_mbufs;
      |               ^~~~~~~~~~~~~~
cc1: all warnings being treated as errors
[1701/1795] Compiling C object 'examples/c590b3c@@dpdk-l3fwd at exe/l3fwd_l3fwd_event.c.o'
[1702/1795] Compiling C object 'examples/c590b3c@@dpdk-l2fwd-jobstats at exe/l2fwd-jobstats_main.c.o'
--
[1705/1795] Compiling C object 'examples/c590b3c@@dpdk-l3fwd at exe/l3fwd_l3fwd_lpm.c.o'
[1706/1795] Compiling C object 'examples/c590b3c@@dpdk-l2fwd-crypto at exe/l2fwd-crypto_main.c.o'
[1707/1795] Compiling C object 'drivers/a715181@@tmp_rte_pmd_octeontx2_event at sta/event_octeontx2_otx2_worker.c.o'
[1708/1795] Compiling C object 'drivers/a715181@@tmp_rte_pmd_octeontx2_event at sta/event_octeontx2_otx2_worker_dual.c.o'
[1709/1795] Compiling C object 'app/test/3062f5d@@dpdk-test at exe/test_ring.c.o'
ninja: build stopped: subcommand failed.
meson  --werror -Dexamples=l3fwd --buildtype=debugoptimized --default-library=static /root/FreeBSD1201-64_K12.1_GCC9.2.0/x86_64-native-bsdapp-gcc/7c5831e1495b41cb9ceccfa953f7852d/dpdk/devtools/.. ./build-clang-static
The Meson build system
Version: 0.54.0
Source dir: /root/FreeBSD1201-64_K12.1_GCC9.2.0/x86_64-native-bsdapp-gcc/7c5831e1495b41cb9ceccfa953f7852d/dpdk
Build dir: /root/FreeBSD1201-64_K12.1_GCC9.2.0/x86_64-native-bsdapp-gcc/7c5831e1495b41cb9ceccfa953f7852d/dpdk/build-clang-static
--
[1704/1795] Compiling C object 'examples/c590b3c@@dpdk-l2fwd-keepalive at exe/l2fwd-keepalive_shm.c.o'
[1705/1795] Compiling C object 'examples/c590b3c@@dpdk-l2fwd-event at exe/l2fwd-event_l2fwd_event.c.o'
[1706/1795] Compiling C object 'examples/c590b3c@@dpdk-l2fwd-event at exe/l2fwd-event_l2fwd_event_generic.c.o'
[1707/1795] Compiling C object 'examples/c590b3c@@dpdk-l2fwd-jobstats at exe/l2fwd-jobstats_main.c.o'
[1708/1795] Compiling C object 'examples/c590b3c@@dpdk-l2fwd-keepalive at exe/l2fwd-keepalive_main.c.o'
FAILED: examples/c590b3c@@dpdk-l2fwd-keepalive at exe/l2fwd-keepalive_main.c.o 
clang -Iexamples/c590b3c@@dpdk-l2fwd-keepalive at exe -Iexamples -I../examples -Iexamples/l2fwd-keepalive -I../examples/l2fwd-keepalive -I. -I.. -Iconfig -I../config -Ilib/librte_eal/include -I../lib/librte_eal/include -Ilib/librte_eal/freebsd/include -I../lib/librte_eal/freebsd/include -Ilib/librte_eal/x86/include -I../lib/librte_eal/x86/include -Ilib/librte_eal/common -I../lib/librte_eal/common -Ilib/librte_eal -I../lib/librte_eal -Ilib/librte_kvargs -I../lib/librte_kvargs -Ilib/librte_metrics -I../lib/librte_metrics -Ilib/librte_telemetry -I../lib/librte_telemetry -Ilib/librte_mempool -I../lib/librte_mempool -Ilib/librte_ring -I../lib/librte_ring -Ilib/librte_net -I../lib/librte_net -Ilib/librte_mbuf -I../lib/librte_mbuf -Ilib/librte_ethdev -I../lib/librte_ethdev -Ilib/librte_meter -I../lib/librte_meter -Ilib/librte_cmdline -I../lib/librte_cmdline -Ilib/librte_timer -I../lib/librte_timer -Xclang -fcolor-diagnostics -pipe -D_FILE_OFFSET_BITS=64 -Wall -Winvalid-pch -Werror -O2 -g -include rte_config.h -Wextra -Wcast-qual -Wdeprecated -Wformat-nonliteral -Wformat-security -Wmissing-declarations -Wmissing-prototypes -Wnested-externs -Wold-style-definition -Wpointer-arith -Wsign-compare -Wstrict-prototypes -Wundef -Wwrite-strings -Wno-address-of-packed-member -Wno-missing-field-initializers -D_GNU_SOURCE -D__BSD_VISIBLE -march=native -DALLOW_EXPERIMENTAL_API -MD -MQ 'examples/c590b3c@@dpdk-l2fwd-keepalive at exe/l2fwd-keepalive_main.c.o' -MF 'examples/c590b3c@@dpdk-l2fwd-keepalive at exe/l2fwd-keepalive_main.c.o.d' -o 'examples/c590b3c@@dpdk-l2fwd-keepalive at exe/l2fwd-keepalive_main.c.o' -c ../examples/l2fwd-keepalive/main.c
../examples/l2fwd-keepalive/main.c:585:60: error: use of undeclared identifier 'NB_MBUF'
        l2fwd_pktmbuf_pool = rte_pktmbuf_pool_create("mbuf_pool", NB_MBUF, 32,
                                                                  ^
1 error generated.
[1709/1795] Linking target examples/dpdk-l2fwd-event
[1710/1795] Linking target examples/dpdk-l2fwd-jobstats
--
[1713/1795] Compiling C object 'examples/c590b3c@@dpdk-l3fwd at exe/l3fwd_l3fwd_lpm.c.o'
[1714/1795] Compiling C object 'examples/c590b3c@@dpdk-l2fwd-crypto at exe/l2fwd-crypto_main.c.o'
[1715/1795] Compiling C object 'examples/c590b3c@@dpdk-l3fwd at exe/l3fwd_l3fwd_em.c.o'
[1716/1795] Compiling C object 'app/test/3062f5d@@dpdk-test at exe/test_ring_perf.c.o'
[1717/1795] Compiling C object 'app/test/3062f5d@@dpdk-test at exe/test_ring.c.o'
ninja: build stopped: subcommand failed.
meson  --werror -Dexamples=all --buildtype=debugoptimized -Dlibdir=lib -Dmachine=nehalem --default-library=shared /root/FreeBSD1201-64_K12.1_GCC9.2.0/x86_64-native-bsdapp-gcc/7c5831e1495b41cb9ceccfa953f7852d/dpdk/devtools/.. ./build-x86-default
The Meson build system
Version: 0.54.0
Source dir: /root/FreeBSD1201-64_K12.1_GCC9.2.0/x86_64-native-bsdapp-gcc/7c5831e1495b41cb9ceccfa953f7852d/dpdk
Build dir: /root/FreeBSD1201-64_K12.1_GCC9.2.0/x86_64-native-bsdapp-gcc/7c5831e1495b41cb9ceccfa953f7852d/dpdk/build-x86-default
--
[1697/1800] Linking target examples/dpdk-ipsec-secgw
[1698/1800] Compiling C object 'examples/c590b3c@@dpdk-l2fwd-event at exe/l2fwd-event_l2fwd_event_internal_port.c.o'
[1699/1800] Compiling C object 'examples/c590b3c@@dpdk-l2fwd-event at exe/l2fwd-event_l2fwd_event_generic.c.o'
[1700/1800] Compiling C object 'examples/c590b3c@@dpdk-l2fwd-event at exe/l2fwd-event_l2fwd_common.c.o'
[1701/1800] Compiling C object 'examples/c590b3c@@dpdk-l2fwd-keepalive at exe/l2fwd-keepalive_main.c.o'
FAILED: examples/c590b3c@@dpdk-l2fwd-keepalive at exe/l2fwd-keepalive_main.c.o 
cc -Iexamples/c590b3c@@dpdk-l2fwd-keepalive at exe -Iexamples -I../examples -Iexamples/l2fwd-keepalive -I../examples/l2fwd-keepalive -I. -I.. -Iconfig -I../config -Ilib/librte_eal/include -I../lib/librte_eal/include -Ilib/librte_eal/freebsd/include -I../lib/librte_eal/freebsd/include -Ilib/librte_eal/x86/include -I../lib/librte_eal/x86/include -Ilib/librte_eal/common -I../lib/librte_eal/common -Ilib/librte_eal -I../lib/librte_eal -Ilib/librte_kvargs -I../lib/librte_kvargs -Ilib/librte_metrics -I../lib/librte_metrics -Ilib/librte_telemetry -I../lib/librte_telemetry -Ilib/librte_mempool -I../lib/librte_mempool -Ilib/librte_ring -I../lib/librte_ring -Ilib/librte_net -I../lib/librte_net -Ilib/librte_mbuf -I../lib/librte_mbuf -Ilib/librte_ethdev -I../lib/librte_ethdev -Ilib/librte_meter -I../lib/librte_meter -Ilib/librte_cmdline -I../lib/librte_cmdline -Ilib/librte_timer -I../lib/librte_timer -Xclang -fcolor-diagnostics -pipe -D_FILE_OFFSET_BITS=64 -Wall -Winvalid-pch -Werror -O2 -g -include rte_config.h -Wextra -Wcast-qual -Wdeprecated -Wformat-nonliteral -Wformat-security -Wmissing-declarations -Wmissing-prototypes -Wnested-externs -Wold-style-definition -Wpointer-arith -Wsign-compare -Wstrict-prototypes -Wundef -Wwrite-strings -Wno-address-of-packed-member -Wno-missing-field-initializers -D_GNU_SOURCE -D__BSD_VISIBLE -march=nehalem -DALLOW_EXPERIMENTAL_API -MD -MQ 'examples/c590b3c@@dpdk-l2fwd-keepalive at exe/l2fwd-keepalive_main.c.o' -MF 'examples/c590b3c@@dpdk-l2fwd-keepalive at exe/l2fwd-keepalive_main.c.o.d' -o 'examples/c590b3c@@dpdk-l2fwd-keepalive at exe/l2fwd-keepalive_main.c.o' -c ../examples/l2fwd-keepalive/main.c
../examples/l2fwd-keepalive/main.c:585:60: error: use of undeclared identifier 'NB_MBUF'
        l2fwd_pktmbuf_pool = rte_pktmbuf_pool_create("mbuf_pool", NB_MBUF, 32,
                                                                  ^
1 error generated.
[1702/1800] Compiling C object 'examples/c590b3c@@dpdk-l2fwd-keepalive at exe/l2fwd-keepalive_shm.c.o'
[1703/1800] Compiling C object 'examples/c590b3c@@dpdk-l2fwd-event at exe/l2fwd-event_l2fwd_event.c.o'
--
[1706/1800] Compiling C object 'examples/c590b3c@@dpdk-ioat at exe/ioat_ioatfwd.c.o'
[1707/1800] Compiling C object 'app/test/3062f5d@@dpdk-test at exe/test_memcpy_perf.c.o'
[1708/1800] Compiling C object 'app/test/3062f5d@@dpdk-test at exe/test_ring_perf.c.o'
[1709/1800] Compiling C object 'lib/76b5a35@@rte_pipeline at sta/librte_pipeline_rte_table_action.c.o'
[1710/1800] Compiling C object 'app/test/3062f5d@@dpdk-test at exe/test_ring.c.o'
ninja: build stopped: subcommand failed.
DESTDIR=/root/FreeBSD1201-64_K12.1_GCC9.2.0/x86_64-native-bsdapp-gcc/7c5831e1495b41cb9ceccfa953f7852d/dpdk/build-x86-default/install ninja -C /root/FreeBSD1201-64_K12.1_GCC9.2.0/x86_64-native-bsdapp-gcc/7c5831e1495b41cb9ceccfa953f7852d/dpdk/build-x86-default install >/dev/null
find: /root/FreeBSD1201-64_K12.1_GCC9.2.0/x86_64-native-bsdapp-gcc/7c5831e1495b41cb9ceccfa953f7852d/dpdk/build-x86-default/install: No such file or directory
usage: dirname string [...]

DPDK STV team


More information about the test-report mailing list