[dpdk-test-report] |FAILURE| pw(84254) [v1] net/ice: refactor flow pattern parser

sys_stv at intel.com sys_stv at intel.com
Tue Nov 17 10:22:09 CET 2020


Test-Label: Intel-compilation
Test-Status: FAILURE
http://dpdk.org/patch/84254

_Compilation issues_

Submitter: Zhirun Yan <zhirun.yan at intel.com>
Date: 2020-11-17 08:45:24
Reply_mail: 20201117084524.3610038-1-zhirun.yan at intel.com

DPDK git baseline: Repo:dpdk-next-net-intel, CommitID: 782b2a6e20fffe1c5140875678ad27a9dc6cd222


Meson Build Summary: 22 Builds Done, 8 Successful, 14 Failures, 0 Blocked

+----------------+------------+--------------+------------+------------+-----------+----------+
| os             | gcc-static | clang-static | icc-static | gcc-shared | gcc-debug | document |
+----------------+------------+--------------+------------+------------+-----------+----------+
| CENTOS82-64    | FAIL       | pass         | pass       | FAIL       | FAIL      |          |
| RHEL82-64      | FAIL       |              |            |            |           |          |
| UB1804-64      | FAIL       |              |            |            |           |          |
| FC33-64        | FAIL       | pass         |            |            |           |          |
| UB2010-64      | FAIL       |              |            |            |           |          |
| UB2004-64      | FAIL       | pass         | pass       |            |           | FAIL     |
| WIN10-64       |            | pass         |            |            |           |          |
| UB2004-32      | FAIL       |              |            |            |           |          |
| FreeBSD1201-64 | FAIL       | pass         |            | FAIL       | FAIL      |          |
| SUSE15-64      | FAIL       | pass         |            |            |           |          |
+----------------+------------+--------------+------------+------------+-----------+----------+
Test environment and configuration as below:


OS: CENTOS82-64
	Kernel Version: 4.18.0-193.14.2.el8_2.x86_64
	CPU info: Intel(R) Xeon(R) Platinum 8280M CPU @ 2.70GHz
	GCC Version: gcc (GCC) 8.3.1 20191121 (Red Hat 8.3.1-5)
	Clang Version: 9.0.1 (Red Hat 9.0.1-2.module_el8.2.0+309+0c7b6b03)
	x86_64-native-linuxapp-gcc
	x86_64-native-linuxapp-clang
	x86_64-native-linuxapp-icc
	x86_64-native-linuxapp-gcc+shared
	x86_64-native-linuxapp-gcc+debug

OS: RHEL82-64
	Kernel Version: 4.18.0-193.el8.x86_64
	CPU info: Intel(R) Xeon(R) CPU E5-2699 v4 @ 2.20GHz
	GCC Version: gcc (GCC) 8.3.1 20191121 (Red Hat 8.3.1-5)
	Clang Version: 8.0.1 (Red Hat 8.0.1-1.module_el8.1.0+215+a01033fb)
	x86_64-native-linuxapp-gcc

OS: UB1804-64
	Kernel Version: 5.3.0-59-generic
	CPU info: Intel(R) Xeon(R) Platinum 8180 CPU @ 2.50GHz
	GCC Version: gcc (Ubuntu 8.4.0-1ubuntu1~18.04) 8.4.0
	Clang Version: 6.0.0-1ubuntu2 (tags/RELEASE_600/final)
	x86_64-native-linuxapp-gcc

OS: FC33-64
	Kernel Version: 5.8.16-300.fc33.x86_64
	CPU info: Intel(R) Xeon(R) CPU E5-2699 v4 @ 2.20GHz
	GCC Version: gcc (GCC) 10.2.1 20201005 (Red Hat 10.2.1-5)
	Clang Version: 11.0.0 (Fedora 11.0.0-1.fc33)
	x86_64-native-linuxapp-gcc
	x86_64-native-linuxapp-clang

OS: UB2010-64
	Kernel Version: 5.8.0-25-generic
	CPU info: Intel(R) Xeon(R) CPU E5-2699 v4 @ 2.20GHz
	GCC Version: gcc (Ubuntu 10.2.0-13ubuntu1) 10.2.0
	Clang Version: 11.0.0-2
	x86_64-native-linuxapp-gcc

OS: UB2004-64
	Kernel Version: 5.4.0-47-generic
	CPU info: Intel(R) Xeon(R) Platinum 8180 CPU @ 2.50GHz
	GCC Version: gcc (Ubuntu 10-20200416-0ubuntu1) 10.0.1 20200416 (experimental) [master revision 3c3f12e2a76:dcee354ce56:44b326839d864fc10c459916abcc97f35a9ac3de]
	Clang Version: 10.0.0-4ubuntu1
	x86_64-native-linuxapp-clang
	x86_64-native-linuxapp-gcc
	x86_64-native-linuxapp-icc
	x86_64-native-linuxapp-doc

OS: WIN10-64
	Kernel Version: N/A
	CPU info: N/A
	GCC Version: N/A
	Clang Version: Clang 8.0.0
	x86_64-windows-clang

OS: UB2004-32
	Kernel Version: 5.4.0-47-generic
	CPU info: Intel(R) Xeon(R) Platinum 8180 CPU @ 2.50GHz
	GCC Version: gcc (Ubuntu 9.3.0-10ubuntu2) 9.3.0
	Clang Version: 10.0.0-4ubuntu1
	i686-native-linuxapp-gcc

OS: FreeBSD1201-64
	Kernel Version: 12.1-RELEASE
	CPU info: Intel(R) Xeon(R) CPU E5-2699 v3 @ 2.30GHz (2294.74-MHz K8-class CPU)
	GCC Version: gcc (FreeBSD Ports Collection) 9.2.0
	Clang Version: 8.0.1 (tags/RELEASE_801/final 366581) (based on LLVM 8.0.1)
	x86_64-native-bsdapp-gcc
	x86_64-native-bsdapp-clang
	x86_64-native-bsdapp-gcc+shared
	x86_64-native-bsdapp-gcc+debug

OS: SUSE15-64
	Kernel Version: 4.12.14-lp150.11-default
	CPU info: Intel(R) Xeon(R) CPU E5-2699 v4 @ 2.20GHz
	GCC Version: gcc (SUSE Linux) 7.3.1 20180323 [gcc-7-branch revision 258812]
	Clang Version: 5.0.1 (tags/RELEASE_501/final 312548)
	x86_64-native-linuxapp-clang
	x86_64-native-linuxapp-gcc



*Build Failed #1:
OS: CENTOS82-64
Target: x86_64-native-linuxapp-gcc
FAILED: drivers/libtmp_rte_net_ice.a.p/net_ice_ice_fdir_filter.c.o 
gcc -Idrivers/libtmp_rte_net_ice.a.p -Idrivers -I../drivers -Idrivers/net/ice -I../drivers/net/ice -Idrivers/net/ice/base -I../drivers/net/ice/base -Idrivers/common/iavf -I../drivers/common/iavf -Ilib/librte_ethdev -I../lib/librte_ethdev -I. -I.. -Iconfig -I../config -Ilib/librte_eal/include -I../lib/librte_eal/include -Ilib/librte_eal/linux/include -I../lib/librte_eal/linux/include -Ilib/librte_eal/x86/include -I../lib/librte_eal/x86/include -Ilib/librte_eal/common -I../lib/librte_eal/common -Ilib/librte_eal -I../lib/librte_eal -Ilib/librte_kvargs -I../lib/librte_kvargs -Ilib/librte_metrics -I../lib/librte_metrics -Ilib/librte_telemetry -I../lib/librte_telemetry -Ilib/librte_net -I../lib/librte_net -Ilib/librte_mbuf -I../lib/librte_mbuf -Ilib/librte_mempool -I../lib/librte_mempool -Ilib/librte_ring -I../lib/librte_ring -Ilib/librte_meter -I../lib/librte_meter -Idrivers/bus/pci -I../drivers/bus/pci -I../drivers/bus/pci/linux -Ilib/librte_pci -I../lib/librte_pci -Idrivers/bus/vdev -I../drivers/bus/vdev -Ilib/librte_hash -I../lib/librte_hash -Ilib/librte_rcu -I../lib/librte_rcu -fdiagnostics-color=always -pipe -D_FILE_OFFSET_BITS=64 -Wall -Winvalid-pch -Werror -O3 -include rte_config.h -Wextra -Wcast-qual -Wdeprecated -Wformat-nonliteral -Wformat-security -Wmissing-declarations -Wmissing-prototypes -Wnested-externs -Wold-style-definition -Wpointer-arith -Wsign-compare -Wstrict-prototypes -Wundef -Wwrite-strings -Wno-packed-not-aligned -Wno-missing-field-initializers -D_GNU_SOURCE -fPIC -march=native -mno-avx512f -DALLOW_EXPERIMENTAL_API -DALLOW_INTERNAL_API -Wno-format-truncation -MD -MQ drivers/libtmp_rte_net_ice.a.p/net_ice_ice_fdir_filter.c.o -MF drivers/libtmp_rte_net_ice.a.p/net_ice_ice_fdir_filter.c.o.d -o drivers/libtmp_rte_net_ice.a.p/net_ice_ice_fdir_filter.c.o -c ../drivers/net/ice/ice_fdir_filter.c
../drivers/net/ice/ice_fdir_filter.c: In function ‘ice_fdir_parse’:
../drivers/net/ice/ice_fdir_filter.c:1968:20: error: ‘p_v6’ may be used uninitialized in this function [-Werror=maybe-uninitialized]
     p_v6->src_port = sctp_spec->hdr.src_port;
     ~~~~~~~~~~~~~~~^~~~~~~~~~~~~~~~~~~~~~~~~
../drivers/net/ice/ice_fdir_filter.c:1663:22: note: ‘p_v6’ was declared here
  struct ice_fdir_v6 *p_v6;
                      ^~~~
../drivers/net/ice/ice_fdir_filter.c:1891:20: error: ‘p_v4’ may be used uninitialized in this function [-Werror=maybe-uninitialized]
     p_v4->src_port = tcp_spec->hdr.src_port;
     ~~~~~~~~~~~~~~~^~~~~~~~~~~~~~~~~~~~~~~~
../drivers/net/ice/ice_fdir_filter.c:1662:22: note: ‘p_v4’ was declared here
  struct ice_fdir_v4 *p_v4;
                      ^~~~
cc1: all warnings being treated as errors
[1346/2736] Compiling C object drivers/libtmp_rte_net_ice.a.p/net_ice_ice_dcf.c.o
[1347/2736] Compiling C object drivers/net/igc/base/libigc_base.a.p/igc_base.c.o
[1348/2736] Compiling C object drivers/libtmp_rte_net_ice.a.p/net_ice_ice_dcf_ethdev.c.o
[1349/2736] Compiling C object drivers/libtmp_rte_net_ice.a.p/net_ice_ice_dcf_parent.c.o
[1350/2736] Generating rte_net_ice_mingw with a custom command
[1351/2736] Compiling C object drivers/net/igc/base/libigc_base.a.p/igc_i225.c.o
[1352/2736] Compiling C object drivers/libtmp_rte_net_ice.a.p/net_ice_ice_rxtx_vec_avx2.c.o
[1353/2736] Generating rte_net_hns3.sym_chk with a meson_exe.py custom command
[1354/2736] Compiling C object drivers/libtmp_rte_net_ice.a.p/net_ice_ice_rxtx_vec_sse.c.o
ninja: build stopped: subcommand failed




*Build Failed #2:
OS: CENTOS82-64
Target: x86_64-native-linuxapp-gcc+shared
FAILED: drivers/libtmp_rte_net_ice.a.p/net_ice_ice_fdir_filter.c.o 
gcc -Idrivers/libtmp_rte_net_ice.a.p -Idrivers -I../drivers -Idrivers/net/ice -I../drivers/net/ice -Idrivers/net/ice/base -I../drivers/net/ice/base -Idrivers/common/iavf -I../drivers/common/iavf -Ilib/librte_ethdev -I../lib/librte_ethdev -I. -I.. -Iconfig -I../config -Ilib/librte_eal/include -I../lib/librte_eal/include -Ilib/librte_eal/linux/include -I../lib/librte_eal/linux/include -Ilib/librte_eal/x86/include -I../lib/librte_eal/x86/include -Ilib/librte_eal/common -I../lib/librte_eal/common -Ilib/librte_eal -I../lib/librte_eal -Ilib/librte_kvargs -I../lib/librte_kvargs -Ilib/librte_metrics -I../lib/librte_metrics -Ilib/librte_telemetry -I../lib/librte_telemetry -Ilib/librte_net -I../lib/librte_net -Ilib/librte_mbuf -I../lib/librte_mbuf -Ilib/librte_mempool -I../lib/librte_mempool -Ilib/librte_ring -I../lib/librte_ring -Ilib/librte_meter -I../lib/librte_meter -Idrivers/bus/pci -I../drivers/bus/pci -I../drivers/bus/pci/linux -Ilib/librte_pci -I../lib/librte_pci -Idrivers/bus/vdev -I../drivers/bus/vdev -Ilib/librte_hash -I../lib/librte_hash -Ilib/librte_rcu -I../lib/librte_rcu -fdiagnostics-color=always -pipe -D_FILE_OFFSET_BITS=64 -Wall -Winvalid-pch -Werror -O3 -include rte_config.h -Wextra -Wcast-qual -Wdeprecated -Wformat-nonliteral -Wformat-security -Wmissing-declarations -Wmissing-prototypes -Wnested-externs -Wold-style-definition -Wpointer-arith -Wsign-compare -Wstrict-prototypes -Wundef -Wwrite-strings -Wno-packed-not-aligned -Wno-missing-field-initializers -D_GNU_SOURCE -fPIC -march=native -mno-avx512f -DALLOW_EXPERIMENTAL_API -DALLOW_INTERNAL_API -Wno-format-truncation -MD -MQ drivers/libtmp_rte_net_ice.a.p/net_ice_ice_fdir_filter.c.o -MF drivers/libtmp_rte_net_ice.a.p/net_ice_ice_fdir_filter.c.o.d -o drivers/libtmp_rte_net_ice.a.p/net_ice_ice_fdir_filter.c.o -c ../drivers/net/ice/ice_fdir_filter.c
../drivers/net/ice/ice_fdir_filter.c: In function ‘ice_fdir_parse’:
../drivers/net/ice/ice_fdir_filter.c:1968:20: error: ‘p_v6’ may be used uninitialized in this function [-Werror=maybe-uninitialized]
     p_v6->src_port = sctp_spec->hdr.src_port;
     ~~~~~~~~~~~~~~~^~~~~~~~~~~~~~~~~~~~~~~~~
../drivers/net/ice/ice_fdir_filter.c:1663:22: note: ‘p_v6’ was declared here
  struct ice_fdir_v6 *p_v6;
                      ^~~~
../drivers/net/ice/ice_fdir_filter.c:1891:20: error: ‘p_v4’ may be used uninitialized in this function [-Werror=maybe-uninitialized]
     p_v4->src_port = tcp_spec->hdr.src_port;
     ~~~~~~~~~~~~~~~^~~~~~~~~~~~~~~~~~~~~~~~
../drivers/net/ice/ice_fdir_filter.c:1662:22: note: ‘p_v4’ was declared here
  struct ice_fdir_v4 *p_v4;
                      ^~~~
cc1: all warnings being treated as errors
[1370/2570] Compiling C object drivers/libtmp_rte_net_ice.a.p/net_ice_ice_dcf_ethdev.c.o
[1371/2570] Compiling C object drivers/libtmp_rte_net_ice.a.p/net_ice_ice_dcf.c.o
[1372/2570] Compiling C object drivers/libtmp_rte_net_ice.a.p/net_ice_ice_rxtx_vec_sse.c.o
[1373/2570] Compiling C object drivers/libtmp_rte_net_ice.a.p/net_ice_ice_rxtx_vec_avx2.c.o
[1374/2570] Compiling C object drivers/libtmp_rte_net_ice.a.p/net_ice_ice_dcf_parent.c.o
ninja: build stopped: subcommand failed




*Build Failed #3:
OS: CENTOS82-64
Target: x86_64-native-linuxapp-gcc+debug
FAILED: drivers/libtmp_rte_net_ice.a.p/net_ice_ice_fdir_filter.c.o 
gcc -Idrivers/libtmp_rte_net_ice.a.p -Idrivers -I../drivers -Idrivers/net/ice -I../drivers/net/ice -Idrivers/net/ice/base -I../drivers/net/ice/base -Idrivers/common/iavf -I../drivers/common/iavf -Ilib/librte_ethdev -I../lib/librte_ethdev -I. -I.. -Iconfig -I../config -Ilib/librte_eal/include -I../lib/librte_eal/include -Ilib/librte_eal/linux/include -I../lib/librte_eal/linux/include -Ilib/librte_eal/x86/include -I../lib/librte_eal/x86/include -Ilib/librte_eal/common -I../lib/librte_eal/common -Ilib/librte_eal -I../lib/librte_eal -Ilib/librte_kvargs -I../lib/librte_kvargs -Ilib/librte_metrics -I../lib/librte_metrics -Ilib/librte_telemetry -I../lib/librte_telemetry -Ilib/librte_net -I../lib/librte_net -Ilib/librte_mbuf -I../lib/librte_mbuf -Ilib/librte_mempool -I../lib/librte_mempool -Ilib/librte_ring -I../lib/librte_ring -Ilib/librte_meter -I../lib/librte_meter -Idrivers/bus/pci -I../drivers/bus/pci -I../drivers/bus/pci/linux -Ilib/librte_pci -I../lib/librte_pci -Idrivers/bus/vdev -I../drivers/bus/vdev -Ilib/librte_hash -I../lib/librte_hash -Ilib/librte_rcu -I../lib/librte_rcu -fdiagnostics-color=always -pipe -D_FILE_OFFSET_BITS=64 -Wall -Winvalid-pch -Werror -O2 -g -include rte_config.h -Wextra -Wcast-qual -Wdeprecated -Wformat-nonliteral -Wformat-security -Wmissing-declarations -Wmissing-prototypes -Wnested-externs -Wold-style-definition -Wpointer-arith -Wsign-compare -Wstrict-prototypes -Wundef -Wwrite-strings -Wno-packed-not-aligned -Wno-missing-field-initializers -D_GNU_SOURCE -fPIC -march=native -mno-avx512f -DALLOW_EXPERIMENTAL_API -DALLOW_INTERNAL_API -Wno-format-truncation -MD -MQ drivers/libtmp_rte_net_ice.a.p/net_ice_ice_fdir_filter.c.o -MF drivers/libtmp_rte_net_ice.a.p/net_ice_ice_fdir_filter.c.o.d -o drivers/libtmp_rte_net_ice.a.p/net_ice_ice_fdir_filter.c.o -c ../drivers/net/ice/ice_fdir_filter.c
../drivers/net/ice/ice_fdir_filter.c: In function ‘ice_fdir_parse’:
../drivers/net/ice/ice_fdir_filter.c:1968:20: error: ‘p_v6’ may be used uninitialized in this function [-Werror=maybe-uninitialized]
     p_v6->src_port = sctp_spec->hdr.src_port;
     ~~~~~~~~~~~~~~~^~~~~~~~~~~~~~~~~~~~~~~~~
../drivers/net/ice/ice_fdir_filter.c:1663:22: note: ‘p_v6’ was declared here
  struct ice_fdir_v6 *p_v6;
                      ^~~~
../drivers/net/ice/ice_fdir_filter.c:1891:20: error: ‘p_v4’ may be used uninitialized in this function [-Werror=maybe-uninitialized]
     p_v4->src_port = tcp_spec->hdr.src_port;
     ~~~~~~~~~~~~~~~^~~~~~~~~~~~~~~~~~~~~~~~
../drivers/net/ice/ice_fdir_filter.c:1662:22: note: ‘p_v4’ was declared here
  struct ice_fdir_v4 *p_v4;
                      ^~~~
cc1: all warnings being treated as errors
[1349/2736] Compiling C object drivers/libtmp_rte_net_ice.a.p/net_ice_ice_acl_filter.c.o
[1350/2736] Compiling C object drivers/libtmp_rte_net_ice.a.p/net_ice_ice_rxtx.c.o
[1351/2736] Compiling C object drivers/libtmp_rte_net_ice.a.p/net_ice_ice_dcf.c.o
[1352/2736] Compiling C object drivers/libtmp_rte_net_ice.a.p/net_ice_ice_rxtx_vec_avx2.c.o
[1353/2736] Compiling C object drivers/libtmp_rte_net_ice.a.p/net_ice_ice_rxtx_vec_sse.c.o
ninja: build stopped: subcommand failed




*Build Failed #4:
OS: FC33-64
Target: x86_64-native-linuxapp-gcc
FAILED: drivers/libtmp_rte_net_ice.a.p/net_ice_ice_fdir_filter.c.o 
gcc -Idrivers/libtmp_rte_net_ice.a.p -Idrivers -I../drivers -Idrivers/net/ice -I../drivers/net/ice -Idrivers/net/ice/base -I../drivers/net/ice/base -Idrivers/common/iavf -I../drivers/common/iavf -Ilib/librte_ethdev -I../lib/librte_ethdev -I. -I.. -Iconfig -I../config -Ilib/librte_eal/include -I../lib/librte_eal/include -Ilib/librte_eal/linux/include -I../lib/librte_eal/linux/include -Ilib/librte_eal/x86/include -I../lib/librte_eal/x86/include -Ilib/librte_eal/common -I../lib/librte_eal/common -Ilib/librte_eal -I../lib/librte_eal -Ilib/librte_kvargs -I../lib/librte_kvargs -Ilib/librte_metrics -I../lib/librte_metrics -Ilib/librte_telemetry -I../lib/librte_telemetry -Ilib/librte_net -I../lib/librte_net -Ilib/librte_mbuf -I../lib/librte_mbuf -Ilib/librte_mempool -I../lib/librte_mempool -Ilib/librte_ring -I../lib/librte_ring -Ilib/librte_meter -I../lib/librte_meter -Idrivers/bus/pci -I../drivers/bus/pci -I../drivers/bus/pci/linux -Ilib/librte_pci -I../lib/librte_pci -Idrivers/bus/vdev -I../drivers/bus/vdev -Ilib/librte_hash -I../lib/librte_hash -Ilib/librte_rcu -I../lib/librte_rcu -fdiagnostics-color=always -pipe -D_FILE_OFFSET_BITS=64 -Wall -Winvalid-pch -Werror -O3 -include rte_config.h -Wextra -Wcast-qual -Wdeprecated -Wformat-nonliteral -Wformat-security -Wmissing-declarations -Wmissing-prototypes -Wnested-externs -Wold-style-definition -Wpointer-arith -Wsign-compare -Wstrict-prototypes -Wundef -Wwrite-strings -Wno-address-of-packed-member -Wno-packed-not-aligned -Wno-missing-field-initializers -Wno-zero-length-bounds -D_GNU_SOURCE -fPIC -march=native -DALLOW_EXPERIMENTAL_API -DALLOW_INTERNAL_API -Wno-format-truncation -DCC_AVX512_SUPPORT -MD -MQ drivers/libtmp_rte_net_ice.a.p/net_ice_ice_fdir_filter.c.o -MF drivers/libtmp_rte_net_ice.a.p/net_ice_ice_fdir_filter.c.o.d -o drivers/libtmp_rte_net_ice.a.p/net_ice_ice_fdir_filter.c.o -c ../drivers/net/ice/ice_fdir_filter.c
../drivers/net/ice/ice_fdir_filter.c: In function ‘ice_fdir_parse’:
../drivers/net/ice/ice_fdir_filter.c:1968:20: error: ‘p_v6’ may be used uninitialized in this function [-Werror=maybe-uninitialized]
 1968 |     p_v6->src_port = sctp_spec->hdr.src_port;
      |     ~~~~~~~~~~~~~~~^~~~~~~~~~~~~~~~~~~~~~~~~
../drivers/net/ice/ice_fdir_filter.c:1663:22: note: ‘p_v6’ was declared here
 1663 |  struct ice_fdir_v6 *p_v6;
      |                      ^~~~
../drivers/net/ice/ice_fdir_filter.c:1891:20: error: ‘p_v4’ may be used uninitialized in this function [-Werror=maybe-uninitialized]
 1891 |     p_v4->src_port = tcp_spec->hdr.src_port;
      |     ~~~~~~~~~~~~~~~^~~~~~~~~~~~~~~~~~~~~~~~
../drivers/net/ice/ice_fdir_filter.c:1662:22: note: ‘p_v4’ was declared here
 1662 |  struct ice_fdir_v4 *p_v4;
      |                      ^~~~
cc1: all warnings being treated as errors
[1354/2795] Compiling C object drivers/libtmp_rte_net_ice.a.p/net_ice_ice_switch_filter.c.o
[1355/2795] Compiling C object drivers/libtmp_rte_net_ice.a.p/net_ice_ice_acl_filter.c.o
[1356/2795] Compiling C object drivers/net/ice/base/libice_base.a.p/ice_switch.c.o
[1357/2795] Compiling C object drivers/net/igc/base/libigc_base.a.p/igc_i225.c.o
[1358/2795] Compiling C object drivers/libtmp_rte_net_ice.a.p/net_ice_ice_dcf_parent.c.o
[1359/2795] Compiling C object drivers/libtmp_rte_net_ice.a.p/net_ice_ice_dcf_ethdev.c.o
[1360/2795] Compiling C object drivers/libtmp_rte_net_ice.a.p/net_ice_ice_dcf.c.o
[1361/2795] Compiling C object drivers/libtmp_rte_net_ice.a.p/net_ice_ice_ethdev.c.o
[1362/2795] Compiling C object drivers/libtmp_rte_net_ice.a.p/net_ice_ice_rxtx_vec_avx2.c.o
[1363/2795] Compiling C object drivers/libtmp_rte_net_ice.a.p/net_ice_ice_rxtx_vec_sse.c.o
[1364/2795] Compiling C object drivers/libtmp_rte_net_ice.a.p/net_ice_ice_rxtx.c.o
ninja: build stopped: subcommand failed




*Build Failed #5:
OS: FreeBSD1201-64
Target: x86_64-native-bsdapp-gcc
FAILED: drivers/libtmp_rte_net_ice.a.p/net_ice_ice_fdir_filter.c.o 
gcc -Idrivers/libtmp_rte_net_ice.a.p -Idrivers -I../drivers -Idrivers/net/ice -I../drivers/net/ice -Idrivers/net/ice/base -I../drivers/net/ice/base -Idrivers/common/iavf -I../drivers/common/iavf -Ilib/librte_ethdev -I../lib/librte_ethdev -I. -I.. -Iconfig -I../config -Ilib/librte_eal/include -I../lib/librte_eal/include -Ilib/librte_eal/freebsd/include -I../lib/librte_eal/freebsd/include -Ilib/librte_eal/x86/include -I../lib/librte_eal/x86/include -Ilib/librte_eal/common -I../lib/librte_eal/common -Ilib/librte_eal -I../lib/librte_eal -Ilib/librte_kvargs -I../lib/librte_kvargs -Ilib/librte_metrics -I../lib/librte_metrics -Ilib/librte_telemetry -I../lib/librte_telemetry -Ilib/librte_net -I../lib/librte_net -Ilib/librte_mbuf -I../lib/librte_mbuf -Ilib/librte_mempool -I../lib/librte_mempool -Ilib/librte_ring -I../lib/librte_ring -Ilib/librte_meter -I../lib/librte_meter -Idrivers/bus/pci -I../drivers/bus/pci -I../drivers/bus/pci/bsd -Ilib/librte_pci -I../lib/librte_pci -Idrivers/bus/vdev -I../drivers/bus/vdev -Ilib/librte_hash -I../lib/librte_hash -Ilib/librte_rcu -I../lib/librte_rcu -fdiagnostics-color=always -pipe -D_FILE_OFFSET_BITS=64 -Wall -Winvalid-pch -Werror -O3 -include rte_config.h -Wextra -Wcast-qual -Wdeprecated -Wformat-nonliteral -Wformat-security -Wmissing-declarations -Wmissing-prototypes -Wnested-externs -Wold-style-definition -Wpointer-arith -Wsign-compare -Wstrict-prototypes -Wundef -Wwrite-strings -Wno-address-of-packed-member -Wno-packed-not-aligned -Wno-missing-field-initializers -D_GNU_SOURCE -D__BSD_VISIBLE -fPIC -march=native -mno-avx512f -DALLOW_EXPERIMENTAL_API -DALLOW_INTERNAL_API -Wno-format-truncation -MD -MQ drivers/libtmp_rte_net_ice.a.p/net_ice_ice_fdir_filter.c.o -MF drivers/libtmp_rte_net_ice.a.p/net_ice_ice_fdir_filter.c.o.d -o drivers/libtmp_rte_net_ice.a.p/net_ice_ice_fdir_filter.c.o -c ../drivers/net/ice/ice_fdir_filter.c
../drivers/net/ice/ice_fdir_filter.c: In function 'ice_fdir_parse':
../drivers/net/ice/ice_fdir_filter.c:1968:20: error: 'p_v6' may be used uninitialized in this function [-Werror=maybe-uninitialized]
 1968 |     p_v6->src_port = sctp_spec->hdr.src_port;
      |     ~~~~~~~~~~~~~~~^~~~~~~~~~~~~~~~~~~~~~~~~
../drivers/net/ice/ice_fdir_filter.c:1663:22: note: 'p_v6' was declared here
 1663 |  struct ice_fdir_v6 *p_v6;
      |                      ^~~~
../drivers/net/ice/ice_fdir_filter.c:1891:20: error: 'p_v4' may be used uninitialized in this function [-Werror=maybe-uninitialized]
 1891 |     p_v4->src_port = tcp_spec->hdr.src_port;
      |     ~~~~~~~~~~~~~~~^~~~~~~~~~~~~~~~~~~~~~~~
../drivers/net/ice/ice_fdir_filter.c:1662:22: note: 'p_v4' was declared here
 1662 |  struct ice_fdir_v4 *p_v4;
      |                      ^~~~
cc1: all warnings being treated as errors
[1075/2010] Compiling C object drivers/libtmp_rte_net_ice.a.p/net_ice_ice_switch_filter.c.o
[1076/2010] Compiling C object drivers/libtmp_rte_net_ice.a.p/net_ice_ice_ethdev.c.o
[1077/2010] Compiling C object drivers/libtmp_rte_net_ice.a.p/net_ice_ice_acl_filter.c.o
[1078/2010] Compiling C object drivers/libtmp_rte_net_ice.a.p/net_ice_ice_rxtx.c.o
[1079/2010] Compiling C object drivers/libtmp_rte_net_ice.a.p/net_ice_ice_rxtx_vec_sse.c.o
ninja: build stopped: subcommand failed




*Build Failed #6:
OS: FreeBSD1201-64
Target: x86_64-native-bsdapp-gcc+shared
FAILED: drivers/libtmp_rte_net_ice.a.p/net_ice_ice_fdir_filter.c.o 
gcc -Idrivers/libtmp_rte_net_ice.a.p -Idrivers -I../drivers -Idrivers/net/ice -I../drivers/net/ice -Idrivers/net/ice/base -I../drivers/net/ice/base -Idrivers/common/iavf -I../drivers/common/iavf -Ilib/librte_ethdev -I../lib/librte_ethdev -I. -I.. -Iconfig -I../config -Ilib/librte_eal/include -I../lib/librte_eal/include -Ilib/librte_eal/freebsd/include -I../lib/librte_eal/freebsd/include -Ilib/librte_eal/x86/include -I../lib/librte_eal/x86/include -Ilib/librte_eal/common -I../lib/librte_eal/common -Ilib/librte_eal -I../lib/librte_eal -Ilib/librte_kvargs -I../lib/librte_kvargs -Ilib/librte_metrics -I../lib/librte_metrics -Ilib/librte_telemetry -I../lib/librte_telemetry -Ilib/librte_net -I../lib/librte_net -Ilib/librte_mbuf -I../lib/librte_mbuf -Ilib/librte_mempool -I../lib/librte_mempool -Ilib/librte_ring -I../lib/librte_ring -Ilib/librte_meter -I../lib/librte_meter -Idrivers/bus/pci -I../drivers/bus/pci -I../drivers/bus/pci/bsd -Ilib/librte_pci -I../lib/librte_pci -Idrivers/bus/vdev -I../drivers/bus/vdev -Ilib/librte_hash -I../lib/librte_hash -Ilib/librte_rcu -I../lib/librte_rcu -fdiagnostics-color=always -pipe -D_FILE_OFFSET_BITS=64 -Wall -Winvalid-pch -Werror -O3 -include rte_config.h -Wextra -Wcast-qual -Wdeprecated -Wformat-nonliteral -Wformat-security -Wmissing-declarations -Wmissing-prototypes -Wnested-externs -Wold-style-definition -Wpointer-arith -Wsign-compare -Wstrict-prototypes -Wundef -Wwrite-strings -Wno-address-of-packed-member -Wno-packed-not-aligned -Wno-missing-field-initializers -D_GNU_SOURCE -D__BSD_VISIBLE -fPIC -march=native -mno-avx512f -DALLOW_EXPERIMENTAL_API -DALLOW_INTERNAL_API -Wno-format-truncation -MD -MQ drivers/libtmp_rte_net_ice.a.p/net_ice_ice_fdir_filter.c.o -MF drivers/libtmp_rte_net_ice.a.p/net_ice_ice_fdir_filter.c.o.d -o drivers/libtmp_rte_net_ice.a.p/net_ice_ice_fdir_filter.c.o -c ../drivers/net/ice/ice_fdir_filter.c
../drivers/net/ice/ice_fdir_filter.c: In function 'ice_fdir_parse':
../drivers/net/ice/ice_fdir_filter.c:1968:20: error: 'p_v6' may be used uninitialized in this function [-Werror=maybe-uninitialized]
 1968 |     p_v6->src_port = sctp_spec->hdr.src_port;
      |     ~~~~~~~~~~~~~~~^~~~~~~~~~~~~~~~~~~~~~~~~
../drivers/net/ice/ice_fdir_filter.c:1663:22: note: 'p_v6' was declared here
 1663 |  struct ice_fdir_v6 *p_v6;
      |                      ^~~~
../drivers/net/ice/ice_fdir_filter.c:1891:20: error: 'p_v4' may be used uninitialized in this function [-Werror=maybe-uninitialized]
 1891 |     p_v4->src_port = tcp_spec->hdr.src_port;
      |     ~~~~~~~~~~~~~~~^~~~~~~~~~~~~~~~~~~~~~~~
../drivers/net/ice/ice_fdir_filter.c:1662:22: note: 'p_v4' was declared here
 1662 |  struct ice_fdir_v4 *p_v4;
      |                      ^~~~
cc1: all warnings being treated as errors
[1101/1892] Compiling C object drivers/libtmp_rte_net_ice.a.p/net_ice_ice_dcf_parent.c.o
[1102/1892] Compiling C object drivers/libtmp_rte_net_ice.a.p/net_ice_ice_dcf_ethdev.c.o
[1103/1892] Compiling C object drivers/libtmp_rte_net_ice.a.p/net_ice_ice_rxtx_vec_sse.c.o
[1104/1892] Compiling C object drivers/libtmp_rte_net_ice.a.p/net_ice_ice_dcf.c.o
[1105/1892] Compiling C object drivers/libtmp_rte_net_ice.a.p/net_ice_ice_rxtx_vec_avx2.c.o
ninja: build stopped: subcommand failed




*Build Failed #7:
OS: FreeBSD1201-64
Target: x86_64-native-bsdapp-gcc+debug
FAILED: drivers/libtmp_rte_net_ice.a.p/net_ice_ice_fdir_filter.c.o 
gcc -Idrivers/libtmp_rte_net_ice.a.p -Idrivers -I../drivers -Idrivers/net/ice -I../drivers/net/ice -Idrivers/net/ice/base -I../drivers/net/ice/base -Idrivers/common/iavf -I../drivers/common/iavf -Ilib/librte_ethdev -I../lib/librte_ethdev -I. -I.. -Iconfig -I../config -Ilib/librte_eal/include -I../lib/librte_eal/include -Ilib/librte_eal/freebsd/include -I../lib/librte_eal/freebsd/include -Ilib/librte_eal/x86/include -I../lib/librte_eal/x86/include -Ilib/librte_eal/common -I../lib/librte_eal/common -Ilib/librte_eal -I../lib/librte_eal -Ilib/librte_kvargs -I../lib/librte_kvargs -Ilib/librte_metrics -I../lib/librte_metrics -Ilib/librte_telemetry -I../lib/librte_telemetry -Ilib/librte_net -I../lib/librte_net -Ilib/librte_mbuf -I../lib/librte_mbuf -Ilib/librte_mempool -I../lib/librte_mempool -Ilib/librte_ring -I../lib/librte_ring -Ilib/librte_meter -I../lib/librte_meter -Idrivers/bus/pci -I../drivers/bus/pci -I../drivers/bus/pci/bsd -Ilib/librte_pci -I../lib/librte_pci -Idrivers/bus/vdev -I../drivers/bus/vdev -Ilib/librte_hash -I../lib/librte_hash -Ilib/librte_rcu -I../lib/librte_rcu -fdiagnostics-color=always -pipe -D_FILE_OFFSET_BITS=64 -Wall -Winvalid-pch -Werror -O2 -g -include rte_config.h -Wextra -Wcast-qual -Wdeprecated -Wformat-nonliteral -Wformat-security -Wmissing-declarations -Wmissing-prototypes -Wnested-externs -Wold-style-definition -Wpointer-arith -Wsign-compare -Wstrict-prototypes -Wundef -Wwrite-strings -Wno-address-of-packed-member -Wno-packed-not-aligned -Wno-missing-field-initializers -D_GNU_SOURCE -D__BSD_VISIBLE -fPIC -march=native -mno-avx512f -DALLOW_EXPERIMENTAL_API -DALLOW_INTERNAL_API -Wno-format-truncation -MD -MQ drivers/libtmp_rte_net_ice.a.p/net_ice_ice_fdir_filter.c.o -MF drivers/libtmp_rte_net_ice.a.p/net_ice_ice_fdir_filter.c.o.d -o drivers/libtmp_rte_net_ice.a.p/net_ice_ice_fdir_filter.c.o -c ../drivers/net/ice/ice_fdir_filter.c
../drivers/net/ice/ice_fdir_filter.c: In function 'ice_fdir_parse':
../drivers/net/ice/ice_fdir_filter.c:1968:20: error: 'p_v6' may be used uninitialized in this function [-Werror=maybe-uninitialized]
 1968 |     p_v6->src_port = sctp_spec->hdr.src_port;
      |     ~~~~~~~~~~~~~~~^~~~~~~~~~~~~~~~~~~~~~~~~
../drivers/net/ice/ice_fdir_filter.c:1663:22: note: 'p_v6' was declared here
 1663 |  struct ice_fdir_v6 *p_v6;
      |                      ^~~~
../drivers/net/ice/ice_fdir_filter.c:1891:20: error: 'p_v4' may be used uninitialized in this function [-Werror=maybe-uninitialized]
 1891 |     p_v4->src_port = tcp_spec->hdr.src_port;
      |     ~~~~~~~~~~~~~~~^~~~~~~~~~~~~~~~~~~~~~~~
../drivers/net/ice/ice_fdir_filter.c:1662:22: note: 'p_v4' was declared here
 1662 |  struct ice_fdir_v4 *p_v4;
      |                      ^~~~
cc1: all warnings being treated as errors
[1076/2010] Compiling C object drivers/libtmp_rte_net_ice.a.p/net_ice_ice_acl_filter.c.o
[1077/2010] Compiling C object drivers/libtmp_rte_net_ice.a.p/net_ice_ice_ethdev.c.o
[1078/2010] Compiling C object drivers/libtmp_rte_net_ice.a.p/net_ice_ice_rxtx_vec_avx2.c.o
[1079/2010] Compiling C object drivers/libtmp_rte_net_ice.a.p/net_ice_ice_rxtx.c.o
[1080/2010] Compiling C object drivers/libtmp_rte_net_ice.a.p/net_ice_ice_rxtx_vec_sse.c.o
ninja: build stopped: subcommand failed




*Build Failed #8:
OS: RHEL82-64
Target: x86_64-native-linuxapp-gcc
FAILED: drivers/libtmp_rte_net_ice.a.p/net_ice_ice_fdir_filter.c.o 
gcc -Idrivers/libtmp_rte_net_ice.a.p -Idrivers -I../drivers -Idrivers/net/ice -I../drivers/net/ice -Idrivers/net/ice/base -I../drivers/net/ice/base -Idrivers/common/iavf -I../drivers/common/iavf -Ilib/librte_ethdev -I../lib/librte_ethdev -I. -I.. -Iconfig -I../config -Ilib/librte_eal/include -I../lib/librte_eal/include -Ilib/librte_eal/linux/include -I../lib/librte_eal/linux/include -Ilib/librte_eal/x86/include -I../lib/librte_eal/x86/include -Ilib/librte_eal/common -I../lib/librte_eal/common -Ilib/librte_eal -I../lib/librte_eal -Ilib/librte_kvargs -I../lib/librte_kvargs -Ilib/librte_metrics -I../lib/librte_metrics -Ilib/librte_telemetry -I../lib/librte_telemetry -Ilib/librte_net -I../lib/librte_net -Ilib/librte_mbuf -I../lib/librte_mbuf -Ilib/librte_mempool -I../lib/librte_mempool -Ilib/librte_ring -I../lib/librte_ring -Ilib/librte_meter -I../lib/librte_meter -Idrivers/bus/pci -I../drivers/bus/pci -I../drivers/bus/pci/linux -Ilib/librte_pci -I../lib/librte_pci -Idrivers/bus/vdev -I../drivers/bus/vdev -Ilib/librte_hash -I../lib/librte_hash -Ilib/librte_rcu -I../lib/librte_rcu -fdiagnostics-color=always -pipe -D_FILE_OFFSET_BITS=64 -Wall -Winvalid-pch -Werror -O3 -include rte_config.h -Wextra -Wcast-qual -Wdeprecated -Wformat-nonliteral -Wformat-security -Wmissing-declarations -Wmissing-prototypes -Wnested-externs -Wold-style-definition -Wpointer-arith -Wsign-compare -Wstrict-prototypes -Wundef -Wwrite-strings -Wno-packed-not-aligned -Wno-missing-field-initializers -D_GNU_SOURCE -fPIC -march=native -mno-avx512f -DALLOW_EXPERIMENTAL_API -DALLOW_INTERNAL_API -Wno-format-truncation -MD -MQ drivers/libtmp_rte_net_ice.a.p/net_ice_ice_fdir_filter.c.o -MF drivers/libtmp_rte_net_ice.a.p/net_ice_ice_fdir_filter.c.o.d -o drivers/libtmp_rte_net_ice.a.p/net_ice_ice_fdir_filter.c.o -c ../drivers/net/ice/ice_fdir_filter.c
../drivers/net/ice/ice_fdir_filter.c: In function ‘ice_fdir_parse’:
../drivers/net/ice/ice_fdir_filter.c:1968:20: error: ‘p_v6’ may be used uninitialized in this function [-Werror=maybe-uninitialized]
     p_v6->src_port = sctp_spec->hdr.src_port;
     ~~~~~~~~~~~~~~~^~~~~~~~~~~~~~~~~~~~~~~~~
../drivers/net/ice/ice_fdir_filter.c:1663:22: note: ‘p_v6’ was declared here
  struct ice_fdir_v6 *p_v6;
                      ^~~~
../drivers/net/ice/ice_fdir_filter.c:1891:20: error: ‘p_v4’ may be used uninitialized in this function [-Werror=maybe-uninitialized]
     p_v4->src_port = tcp_spec->hdr.src_port;
     ~~~~~~~~~~~~~~~^~~~~~~~~~~~~~~~~~~~~~~~
../drivers/net/ice/ice_fdir_filter.c:1662:22: note: ‘p_v4’ was declared here
  struct ice_fdir_v4 *p_v4;
                      ^~~~
cc1: all warnings being treated as errors
[1346/2736] Generating rte_net_iavf.sym_chk with a meson_exe.py custom command
[1347/2736] Compiling C object drivers/libtmp_rte_net_ice.a.p/net_ice_ice_acl_filter.c.o
[1348/2736] Compiling C object drivers/libtmp_rte_net_ice.a.p/net_ice_ice_dcf_ethdev.c.o
[1349/2736] Compiling C object drivers/libtmp_rte_net_ice.a.p/net_ice_ice_ethdev.c.o
[1350/2736] Compiling C object drivers/libtmp_rte_net_ice.a.p/net_ice_ice_dcf_parent.c.o
[1351/2736] Compiling C object drivers/libtmp_rte_net_ice.a.p/net_ice_ice_dcf.c.o
[1352/2736] Compiling C object drivers/libtmp_rte_net_ice.a.p/net_ice_ice_rxtx_vec_avx2.c.o
[1353/2736] Compiling C object drivers/libtmp_rte_net_ice.a.p/net_ice_ice_rxtx_vec_sse.c.o
[1354/2736] Compiling C object drivers/libtmp_rte_net_ice.a.p/net_ice_ice_rxtx.c.o
ninja: build stopped: subcommand failed




*Build Failed #9:
OS: SUSE15-64
Target: x86_64-native-linuxapp-gcc
FAILED: drivers/libtmp_rte_net_ice.a.p/net_ice_ice_fdir_filter.c.o 
gcc -Idrivers/libtmp_rte_net_ice.a.p -Idrivers -I../drivers -Idrivers/net/ice -I../drivers/net/ice -Idrivers/net/ice/base -I../drivers/net/ice/base -Idrivers/common/iavf -I../drivers/common/iavf -Ilib/librte_ethdev -I../lib/librte_ethdev -I. -I.. -Iconfig -I../config -Ilib/librte_eal/include -I../lib/librte_eal/include -Ilib/librte_eal/linux/include -I../lib/librte_eal/linux/include -Ilib/librte_eal/x86/include -I../lib/librte_eal/x86/include -Ilib/librte_eal/common -I../lib/librte_eal/common -Ilib/librte_eal -I../lib/librte_eal -Ilib/librte_kvargs -I../lib/librte_kvargs -Ilib/librte_metrics -I../lib/librte_metrics -Ilib/librte_telemetry -I../lib/librte_telemetry -Ilib/librte_net -I../lib/librte_net -Ilib/librte_mbuf -I../lib/librte_mbuf -Ilib/librte_mempool -I../lib/librte_mempool -Ilib/librte_ring -I../lib/librte_ring -Ilib/librte_meter -I../lib/librte_meter -Idrivers/bus/pci -I../drivers/bus/pci -I../drivers/bus/pci/linux -Ilib/librte_pci -I../lib/librte_pci -Idrivers/bus/vdev -I../drivers/bus/vdev -Ilib/librte_hash -I../lib/librte_hash -Ilib/librte_rcu -I../lib/librte_rcu -fdiagnostics-color=always -pipe -D_FILE_OFFSET_BITS=64 -Wall -Winvalid-pch -Werror -O3 -include rte_config.h -Wextra -Wcast-qual -Wdeprecated -Wformat-nonliteral -Wformat-security -Wmissing-declarations -Wmissing-prototypes -Wnested-externs -Wold-style-definition -Wpointer-arith -Wsign-compare -Wstrict-prototypes -Wundef -Wwrite-strings -Wno-missing-field-initializers -D_GNU_SOURCE -fPIC -march=native -DALLOW_EXPERIMENTAL_API -DALLOW_INTERNAL_API -Wno-format-truncation -DCC_AVX512_SUPPORT -MD -MQ drivers/libtmp_rte_net_ice.a.p/net_ice_ice_fdir_filter.c.o -MF drivers/libtmp_rte_net_ice.a.p/net_ice_ice_fdir_filter.c.o.d -o drivers/libtmp_rte_net_ice.a.p/net_ice_ice_fdir_filter.c.o -c ../drivers/net/ice/ice_fdir_filter.c
../drivers/net/ice/ice_fdir_filter.c: In function ‘ice_fdir_parse’:
../drivers/net/ice/ice_fdir_filter.c:1894:20: error: ‘p_v6’ may be used uninitialized in this function [-Werror=maybe-uninitialized]
     p_v6->src_port = tcp_spec->hdr.src_port;
     ~~~~~~~~~~~~~~~^~~~~~~~~~~~~~~~~~~~~~~~
../drivers/net/ice/ice_fdir_filter.c:1663:22: note: ‘p_v6’ was declared here
  struct ice_fdir_v6 *p_v6;
                      ^~~~
../drivers/net/ice/ice_fdir_filter.c:1891:20: error: ‘p_v4’ may be used uninitialized in this function [-Werror=maybe-uninitialized]
     p_v4->src_port = tcp_spec->hdr.src_port;
     ~~~~~~~~~~~~~~~^~~~~~~~~~~~~~~~~~~~~~~~
../drivers/net/ice/ice_fdir_filter.c:1662:22: note: ‘p_v4’ was declared here
  struct ice_fdir_v4 *p_v4;
                      ^~~~
cc1: all warnings being treated as errors
[1350/2712] Compiling C object drivers/libtmp_rte_net_ice.a.p/net_ice_ice_acl_filter.c.o
[1351/2712] Compiling C object drivers/libtmp_rte_net_ice.a.p/net_ice_ice_ethdev.c.o
[1352/2712] Compiling C object drivers/net/igc/base/libigc_base.a.p/igc_api.c.o
[1353/2712] Compiling C object drivers/libtmp_rte_net_ice.a.p/net_ice_ice_dcf_parent.c.o
[1354/2712] Compiling C object drivers/libtmp_rte_net_ice.a.p/net_ice_ice_dcf.c.o
[1355/2712] Compiling C object drivers/libtmp_rte_net_ice.a.p/net_ice_ice_dcf_ethdev.c.o
[1356/2712] Compiling C object drivers/libtmp_rte_net_ice.a.p/net_ice_ice_rxtx_vec_avx2.c.o
[1357/2712] Compiling C object drivers/libtmp_rte_net_ice.a.p/net_ice_ice_rxtx_vec_sse.c.o
[1358/2712] Compiling C object drivers/libtmp_rte_net_ice.a.p/net_ice_ice_rxtx.c.o
ninja: build stopped: subcommand failed




*Build Failed #10:
OS: UB1804-64
Target: x86_64-native-linuxapp-gcc
FAILED: drivers/libtmp_rte_net_ice.a.p/net_ice_ice_fdir_filter.c.o 
gcc -Idrivers/libtmp_rte_net_ice.a.p -Idrivers -I../drivers -Idrivers/net/ice -I../drivers/net/ice -Idrivers/net/ice/base -I../drivers/net/ice/base -Idrivers/common/iavf -I../drivers/common/iavf -Ilib/librte_ethdev -I../lib/librte_ethdev -I. -I.. -Iconfig -I../config -Ilib/librte_eal/include -I../lib/librte_eal/include -Ilib/librte_eal/linux/include -I../lib/librte_eal/linux/include -Ilib/librte_eal/x86/include -I../lib/librte_eal/x86/include -Ilib/librte_eal/common -I../lib/librte_eal/common -Ilib/librte_eal -I../lib/librte_eal -Ilib/librte_kvargs -I../lib/librte_kvargs -Ilib/librte_metrics -I../lib/librte_metrics -Ilib/librte_telemetry -I../lib/librte_telemetry -Ilib/librte_net -I../lib/librte_net -Ilib/librte_mbuf -I../lib/librte_mbuf -Ilib/librte_mempool -I../lib/librte_mempool -Ilib/librte_ring -I../lib/librte_ring -Ilib/librte_meter -I../lib/librte_meter -Idrivers/bus/pci -I../drivers/bus/pci -I../drivers/bus/pci/linux -Ilib/librte_pci -I../lib/librte_pci -Idrivers/bus/vdev -I../drivers/bus/vdev -Ilib/librte_hash -I../lib/librte_hash -Ilib/librte_rcu -I../lib/librte_rcu -fdiagnostics-color=always -pipe -D_FILE_OFFSET_BITS=64 -Wall -Winvalid-pch -Werror -O3 -include rte_config.h -Wextra -Wcast-qual -Wdeprecated -Wformat-nonliteral -Wformat-security -Wmissing-declarations -Wmissing-prototypes -Wnested-externs -Wold-style-definition -Wpointer-arith -Wsign-compare -Wstrict-prototypes -Wundef -Wwrite-strings -Wno-packed-not-aligned -Wno-missing-field-initializers -D_GNU_SOURCE -fPIC -march=native -mno-avx512f -DALLOW_EXPERIMENTAL_API -DALLOW_INTERNAL_API -Wno-format-truncation -MD -MQ drivers/libtmp_rte_net_ice.a.p/net_ice_ice_fdir_filter.c.o -MF drivers/libtmp_rte_net_ice.a.p/net_ice_ice_fdir_filter.c.o.d -o drivers/libtmp_rte_net_ice.a.p/net_ice_ice_fdir_filter.c.o -c ../drivers/net/ice/ice_fdir_filter.c
../drivers/net/ice/ice_fdir_filter.c: In function ‘ice_fdir_parse’:
../drivers/net/ice/ice_fdir_filter.c:1968:20: error: ‘p_v6’ may be used uninitialized in this function [-Werror=maybe-uninitialized]
     p_v6->src_port = sctp_spec->hdr.src_port;
     ~~~~~~~~~~~~~~~^~~~~~~~~~~~~~~~~~~~~~~~~
../drivers/net/ice/ice_fdir_filter.c:1663:22: note: ‘p_v6’ was declared here
  struct ice_fdir_v6 *p_v6;
                      ^~~~
../drivers/net/ice/ice_fdir_filter.c:1891:20: error: ‘p_v4’ may be used uninitialized in this function [-Werror=maybe-uninitialized]
     p_v4->src_port = tcp_spec->hdr.src_port;
     ~~~~~~~~~~~~~~~^~~~~~~~~~~~~~~~~~~~~~~~
../drivers/net/ice/ice_fdir_filter.c:1662:22: note: ‘p_v4’ was declared here
  struct ice_fdir_v4 *p_v4;
                      ^~~~
cc1: all warnings being treated as errors
[1343/2725] Compiling C object drivers/net/igc/base/libigc_base.a.p/igc_base.c.o
[1344/2725] Compiling C object drivers/libtmp_rte_net_ice.a.p/net_ice_ice_ethdev.c.o
[1345/2725] Compiling C object drivers/net/igc/base/libigc_base.a.p/igc_i225.c.o
[1346/2725] Compiling C object drivers/libtmp_rte_net_ice.a.p/net_ice_ice_dcf_parent.c.o
[1347/2725] Compiling C object drivers/libtmp_rte_net_ice.a.p/net_ice_ice_dcf_ethdev.c.o
[1348/2725] Compiling C object drivers/libtmp_rte_net_ice.a.p/net_ice_ice_dcf.c.o
[1349/2725] Compiling C object drivers/libtmp_rte_net_ice.a.p/net_ice_ice_rxtx.c.o
[1350/2725] Compiling C object drivers/libtmp_rte_net_ice.a.p/net_ice_ice_rxtx_vec_avx2.c.o
[1351/2725] Compiling C object drivers/libtmp_rte_net_ice.a.p/net_ice_ice_rxtx_vec_sse.c.o
ninja: build stopped: subcommand failed




*Build Failed #11:
OS: UB2004-32
Target: i686-native-linuxapp-gcc
FAILED: drivers/libtmp_rte_net_ice.a.p/net_ice_ice_fdir_filter.c.o 
gcc -Idrivers/libtmp_rte_net_ice.a.p -Idrivers -I../drivers -Idrivers/net/ice -I../drivers/net/ice -Idrivers/net/ice/base -I../drivers/net/ice/base -Idrivers/common/iavf -I../drivers/common/iavf -Ilib/librte_ethdev -I../lib/librte_ethdev -I. -I.. -Iconfig -I../config -Ilib/librte_eal/include -I../lib/librte_eal/include -Ilib/librte_eal/linux/include -I../lib/librte_eal/linux/include -Ilib/librte_eal/x86/include -I../lib/librte_eal/x86/include -Ilib/librte_eal/common -I../lib/librte_eal/common -Ilib/librte_eal -I../lib/librte_eal -Ilib/librte_kvargs -I../lib/librte_kvargs -Ilib/librte_metrics -I../lib/librte_metrics -Ilib/librte_telemetry -I../lib/librte_telemetry -Ilib/librte_net -I../lib/librte_net -Ilib/librte_mbuf -I../lib/librte_mbuf -Ilib/librte_mempool -I../lib/librte_mempool -Ilib/librte_ring -I../lib/librte_ring -Ilib/librte_meter -I../lib/librte_meter -Idrivers/bus/pci -I../drivers/bus/pci -I../drivers/bus/pci/linux -Ilib/librte_pci -I../lib/librte_pci -Idrivers/bus/vdev -I../drivers/bus/vdev -Ilib/librte_hash -I../lib/librte_hash -Ilib/librte_rcu -I../lib/librte_rcu -fdiagnostics-color=always -pipe -D_FILE_OFFSET_BITS=64 -Wall -Winvalid-pch -Werror -O3 -include rte_config.h -Wextra -Wcast-qual -Wdeprecated -Wformat-nonliteral -Wformat-security -Wmissing-declarations -Wmissing-prototypes -Wnested-externs -Wold-style-definition -Wpointer-arith -Wsign-compare -Wstrict-prototypes -Wundef -Wwrite-strings -Wno-address-of-packed-member -Wno-packed-not-aligned -Wno-missing-field-initializers -Wno-pointer-to-int-cast -D_GNU_SOURCE -m32 -fPIC -march=native -DALLOW_EXPERIMENTAL_API -DALLOW_INTERNAL_API -Wno-format-truncation -DCC_AVX512_SUPPORT -MD -MQ drivers/libtmp_rte_net_ice.a.p/net_ice_ice_fdir_filter.c.o -MF drivers/libtmp_rte_net_ice.a.p/net_ice_ice_fdir_filter.c.o.d -o drivers/libtmp_rte_net_ice.a.p/net_ice_ice_fdir_filter.c.o -c ../drivers/net/ice/ice_fdir_filter.c
../drivers/net/ice/ice_fdir_filter.c: In function ‘ice_fdir_parse’:
../drivers/net/ice/ice_fdir_filter.c:1968:20: error: ‘p_v6’ may be used uninitialized in this function [-Werror=maybe-uninitialized]
 1968 |     p_v6->src_port = sctp_spec->hdr.src_port;
      |     ~~~~~~~~~~~~~~~^~~~~~~~~~~~~~~~~~~~~~~~~
../drivers/net/ice/ice_fdir_filter.c:1663:22: note: ‘p_v6’ was declared here
 1663 |  struct ice_fdir_v6 *p_v6;
      |                      ^~~~
../drivers/net/ice/ice_fdir_filter.c:1891:20: error: ‘p_v4’ may be used uninitialized in this function [-Werror=maybe-uninitialized]
 1891 |     p_v4->src_port = tcp_spec->hdr.src_port;
      |     ~~~~~~~~~~~~~~~^~~~~~~~~~~~~~~~~~~~~~~~
../drivers/net/ice/ice_fdir_filter.c:1662:22: note: ‘p_v4’ was declared here
 1662 |  struct ice_fdir_v4 *p_v4;
      |                      ^~~~
cc1: all warnings being treated as errors
[1193/2296] Linking static target drivers/net/ice/base/libice_base.a
[1194/2296] Compiling C object drivers/libtmp_rte_net_ice.a.p/net_ice_ice_acl_filter.c.o
[1195/2296] Compiling C object drivers/libtmp_rte_net_ice.a.p/net_ice_ice_dcf.c.o
[1196/2296] Compiling C object drivers/libtmp_rte_net_ice.a.p/net_ice_ice_ethdev.c.o
[1197/2296] Compiling C object drivers/libtmp_rte_net_ice.a.p/net_ice_ice_dcf_ethdev.c.o
[1198/2296] Compiling C object drivers/libtmp_rte_net_ice.a.p/net_ice_ice_dcf_parent.c.o
[1199/2296] Compiling C object drivers/libtmp_rte_net_ice.a.p/net_ice_ice_rxtx.c.o
[1200/2296] Compiling C object drivers/libtmp_rte_net_ice.a.p/net_ice_ice_rxtx_vec_avx2.c.o
[1201/2296] Compiling C object drivers/libtmp_rte_net_ice.a.p/net_ice_ice_rxtx_vec_sse.c.o
ninja: build stopped: subcommand failed




*Build Failed #12:
OS: UB2004-64
Target: x86_64-native-linuxapp-gcc
FAILED: drivers/libtmp_rte_net_ice.a.p/net_ice_ice_fdir_filter.c.o 
gcc -Idrivers/libtmp_rte_net_ice.a.p -Idrivers -I../drivers -Idrivers/net/ice -I../drivers/net/ice -Idrivers/net/ice/base -I../drivers/net/ice/base -Idrivers/common/iavf -I../drivers/common/iavf -Ilib/librte_ethdev -I../lib/librte_ethdev -I. -I.. -Iconfig -I../config -Ilib/librte_eal/include -I../lib/librte_eal/include -Ilib/librte_eal/linux/include -I../lib/librte_eal/linux/include -Ilib/librte_eal/x86/include -I../lib/librte_eal/x86/include -Ilib/librte_eal/common -I../lib/librte_eal/common -Ilib/librte_eal -I../lib/librte_eal -Ilib/librte_kvargs -I../lib/librte_kvargs -Ilib/librte_metrics -I../lib/librte_metrics -Ilib/librte_telemetry -I../lib/librte_telemetry -Ilib/librte_net -I../lib/librte_net -Ilib/librte_mbuf -I../lib/librte_mbuf -Ilib/librte_mempool -I../lib/librte_mempool -Ilib/librte_ring -I../lib/librte_ring -Ilib/librte_meter -I../lib/librte_meter -Idrivers/bus/pci -I../drivers/bus/pci -I../drivers/bus/pci/linux -Ilib/librte_pci -I../lib/librte_pci -Idrivers/bus/vdev -I../drivers/bus/vdev -Ilib/librte_hash -I../lib/librte_hash -Ilib/librte_rcu -I../lib/librte_rcu -fdiagnostics-color=always -pipe -D_FILE_OFFSET_BITS=64 -Wall -Winvalid-pch -Werror -O3 -include rte_config.h -Wextra -Wcast-qual -Wdeprecated -Wformat-nonliteral -Wformat-security -Wmissing-declarations -Wmissing-prototypes -Wnested-externs -Wold-style-definition -Wpointer-arith -Wsign-compare -Wstrict-prototypes -Wundef -Wwrite-strings -Wno-address-of-packed-member -Wno-packed-not-aligned -Wno-missing-field-initializers -Wno-zero-length-bounds -D_GNU_SOURCE -fPIC -march=native -DALLOW_EXPERIMENTAL_API -DALLOW_INTERNAL_API -Wno-format-truncation -DCC_AVX512_SUPPORT -MD -MQ drivers/libtmp_rte_net_ice.a.p/net_ice_ice_fdir_filter.c.o -MF drivers/libtmp_rte_net_ice.a.p/net_ice_ice_fdir_filter.c.o.d -o drivers/libtmp_rte_net_ice.a.p/net_ice_ice_fdir_filter.c.o -c ../drivers/net/ice/ice_fdir_filter.c
../drivers/net/ice/ice_fdir_filter.c: In function ‘ice_fdir_parse’:
../drivers/net/ice/ice_fdir_filter.c:1968:20: error: ‘p_v6’ may be used uninitialized in this function [-Werror=maybe-uninitialized]
 1968 |     p_v6->src_port = sctp_spec->hdr.src_port;
      |     ~~~~~~~~~~~~~~~^~~~~~~~~~~~~~~~~~~~~~~~~
../drivers/net/ice/ice_fdir_filter.c:1663:22: note: ‘p_v6’ was declared here
 1663 |  struct ice_fdir_v6 *p_v6;
      |                      ^~~~
../drivers/net/ice/ice_fdir_filter.c:1891:20: error: ‘p_v4’ may be used uninitialized in this function [-Werror=maybe-uninitialized]
 1891 |     p_v4->src_port = tcp_spec->hdr.src_port;
      |     ~~~~~~~~~~~~~~~^~~~~~~~~~~~~~~~~~~~~~~~
../drivers/net/ice/ice_fdir_filter.c:1662:22: note: ‘p_v4’ was declared here
 1662 |  struct ice_fdir_v4 *p_v4;
      |                      ^~~~
cc1: all warnings being treated as errors
[1358/2736] Compiling C object drivers/libtmp_rte_net_ice.a.p/net_ice_ice_dcf_parent.c.o
[1359/2736] Compiling C object drivers/net/igc/base/libigc_base.a.p/igc_manage.c.o
[1360/2736] Compiling C object drivers/libtmp_rte_net_ice.a.p/net_ice_ice_ethdev.c.o
[1361/2736] Compiling C object drivers/libtmp_rte_net_ice.a.p/net_ice_ice_dcf.c.o
[1362/2736] Compiling C object drivers/libtmp_rte_net_ice.a.p/net_ice_ice_dcf_ethdev.c.o
[1363/2736] Compiling C object drivers/net/igc/base/libigc_base.a.p/igc_mac.c.o
[1364/2736] Compiling C object drivers/libtmp_rte_net_ice.a.p/net_ice_ice_rxtx.c.o
[1365/2736] Compiling C object drivers/libtmp_rte_net_ice.a.p/net_ice_ice_rxtx_vec_avx2.c.o
[1366/2736] Compiling C object drivers/libtmp_rte_net_ice.a.p/net_ice_ice_rxtx_vec_sse.c.o
ninja: build stopped: subcommand failed




*Build Failed #13:
OS: UB2004-64
Target: x86_64-native-linuxapp-doc
FAILED: drivers/libtmp_rte_net_ice.a.p/net_ice_ice_fdir_filter.c.o 
gcc -Idrivers/libtmp_rte_net_ice.a.p -Idrivers -I../drivers -Idrivers/net/ice -I../drivers/net/ice -Idrivers/net/ice/base -I../drivers/net/ice/base -Idrivers/common/iavf -I../drivers/common/iavf -Ilib/librte_ethdev -I../lib/librte_ethdev -I. -I.. -Iconfig -I../config -Ilib/librte_eal/include -I../lib/librte_eal/include -Ilib/librte_eal/linux/include -I../lib/librte_eal/linux/include -Ilib/librte_eal/x86/include -I../lib/librte_eal/x86/include -Ilib/librte_eal/common -I../lib/librte_eal/common -Ilib/librte_eal -I../lib/librte_eal -Ilib/librte_kvargs -I../lib/librte_kvargs -Ilib/librte_metrics -I../lib/librte_metrics -Ilib/librte_telemetry -I../lib/librte_telemetry -Ilib/librte_net -I../lib/librte_net -Ilib/librte_mbuf -I../lib/librte_mbuf -Ilib/librte_mempool -I../lib/librte_mempool -Ilib/librte_ring -I../lib/librte_ring -Ilib/librte_meter -I../lib/librte_meter -Idrivers/bus/pci -I../drivers/bus/pci -I../drivers/bus/pci/linux -Ilib/librte_pci -I../lib/librte_pci -Idrivers/bus/vdev -I../drivers/bus/vdev -Ilib/librte_hash -I../lib/librte_hash -Ilib/librte_rcu -I../lib/librte_rcu -fdiagnostics-color=always -pipe -D_FILE_OFFSET_BITS=64 -Wall -Winvalid-pch -Werror -O3 -include rte_config.h -Wextra -Wcast-qual -Wdeprecated -Wformat-nonliteral -Wformat-security -Wmissing-declarations -Wmissing-prototypes -Wnested-externs -Wold-style-definition -Wpointer-arith -Wsign-compare -Wstrict-prototypes -Wundef -Wwrite-strings -Wno-address-of-packed-member -Wno-packed-not-aligned -Wno-missing-field-initializers -D_GNU_SOURCE -fPIC -march=native -DALLOW_EXPERIMENTAL_API -DALLOW_INTERNAL_API -Wno-format-truncation -DCC_AVX512_SUPPORT -MD -MQ drivers/libtmp_rte_net_ice.a.p/net_ice_ice_fdir_filter.c.o -MF drivers/libtmp_rte_net_ice.a.p/net_ice_ice_fdir_filter.c.o.d -o drivers/libtmp_rte_net_ice.a.p/net_ice_ice_fdir_filter.c.o -c ../drivers/net/ice/ice_fdir_filter.c
../drivers/net/ice/ice_fdir_filter.c: In function ‘ice_fdir_parse’:
../drivers/net/ice/ice_fdir_filter.c:1968:20: error: ‘p_v6’ may be used uninitialized in this function [-Werror=maybe-uninitialized]
 1968 |     p_v6->src_port = sctp_spec->hdr.src_port;
      |     ~~~~~~~~~~~~~~~^~~~~~~~~~~~~~~~~~~~~~~~~
../drivers/net/ice/ice_fdir_filter.c:1663:22: note: ‘p_v6’ was declared here
 1663 |  struct ice_fdir_v6 *p_v6;
      |                      ^~~~
../drivers/net/ice/ice_fdir_filter.c:1891:20: error: ‘p_v4’ may be used uninitialized in this function [-Werror=maybe-uninitialized]
 1891 |     p_v4->src_port = tcp_spec->hdr.src_port;
      |     ~~~~~~~~~~~~~~~^~~~~~~~~~~~~~~~~~~~~~~~
../drivers/net/ice/ice_fdir_filter.c:1662:22: note: ‘p_v4’ was declared here
 1662 |  struct ice_fdir_v4 *p_v4;
      |                      ^~~~
cc1: all warnings being treated as errors
[1346/2592] Compiling C object drivers/net/igc/base/libigc_base.a.p/igc_base.c.o
[1347/2592] Compiling C object drivers/libtmp_rte_net_ice.a.p/net_ice_ice_acl_filter.c.o
[1348/2592] Compiling C object drivers/libtmp_rte_net_ice.a.p/net_ice_ice_dcf_parent.c.o
[1349/2592] Compiling C object drivers/libtmp_rte_net_ice.a.p/net_ice_ice_dcf.c.o
[1350/2592] Compiling C object drivers/libtmp_rte_net_ice.a.p/net_ice_ice_dcf_ethdev.c.o
[1351/2592] Compiling C object drivers/libtmp_rte_net_ice.a.p/net_ice_ice_ethdev.c.o
[1352/2592] Compiling C object drivers/libtmp_rte_net_ice.a.p/net_ice_ice_rxtx.c.o
[1353/2592] Compiling C object drivers/libtmp_rte_net_ice.a.p/net_ice_ice_rxtx_vec_avx2.c.o
[1354/2592] Compiling C object drivers/libtmp_rte_net_ice.a.p/net_ice_ice_rxtx_vec_sse.c.o
ninja: build stopped: subcommand failed




*Build Failed #14:
OS: UB2010-64
Target: x86_64-native-linuxapp-gcc
FAILED: drivers/a715181@@tmp_rte_net_ice at sta/net_ice_ice_fdir_filter.c.o 
gcc -Idrivers/a715181@@tmp_rte_net_ice at sta -Idrivers -I../drivers -Idrivers/net/ice -I../drivers/net/ice -Idrivers/net/ice/base -I../drivers/net/ice/base -Idrivers/net/ice/../../common/iavf -I../drivers/net/ice/../../common/iavf -Ilib/librte_ethdev -I../lib/librte_ethdev -I. -I../ -Iconfig -I../config -Ilib/librte_eal/include -I../lib/librte_eal/include -Ilib/librte_eal/linux/include -I../lib/librte_eal/linux/include -Ilib/librte_eal/x86/include -I../lib/librte_eal/x86/include -Ilib/librte_eal/common -I../lib/librte_eal/common -Ilib/librte_eal -I../lib/librte_eal -Ilib/librte_kvargs -I../lib/librte_kvargs -Ilib/librte_telemetry/../librte_metrics -I../lib/librte_telemetry/../librte_metrics -Ilib/librte_telemetry -I../lib/librte_telemetry -Ilib/librte_net -I../lib/librte_net -Ilib/librte_mbuf -I../lib/librte_mbuf -Ilib/librte_mempool -I../lib/librte_mempool -Ilib/librte_ring -I../lib/librte_ring -Ilib/librte_meter -I../lib/librte_meter -Idrivers/bus/pci -I../drivers/bus/pci -I../drivers/bus/pci/linux -Ilib/librte_pci -I../lib/librte_pci -Idrivers/bus/vdev -I../drivers/bus/vdev -Ilib/librte_hash -I../lib/librte_hash -Ilib/librte_rcu -I../lib/librte_rcu -Idrivers/common/iavf -I../drivers/common/iavf -fdiagnostics-color=always -pipe -D_FILE_OFFSET_BITS=64 -Wall -Winvalid-pch -Werror -O3 -include rte_config.h -Wextra -Wcast-qual -Wdeprecated -Wformat-nonliteral -Wformat-security -Wmissing-declarations -Wmissing-prototypes -Wnested-externs -Wold-style-definition -Wpointer-arith -Wsign-compare -Wstrict-prototypes -Wundef -Wwrite-strings -Wno-address-of-packed-member -Wno-packed-not-aligned -Wno-missing-field-initializers -Wno-zero-length-bounds -D_GNU_SOURCE -fPIC -march=native -DALLOW_EXPERIMENTAL_API -DALLOW_INTERNAL_API -Wno-format-truncation -DCC_AVX512_SUPPORT -MD -MQ 'drivers/a715181@@tmp_rte_net_ice at sta/net_ice_ice_fdir_filter.c.o' -MF 'drivers/a715181@@tmp_rte_net_ice at sta/net_ice_ice_fdir_filter.c.o.d' -o 'drivers/a715181@@tmp_rte_net_ice at sta/net_ice_ice_fdir_filter.c.o' -c ../drivers/net/ice/ice_fdir_filter.c
../drivers/net/ice/ice_fdir_filter.c: In function ‘ice_fdir_parse’:
../drivers/net/ice/ice_fdir_filter.c:1968:20: error: ‘p_v6’ may be used uninitialized in this function [-Werror=maybe-uninitialized]
 1968 |     p_v6->src_port = sctp_spec->hdr.src_port;
      |     ~~~~~~~~~~~~~~~^~~~~~~~~~~~~~~~~~~~~~~~~
../drivers/net/ice/ice_fdir_filter.c:1663:22: note: ‘p_v6’ was declared here
 1663 |  struct ice_fdir_v6 *p_v6;
      |                      ^~~~
../drivers/net/ice/ice_fdir_filter.c:1891:20: error: ‘p_v4’ may be used uninitialized in this function [-Werror=maybe-uninitialized]
 1891 |     p_v4->src_port = tcp_spec->hdr.src_port;
      |     ~~~~~~~~~~~~~~~^~~~~~~~~~~~~~~~~~~~~~~~
../drivers/net/ice/ice_fdir_filter.c:1662:22: note: ‘p_v4’ was declared here
 1662 |  struct ice_fdir_v4 *p_v4;
      |                      ^~~~
cc1: all warnings being treated as errors
[1363/2739] Compiling C object 'drivers/a715181@@tmp_rte_net_ice at sta/net_ice_ice_acl_filter.c.o'.
[1364/2739] Compiling C object 'drivers/a715181@@tmp_rte_net_ice at sta/net_ice_ice_dcf.c.o'.
[1365/2739] Compiling C object 'drivers/net/igc/base/94439f5@@igc_base at sta/igc_manage.c.o'.
[1366/2739] Compiling C object 'drivers/a715181@@tmp_rte_net_ice at sta/net_ice_ice_dcf_parent.c.o'.
[1367/2739] Compiling C object 'drivers/net/igc/base/94439f5@@igc_base at sta/igc_nvm.c.o'.
[1368/2739] Compiling C object 'drivers/a715181@@tmp_rte_net_ice at sta/net_ice_ice_dcf_ethdev.c.o'.
[1369/2739] Compiling C object 'drivers/a715181@@tmp_rte_net_ice at sta/net_ice_ice_rxtx_vec_sse.c.o'.
[1370/2739] Compiling C object 'drivers/a715181@@tmp_rte_net_ice at sta/net_ice_ice_rxtx_vec_avx2.c.o'.
[1371/2739] Compiling C object 'drivers/a715181@@tmp_rte_net_ice at sta/net_ice_ice_rxtx.c.o'.
ninja: build stopped: subcommand failed


DPDK STV team


More information about the test-report mailing list