[dpdk-test-report] |FAILURE| pw(84589) [RFC, v1] build: add platform meson option

sys_stv at intel.com sys_stv at intel.com
Thu Nov 26 19:16:53 CET 2020


Test-Label: Intel-compilation
Test-Status: FAILURE
http://dpdk.org/patch/84589

_Compilation issues_

Submitter: Juraj Linkeš <juraj.linkes at pantheon.tech>
Date: 2020-11-26 15:47:29
Reply_mail: 1606405649-4308-1-git-send-email-juraj.linkes at pantheon.tech

DPDK git baseline: Repo:dpdk, CommitID: ad709fa90178579e8533537f70c6a71ffe08a753


Meson Build Summary: 22 Builds Done, 20 Successful, 2 Failures, 0 Blocked

+----------------+------------+--------------+------------+------------+-----------+----------+
| os             | gcc-static | clang-static | icc-static | gcc-shared | gcc-debug | document |
+----------------+------------+--------------+------------+------------+-----------+----------+
| CENTOS82-64    | pass       | pass         | FAIL       | pass       | pass      |          |
| RHEL82-64      | pass       |              |            |            |           |          |
| UB1804-64      | pass       |              |            |            |           |          |
| FC33-64        | pass       | pass         |            |            |           |          |
| UB2010-64      | pass       |              |            |            |           |          |
| UB2004-64      | pass       | pass         | FAIL       |            |           | pass     |
| WIN10-64       |            | pass         |            |            |           |          |
| UB2004-32      | pass       |              |            |            |           |          |
| FreeBSD1201-64 | pass       | pass         |            | pass       | pass      |          |
| SUSE15-64      | pass       | pass         |            |            |           |          |
+----------------+------------+--------------+------------+------------+-----------+----------+
Test environment and configuration as below:


OS: CENTOS82-64
	Kernel Version: 4.18.0-193.14.2.el8_2.x86_64
	CPU info: Intel(R) Xeon(R) Platinum 8280M CPU @ 2.70GHz
	GCC Version: gcc (GCC) 8.3.1 20191121 (Red Hat 8.3.1-5)
	Clang Version: 9.0.1 (Red Hat 9.0.1-2.module_el8.2.0+309+0c7b6b03)
	x86_64-native-linuxapp-gcc
	x86_64-native-linuxapp-clang
	x86_64-native-linuxapp-icc
	x86_64-native-linuxapp-gcc+shared
	x86_64-native-linuxapp-gcc+debug

OS: RHEL82-64
	Kernel Version: 4.18.0-193.el8.x86_64
	CPU info: Intel(R) Xeon(R) CPU E5-2699 v4 @ 2.20GHz
	GCC Version: gcc (GCC) 8.3.1 20191121 (Red Hat 8.3.1-5)
	Clang Version: 8.0.1 (Red Hat 8.0.1-1.module_el8.1.0+215+a01033fb)
	x86_64-native-linuxapp-gcc

OS: UB1804-64
	Kernel Version: 5.3.0-59-generic
	CPU info: Intel(R) Xeon(R) Platinum 8180 CPU @ 2.50GHz
	GCC Version: gcc (Ubuntu 8.4.0-1ubuntu1~18.04) 8.4.0
	Clang Version: 6.0.0-1ubuntu2 (tags/RELEASE_600/final)
	x86_64-native-linuxapp-gcc

OS: FC33-64
	Kernel Version: 5.8.16-300.fc33.x86_64
	CPU info: Intel(R) Xeon(R) CPU E5-2699 v4 @ 2.20GHz
	GCC Version: gcc (GCC) 10.2.1 20201005 (Red Hat 10.2.1-5)
	Clang Version: 11.0.0 (Fedora 11.0.0-1.fc33)
	x86_64-native-linuxapp-gcc
	x86_64-native-linuxapp-clang

OS: UB2010-64
	Kernel Version: 5.8.0-25-generic
	CPU info: Intel(R) Xeon(R) CPU E5-2699 v4 @ 2.20GHz
	GCC Version: gcc (Ubuntu 10.2.0-13ubuntu1) 10.2.0
	Clang Version: 11.0.0-2
	x86_64-native-linuxapp-gcc

OS: UB2004-64
	Kernel Version: 5.4.0-47-generic
	CPU info: Intel(R) Xeon(R) Platinum 8180 CPU @ 2.50GHz
	GCC Version: gcc (Ubuntu 10-20200416-0ubuntu1) 10.0.1 20200416 (experimental) [master revision 3c3f12e2a76:dcee354ce56:44b326839d864fc10c459916abcc97f35a9ac3de]
	Clang Version: 10.0.0-4ubuntu1
	x86_64-native-linuxapp-clang
	x86_64-native-linuxapp-gcc
	x86_64-native-linuxapp-icc
	x86_64-native-linuxapp-doc

OS: WIN10-64
	Kernel Version: N/A
	CPU info: N/A
	GCC Version: N/A
	Clang Version: Clang 8.0.0
	x86_64-windows-clang

OS: UB2004-32
	Kernel Version: 5.4.0-47-generic
	CPU info: Intel(R) Xeon(R) Platinum 8180 CPU @ 2.50GHz
	GCC Version: gcc (Ubuntu 9.3.0-10ubuntu2) 9.3.0
	Clang Version: 10.0.0-4ubuntu1
	i686-native-linuxapp-gcc

OS: FreeBSD1201-64
	Kernel Version: 12.1-RELEASE
	CPU info: Intel(R) Xeon(R) CPU E5-2699 v3 @ 2.30GHz (2294.74-MHz K8-class CPU)
	GCC Version: gcc (FreeBSD Ports Collection) 9.2.0
	Clang Version: 8.0.1 (tags/RELEASE_801/final 366581) (based on LLVM 8.0.1)
	x86_64-native-bsdapp-gcc
	x86_64-native-bsdapp-clang
	x86_64-native-bsdapp-gcc+shared
	x86_64-native-bsdapp-gcc+debug

OS: SUSE15-64
	Kernel Version: 4.12.14-lp150.11-default
	CPU info: Intel(R) Xeon(R) CPU E5-2699 v4 @ 2.20GHz
	GCC Version: gcc (SUSE Linux) 7.3.1 20180323 [gcc-7-branch revision 258812]
	Clang Version: 5.0.1 (tags/RELEASE_501/final 312548)
	x86_64-native-linuxapp-clang
	x86_64-native-linuxapp-gcc



*Build Failed #1:
OS: CENTOS82-64
Target: x86_64-native-linuxapp-icc
FAILED: lib/librte_vhost.a.p/librte_vhost_vhost_crypto.c.o 
icc -Ilib/librte_vhost.a.p -Ilib -I../lib -Ilib/librte_vhost -I../lib/librte_vhost -I. -I.. -Iconfig -I../config -Ilib/librte_eal/include -I../lib/librte_eal/include -Ilib/librte_eal/linux/include -I../lib/librte_eal/linux/include -Ilib/librte_eal/x86/include -I../lib/librte_eal/x86/include -Ilib/librte_eal/common -I../lib/librte_eal/common -Ilib/librte_eal -I../lib/librte_eal -Ilib/librte_kvargs -I../lib/librte_kvargs -Ilib/librte_metrics -I../lib/librte_metrics -Ilib/librte_telemetry -I../lib/librte_telemetry -Ilib/librte_ethdev -I../lib/librte_ethdev -Ilib/librte_net -I../lib/librte_net -Ilib/librte_mbuf -I../lib/librte_mbuf -Ilib/librte_mempool -I../lib/librte_mempool -Ilib/librte_ring -I../lib/librte_ring -Ilib/librte_meter -I../lib/librte_meter -Ilib/librte_cryptodev -I../lib/librte_cryptodev -Ilib/librte_hash -I../lib/librte_hash -Ilib/librte_rcu -I../lib/librte_rcu -Ilib/librte_pci -I../lib/librte_pci -pipe -D_FILE_OFFSET_BITS=64 -Wall -w3 -diag-disable:remark -Werror -O3 -include rte_config.h -Wextra -Wcast-qual -Wdeprecated -Wformat -Wformat-security -Wmissing-declarations -Wmissing-prototypes -Wold-style-definition -Wpointer-arith -Wsign-compare -Wstrict-prototypes -Wundef -Wwrite-strings -Wno-missing-field-initializers -diag-disable=181 -diag-disable=188 -diag-disable=2203 -diag-disable=2279 -diag-disable=2557 -diag-disable=3179 -diag-disable=3656 -D_GNU_SOURCE -fPIC -march=corei7 -mno-avx512f -DALLOW_EXPERIMENTAL_API -DALLOW_INTERNAL_API -fno-strict-aliasing -MD -MQ lib/librte_vhost.a.p/librte_vhost_vhost_crypto.c.o -MF lib/librte_vhost.a.p/librte_vhost_vhost_crypto.c.o.d -o lib/librte_vhost.a.p/librte_vhost_vhost_crypto.c.o -c ../lib/librte_vhost/vhost_crypto.c
icc: error #10106: Fatal error in /opt/intel/compilers_and_libraries_2020.1.217/linux/bin/intel64/mcpcom, terminated by kill signal
compilation aborted for ../lib/librte_vhost/vhost_crypto.c (code 1)
[1698/2742] Compiling C object drivers/libtmp_rte_net_thunderx.a.p/net_thunderx_nicvf_ethdev.c.o
[1699/2742] Generating rte_net_tap.sym_chk with a meson_exe.py custom command
[1700/2742] Generating rte_net_vdev_netvsc.sym_chk with a meson_exe.py custom command
[1701/2742] Compiling C object drivers/libtmp_rte_net_vhost.a.p/net_vhost_rte_eth_vhost.c.o
[1702/2742] Compiling C object drivers/libtmp_rte_net_virtio.a.p/net_virtio_virtqueue.c.o
[1703/2742] Compiling C object drivers/libtmp_rte_net_virtio.a.p/net_virtio_virtio_rxtx_simple.c.o
[1704/2742] Compiling C object drivers/libtmp_rte_net_virtio.a.p/net_virtio_virtio_rxtx_simple_sse.c.o
[1705/2742] Compiling C object drivers/libtmp_rte_net_virtio.a.p/net_virtio_virtio_rxtx.c.o
[1706/2742] Compiling C object drivers/libtmp_rte_net_txgbe.a.p/net_txgbe_txgbe_rxtx.c.o
[1707/2742] Compiling C object drivers/libtmp_rte_net_octeontx2.a.p/net_octeontx2_otx2_tx.c.o
[1708/2742] Compiling C object lib/librte_pipeline.a.p/librte_pipeline_rte_table_action.c.o
FAILED: lib/librte_pipeline.a.p/librte_pipeline_rte_table_action.c.o 
icc -Ilib/librte_pipeline.a.p -Ilib -I../lib -Ilib/librte_pipeline -I../lib/librte_pipeline -I. -I.. -Iconfig -I../config -Ilib/librte_eal/include -I../lib/librte_eal/include -Ilib/librte_eal/linux/include -I../lib/librte_eal/linux/include -Ilib/librte_eal/x86/include -I../lib/librte_eal/x86/include -Ilib/librte_eal/common -I../lib/librte_eal/common -Ilib/librte_eal -I../lib/librte_eal -Ilib/librte_kvargs -I../lib/librte_kvargs -Ilib/librte_metrics -I../lib/librte_metrics -Ilib/librte_telemetry -I../lib/librte_telemetry -Ilib/librte_port -I../lib/librte_port -Ilib/librte_ethdev -I../lib/librte_ethdev -Ilib/librte_net -I../lib/librte_net -Ilib/librte_mbuf -I../lib/librte_mbuf -Ilib/librte_mempool -I../lib/librte_mempool -Ilib/librte_ring -I../lib/librte_ring -Ilib/librte_meter -I../lib/librte_meter -Ilib/librte_sched -I../lib/librte_sched -Ilib/librte_ip_frag -I../lib/librte_ip_frag -Ilib/librte_hash -I../lib/librte_hash -Ilib/librte_rcu -I../lib/librte_rcu -Ilib/librte_cryptodev -I../lib/librte_cryptodev -Ilib/librte_eventdev -I../lib/librte_eventdev -Ilib/librte_timer -I../lib/librte_timer -Ilib/librte_kni -I../lib/librte_kni -Ilib/librte_pci -I../lib/librte_pci -Ilib/librte_table -I../lib/librte_table -Ilib/librte_lpm -I../lib/librte_lpm -Ilib/librte_acl -I../lib/librte_acl -pipe -D_FILE_OFFSET_BITS=64 -Wall -w3 -diag-disable:remark -Werror -O3 -include rte_config.h -Wextra -Wcast-qual -Wdeprecated -Wformat -Wformat-security -Wmissing-declarations -Wmissing-prototypes -Wold-style-definition -Wpointer-arith -Wsign-compare -Wstrict-prototypes -Wundef -Wwrite-strings -Wno-missing-field-initializers -diag-disable=181 -diag-disable=188 -diag-disable=2203 -diag-disable=2279 -diag-disable=2557 -diag-disable=3179 -diag-disable=3656 -D_GNU_SOURCE -fPIC -march=corei7 -mno-avx512f -DALLOW_EXPERIMENTAL_API -DALLOW_INTERNAL_API -MD -MQ lib/librte_pipeline.a.p/librte_pipeline_rte_table_action.c.o -MF lib/librte_pipeline.a.p/librte_pipeline_rte_table_action.c.o.d -o lib/librte_pipeline.a.p/librte_pipeline_rte_table_action.c.o -c ../lib/librte_pipeline/rte_table_action.c
icc: error #10106: Fatal error in /opt/intel/compilers_and_libraries_2020.1.217/linux/bin/intel64/mcpcom, terminated by kill signal
compilation aborted for ../lib/librte_pipeline/rte_table_action.c (code 1)
ninja: build stopped: subcommand failed




*Build Failed #2:
OS: UB2004-64
Target: x86_64-native-linuxapp-icc
FAILED: lib/librte_vhost.a.p/librte_vhost_vhost_crypto.c.o 
icc -Ilib/librte_vhost.a.p -Ilib -I../lib -Ilib/librte_vhost -I../lib/librte_vhost -I. -I.. -Iconfig -I../config -Ilib/librte_eal/include -I../lib/librte_eal/include -Ilib/librte_eal/linux/include -I../lib/librte_eal/linux/include -Ilib/librte_eal/x86/include -I../lib/librte_eal/x86/include -Ilib/librte_eal/common -I../lib/librte_eal/common -Ilib/librte_eal -I../lib/librte_eal -Ilib/librte_kvargs -I../lib/librte_kvargs -Ilib/librte_metrics -I../lib/librte_metrics -Ilib/librte_telemetry -I../lib/librte_telemetry -Ilib/librte_ethdev -I../lib/librte_ethdev -Ilib/librte_net -I../lib/librte_net -Ilib/librte_mbuf -I../lib/librte_mbuf -Ilib/librte_mempool -I../lib/librte_mempool -Ilib/librte_ring -I../lib/librte_ring -Ilib/librte_meter -I../lib/librte_meter -Ilib/librte_cryptodev -I../lib/librte_cryptodev -Ilib/librte_hash -I../lib/librte_hash -Ilib/librte_rcu -I../lib/librte_rcu -Ilib/librte_pci -I../lib/librte_pci -pipe -D_FILE_OFFSET_BITS=64 -Wall -w3 -diag-disable:remark -Werror -O3 -include rte_config.h -Wextra -Wcast-qual -Wdeprecated -Wformat -Wformat-security -Wmissing-declarations -Wmissing-prototypes -Wold-style-definition -Wpointer-arith -Wsign-compare -Wstrict-prototypes -Wundef -Wwrite-strings -Wno-missing-field-initializers -diag-disable=181 -diag-disable=188 -diag-disable=2203 -diag-disable=2279 -diag-disable=2557 -diag-disable=3179 -diag-disable=3656 -D_GNU_SOURCE -fPIC -march=corei7 -DALLOW_EXPERIMENTAL_API -DALLOW_INTERNAL_API -fno-strict-aliasing -MD -MQ lib/librte_vhost.a.p/librte_vhost_vhost_crypto.c.o -MF lib/librte_vhost.a.p/librte_vhost_vhost_crypto.c.o.d -o lib/librte_vhost.a.p/librte_vhost_vhost_crypto.c.o -c ../lib/librte_vhost/vhost_crypto.c
icc: error #10106: Fatal error in /opt/intel/compilers_and_libraries_2020.1.217/linux/bin/intel64/mcpcom, terminated by kill signal
compilation aborted for ../lib/librte_vhost/vhost_crypto.c (code 1)
[1973/2745] Compiling C object drivers/libtmp_rte_net_octeontx2.a.p/net_octeontx2_otx2_tx.c.o
[1974/2745] Generating rte_crypto_dpaa_sec.sym_chk with a meson_exe.py custom command
[1975/2745] Compiling C object drivers/libtmp_rte_crypto_scheduler.a.p/crypto_scheduler_rte_cryptodev_scheduler.c.o
[1976/2745] Compiling C object drivers/libtmp_rte_crypto_scheduler.a.p/crypto_scheduler_scheduler_pkt_size_distr.c.o
[1977/2745] Compiling C object drivers/libtmp_rte_crypto_openssl.a.p/crypto_openssl_rte_openssl_pmd.c.o
[1978/2745] Compiling C object drivers/libtmp_rte_crypto_octeontx.a.p/crypto_octeontx_otx_cryptodev_ops.c.o
[1979/2745] Compiling C object drivers/libtmp_rte_crypto_octeontx2.a.p/crypto_octeontx2_otx2_cryptodev_ops.c.o
[1980/2745] Compiling C object drivers/libtmp_rte_crypto_ccp.a.p/crypto_ccp_ccp_crypto.c.o
[1981/2745] Compiling C object lib/librte_pipeline.a.p/librte_pipeline_rte_table_action.c.o
FAILED: lib/librte_pipeline.a.p/librte_pipeline_rte_table_action.c.o 
icc -Ilib/librte_pipeline.a.p -Ilib -I../lib -Ilib/librte_pipeline -I../lib/librte_pipeline -I. -I.. -Iconfig -I../config -Ilib/librte_eal/include -I../lib/librte_eal/include -Ilib/librte_eal/linux/include -I../lib/librte_eal/linux/include -Ilib/librte_eal/x86/include -I../lib/librte_eal/x86/include -Ilib/librte_eal/common -I../lib/librte_eal/common -Ilib/librte_eal -I../lib/librte_eal -Ilib/librte_kvargs -I../lib/librte_kvargs -Ilib/librte_metrics -I../lib/librte_metrics -Ilib/librte_telemetry -I../lib/librte_telemetry -Ilib/librte_port -I../lib/librte_port -Ilib/librte_ethdev -I../lib/librte_ethdev -Ilib/librte_net -I../lib/librte_net -Ilib/librte_mbuf -I../lib/librte_mbuf -Ilib/librte_mempool -I../lib/librte_mempool -Ilib/librte_ring -I../lib/librte_ring -Ilib/librte_meter -I../lib/librte_meter -Ilib/librte_sched -I../lib/librte_sched -Ilib/librte_ip_frag -I../lib/librte_ip_frag -Ilib/librte_hash -I../lib/librte_hash -Ilib/librte_rcu -I../lib/librte_rcu -Ilib/librte_cryptodev -I../lib/librte_cryptodev -Ilib/librte_eventdev -I../lib/librte_eventdev -Ilib/librte_timer -I../lib/librte_timer -Ilib/librte_kni -I../lib/librte_kni -Ilib/librte_pci -I../lib/librte_pci -Ilib/librte_table -I../lib/librte_table -Ilib/librte_lpm -I../lib/librte_lpm -Ilib/librte_acl -I../lib/librte_acl -pipe -D_FILE_OFFSET_BITS=64 -Wall -w3 -diag-disable:remark -Werror -O3 -include rte_config.h -Wextra -Wcast-qual -Wdeprecated -Wformat -Wformat-security -Wmissing-declarations -Wmissing-prototypes -Wold-style-definition -Wpointer-arith -Wsign-compare -Wstrict-prototypes -Wundef -Wwrite-strings -Wno-missing-field-initializers -diag-disable=181 -diag-disable=188 -diag-disable=2203 -diag-disable=2279 -diag-disable=2557 -diag-disable=3179 -diag-disable=3656 -D_GNU_SOURCE -fPIC -march=corei7 -DALLOW_EXPERIMENTAL_API -DALLOW_INTERNAL_API -MD -MQ lib/librte_pipeline.a.p/librte_pipeline_rte_table_action.c.o -MF lib/librte_pipeline.a.p/librte_pipeline_rte_table_action.c.o.d -o lib/librte_pipeline.a.p/librte_pipeline_rte_table_action.c.o -c ../lib/librte_pipeline/rte_table_action.c
icc: error #10106: Fatal error in /opt/intel/compilers_and_libraries_2020.1.217/linux/bin/intel64/mcpcom, terminated by kill signal
compilation aborted for ../lib/librte_pipeline/rte_table_action.c (code 1)
ninja: build stopped: subcommand failed


DPDK STV team


More information about the test-report mailing list