[dpdk-test-report] |FAILURE| pw80792-80794 [PATCH] [v7, 3/3] pmdinfogen: remove C implementation

dpdklab at iol.unh.edu dpdklab at iol.unh.edu
Wed Oct 14 20:44:18 CEST 2020


Test-Label: Performance-Testing
Test-Status: FAILURE
http://dpdk.org/patch/80792

_build patch failure_

Submitter: Dmitry Kozlyuk <dmitry.kozliuk at gmail.com>
Date: Wednesday, October 14 2020 18:31:36 
Applied on: CommitID:9d3ad80abd34f2420998d94606e208518d330bcc
Apply patch set 80792-80794 failed:

ninja: error: loading 'build.ninja': No such file or directory

https://lab.dpdk.org/results/dashboard/patchsets/13713/

UNH-IOL DPDK Community Lab


More information about the test-report mailing list