[dpdk-test-report] |FAILURE| pw82656 [PATCH] [v1] regex/mlx5: add out of order scan capability

dpdklab at iol.unh.edu dpdklab at iol.unh.edu
Wed Oct 28 14:59:49 CET 2020


Test-Label: Performance-Testing
Test-Status: FAILURE
http://dpdk.org/patch/82656

_build patch failure_

Submitter: Ophir Munk <ophirmu at nvidia.com>
Date: Wednesday, October 28 2020 13:18:58 
Applied on: CommitID:c3afd1cba69bd7a900fd63c02cc87fba8d74430a
Apply patch set 82656 failed:

[1/503] Linking static target drivers/libtmp_rte_crypto_ccp.a.
[2/503] Linking static target drivers/libtmp_rte_crypto_dpaa_sec.a.
[3/503] Linking static target drivers/libtmp_rte_crypto_dpaa2_sec.a.
[4/503] Linking static target drivers/libtmp_rte_crypto_octeontx2.a.
[5/503] Linking static target drivers/libtmp_rte_crypto_openssl.a.
[6/503] Compiling C object 'drivers/a715181@@rte_crypto_virtio at sta/meson-generated_.._rte_crypto_virtio.pmd.c.o'.
[7/503] Linking static target drivers/libtmp_rte_net_mlx5.a.
[8/503] Linking static target drivers/libtmp_rte_crypto_scheduler.a.
[9/503] Linking static target drivers/libtmp_rte_compress_zlib.a.
[10/503] Compiling C object 'drivers/a715181@@rte_crypto_virtio at sha/meson-generated_.._rte_crypto_virtio.pmd.c.o'.
[11/503] Generating rte_crypto_dpaa_sec.pmd.c with a custom command.
[12/503] Linking static target drivers/librte_crypto_virtio.a.
[13/503] Generating rte_crypto_ccp.pmd.c with a custom command.
[14/503] Generating rte_crypto_openssl.pmd.c with a custom command.
[15/503] Generating rte_compress_zlib.pmd.c with a custom command.
[16/503] Generating rte_regex_octeontx2_regex_def with a custom command.
[17/503] Generating rte_crypto_dpaa2_sec.pmd.c with a custom command.
[18/503] Generating rte_crypto_octeontx2.pmd.c with a custom command.
[19/503] Linking target drivers/librte_crypto_caam_jr.so.21.0.
[20/503] Linking target drivers/librte_compress_octeontx.so.21.0.
[21/503] Generating rte_regex_octeontx2_regex_mingw with a custom command.
[22/503] Compiling C object 'drivers/a715181@@rte_crypto_dpaa_sec at sta/meson-generated_.._rte_crypto_dpaa_sec.pmd.c.o'.
[23/503] Compiling C object 'drivers/a715181@@rte_crypto_ccp at sta/meson-generated_.._rte_crypto_ccp.pmd.c.o'.
[24/503] Compiling C object 'drivers/a715181@@rte_crypto_ccp at sha/meson-generated_.._rte_crypto_ccp.pmd.c.o'.
[25/503] Compiling C object 'drivers/a715181@@rte_crypto_dpaa_sec at sha/meson-generated_.._rte_crypto_dpaa_sec.pmd.c.o'.
[26/503] Compiling C object 'drivers/a715181@@rte_crypto_openssl at sta/meson-generated_.._rte_crypto_openssl.pmd.c.o'.
[27/503] Generating rte_crypto_scheduler.pmd.c with a custom command.
[28/503] Compiling C object 'drivers/a715181@@rte_crypto_dpaa2_sec at sha/meson-generated_.._rte_crypto_dpaa2_sec.pmd.c.o'.
[29/503] Compiling C object 'drivers/a715181@@rte_crypto_dpaa2_sec at sta/meson-generated_.._rte_crypto_dpaa2_sec.pmd.c.o'.
[30/503] Compiling C object 'drivers/a715181@@rte_crypto_octeontx2 at sta/meson-generated_.._rte_crypto_octeontx2.pmd.c.o'.
[31/503] Compiling C object 'drivers/a715181@@rte_crypto_octeontx2 at sha/meson-generated_.._rte_crypto_octeontx2.pmd.c.o'.
[32/503] Compiling C object 'drivers/a715181@@rte_crypto_openssl at sha/meson-generated_.._rte_crypto_openssl.pmd.c.o'.
[33/503] Linking static target drivers/librte_crypto_dpaa_sec.a.
[34/503] Linking static target drivers/librte_crypto_ccp.a.
[35/503] Compiling C object 'drivers/a715181@@rte_compress_zlib at sta/meson-generated_.._rte_compress_zlib.pmd.c.o'.
[36/503] Compiling C object 'drivers/a715181@@rte_compress_zlib at sha/meson-generated_.._rte_compress_zlib.pmd.c.o'.
[37/503] Linking static target drivers/librte_crypto_openssl.a.
[38/503] Linking static target drivers/librte_crypto_dpaa2_sec.a.
[39/503] Linking static target drivers/librte_crypto_octeontx2.a.
[40/503] Compiling C object 'drivers/a715181@@rte_crypto_scheduler at sta/meson-generated_.._rte_crypto_scheduler.pmd.c.o'.
[41/503] Compiling C object 'drivers/a715181@@rte_crypto_scheduler at sha/meson-generated_.._rte_crypto_scheduler.pmd.c.o'.
[42/503] Linking static target drivers/librte_compress_zlib.a.
[43/503] Generating rte_vdpa_ifc_def with a custom command.
[44/503] Linking static target drivers/librte_crypto_scheduler.a.
[45/503] Generating rte_vdpa_ifc_mingw with a custom command.
[46/503] Generating rte_net_mlx5.pmd.c with a custom command.
[47/503] Compiling C object 'drivers/a715181@@rte_net_mlx5 at sta/meson-generated_.._rte_net_mlx5.pmd.c.o'.
[48/503] Compiling C object 'drivers/a715181@@tmp_rte_vdpa_ifc at sta/vdpa_ifc_base_ifcvf.c.o'.
[49/503] Compiling C object 'drivers/a715181@@tmp_rte_regex_octeontx2_regex at sta/regex_octeontx2_otx2_regexdev_compiler.c.o'.
[50/503] Compiling C object 'drivers/a715181@@rte_net_mlx5 at sha/meson-generated_.._rte_net_mlx5.pmd.c.o'.
[51/503] Compiling C object 'drivers/a715181@@tmp_rte_regex_octeontx2_regex at sta/regex_octeontx2_otx2_regexdev_hw_access.c.o'.
[52/503] Compiling C object 'drivers/a715181@@tmp_rte_regex_mlx5 at sta/regex_mlx5_mlx5_rxp.c.o'.
FAILED: drivers/a715181@@tmp_rte_regex_mlx5 at sta/regex_mlx5_mlx5_rxp.c.o 
cc -Idrivers/a715181@@tmp_rte_regex_mlx5 at sta -Idrivers -I../drivers -Idrivers/regex/mlx5 -I../drivers/regex/mlx5 -Ilib/librte_ethdev -I../lib/librte_ethdev -I. -I../ -Iconfig -I../config -Ilib/librte_eal/include -I../lib/librte_eal/include -Ilib/librte_eal/linux/include -I../lib/librte_eal/linux/include -Ilib/librte_eal/x86/include -I../lib/librte_eal/x86/include -Ilib/librte_eal/common -I../lib/librte_eal/common -Ilib/librte_eal -I../lib/librte_eal -Ilib/librte_kvargs -I../lib/librte_kvargs -Ilib/librte_telemetry/../librte_metrics -I../lib/librte_telemetry/../librte_metrics -Ilib/librte_telemetry -I../lib/librte_telemetry -Ilib/librte_net -I../lib/librte_net -Ilib/librte_mbuf -I../lib/librte_mbuf -Ilib/librte_mempool -I../lib/librte_mempool -Ilib/librte_ring -I../lib/librte_ring -Ilib/librte_meter -I../lib/librte_meter -Idrivers/common/mlx5 -I../drivers/common/mlx5 -Idrivers/common/mlx5/linux -I../drivers/common/mlx5/linux -Ilib/librte_hash -I../lib/librte_hash -Ilib/librte_rcu -I../lib/librte_rcu -Ilib/librte_pci -I../lib/librte_pci -Idrivers/bus/pci -I../drivers/bus/pci -I../drivers/bus/pci/linux -Ilib/librte_regexdev -I../lib/librte_regexdev -fdiagnostics-color=always -pipe -D_FILE_OFFSET_BITS=64 -Wall -Winvalid-pch -O3 -include rte_config.h -Wextra -Wcast-qual -Wdeprecated -Wformat-nonliteral -Wformat-security -Wmissing-declarations -Wmissing-prototypes -Wnested-externs -Wold-style-definition -Wpointer-arith -Wsign-compare -Wstrict-prototypes -Wundef -Wwrite-strings -Wno-missing-field-initializers -D_GNU_SOURCE -fPIC -march=native -DALLOW_EXPERIMENTAL_API -DALLOW_INTERNAL_API -Wno-format-truncation -std=c11 -Wno-strict-prototypes -D_BSD_SOURCE -D_DEFAULT_SOURCE -D_XOPEN_SOURCE=600 -MD -MQ 'drivers/a715181@@tmp_rte_regex_mlx5 at sta/regex_mlx5_mlx5_rxp.c.o' -MF 'drivers/a715181@@tmp_rte_regex_mlx5 at sta/regex_mlx5_mlx5_rxp.c.o.d' -o 'drivers/a715181@@tmp_rte_regex_mlx5 at sta/regex_mlx5_mlx5_rxp.c.o' -c ../drivers/regex/mlx5/mlx5_rxp.c
../drivers/regex/mlx5/mlx5_rxp.c: In function ‘mlx5_regex_info_get’:
../drivers/regex/mlx5/mlx5_rxp.c:120:10: error: ‘RTE_REGEXDEV_CAPA_QUEUE_PAIR_OOS_F’ undeclared (first use in this function); did you mean ‘RTE_REGEX_QUEUE_PAIR_CFG_OOS_F’?
          RTE_REGEXDEV_CAPA_QUEUE_PAIR_OOS_F;
          ^~~~~~~~~~~~~~~~~~~~~~~~~~~~~~~~~~
          RTE_REGEX_QUEUE_PAIR_CFG_OOS_F
../drivers/regex/mlx5/mlx5_rxp.c:120:10: note: each undeclared identifier is reported only once for each function it appears in
[53/503] Linking static target drivers/librte_net_mlx5.a.
[54/503] Compiling C object 'drivers/a715181@@tmp_rte_regex_octeontx2_regex at sta/regex_octeontx2_otx2_regexdev_mbox.c.o'.
[55/503] Generating rte_crypto_virtio.sym_chk with a meson_exe.py custom command.
[56/503] Generating rte_compress_zlib.sym_chk with a meson_exe.py custom command.
[57/503] Generating rte_crypto_openssl.sym_chk with a meson_exe.py custom command.
[58/503] Compiling C object 'drivers/a715181@@tmp_rte_vdpa_mlx5 at sta/vdpa_mlx5_mlx5_vdpa_mem.c.o'.
[59/503] Generating rte_crypto_octeontx2.sym_chk with a meson_exe.py custom command.
[60/503] Generating rte_crypto_dpaa2_sec.sym_chk with a meson_exe.py custom command.
[61/503] Generating rte_crypto_dpaa_sec.sym_chk with a meson_exe.py custom command.
[62/503] Generating rte_crypto_scheduler.sym_chk with a meson_exe.py custom command.
[63/503] Generating rte_crypto_ccp.sym_chk with a meson_exe.py custom command.
[64/503] Compiling C object 'drivers/a715181@@tmp_rte_vdpa_mlx5 at sta/vdpa_mlx5_mlx5_vdpa_event.c.o'.
[65/503] Compiling C object 'drivers/a715181@@tmp_rte_vdpa_mlx5 at sta/vdpa_mlx5_mlx5_vdpa_steer.c.o'.
[66/503] Compiling C object 'drivers/a715181@@tmp_rte_vdpa_mlx5 at sta/vdpa_mlx5_mlx5_vdpa_lm.c.o'.
[67/503] Compiling C object 'drivers/a715181@@tmp_rte_vdpa_ifc at sta/vdpa_ifc_ifcvf_vdpa.c.o'.
[68/503] Compiling C object 'drivers/a715181@@tmp_rte_vdpa_mlx5 at sta/vdpa_mlx5_mlx5_vdpa.c.o'.
[69/503] Compiling C object 'drivers/a715181@@tmp_rte_vdpa_mlx5 at sta/vdpa_mlx5_mlx5_vdpa_virtq.c.o'.
ninja: build stopped: subcommand failed.

https://lab.dpdk.org/results/dashboard/patchsets/14106/

UNH-IOL DPDK Community Lab


More information about the test-report mailing list