[dpdk-test-report] |FAILURE| pw76320 [PATCH] net/ice: enable QINQ filter in switch

dpdklab at iol.unh.edu dpdklab at iol.unh.edu
Wed Sep 2 12:52:16 CEST 2020


Test-Label: Performance-Testing
Test-Status: FAILURE
http://dpdk.org/patch/76320

_build patch failure_

Submitter: Qiming Yang <qiming.yang at intel.com>
Date: Wednesday, September 02 2020 10:01:36 
Applied on: CommitID:b9b10ddb4292f2bc5524ae9f427a2795514eff02
Apply patch set 76320 failed:


=========================== WARNING ============================
It is recommended to build DPDK using 'meson' and 'ninja'
See https://doc.dpdk.org/guides/linux_gsg/build_dpdk.html
Building DPDK with 'make' will be deprecated in a future release
================================================================

Configuration done using x86_64-native-linuxapp-gcc

=========================== WARNING ============================
It is recommended to build DPDK using 'meson' and 'ninja'
See https://doc.dpdk.org/guides/linux_gsg/build_dpdk.html
Building DPDK with 'make' will be deprecated in a future release
================================================================

== Build lib
== Build lib/librte_kvargs
== Build lib/librte_telemetry
== Build lib/librte_eal
/home-local/jenkins-local/jenkins-agent/workspace/Apply-Custom-Patch-Set/dpdk/mk/toolchain/gcc/rte.toolchain-compat.mk:30: AVX512 support disabled because of binutils 2.30. See Bug 97
== Build lib/librte_eal/include
== Build lib/librte_eal/linux
== Build lib/librte_pci
== Build lib/librte_ring
== Build lib/librte_stack
== Build lib/librte_mempool
== Build lib/librte_mbuf
== Build lib/librte_timer
== Build lib/librte_cfgfile
== Build lib/librte_net
== Build lib/librte_cmdline
== Build lib/librte_meter
== Build lib/librte_ethdev
== Build lib/librte_bbdev
== Build lib/librte_cryptodev
== Build lib/librte_security
== Build lib/librte_compressdev
== Build lib/librte_regexdev
== Build lib/librte_hash
== Build lib/librte_eventdev
== Build lib/librte_rawdev
== Build lib/librte_vhost
== Build lib/librte_efd
== Build lib/librte_rib
== Build lib/librte_fib
== Build lib/librte_rcu
== Build lib/librte_lpm
== Build lib/librte_acl
== Build lib/librte_member
== Build lib/librte_ip_frag
== Build lib/librte_gro
== Build lib/librte_jobstats
== Build lib/librte_metrics
== Build lib/librte_bitratestats
== Build lib/librte_latencystats
== Build lib/librte_power
== Build lib/librte_sched
== Build lib/librte_kni
== Build lib/librte_port
== Build lib/librte_table
== Build lib/librte_flow_classify
== Build lib/librte_distributor
== Build lib/librte_pipeline
== Build lib/librte_reorder
== Build lib/librte_pdump
== Build lib/librte_gso
== Build lib/librte_bpf
== Build lib/librte_ipsec
== Build lib/librte_graph
== Build lib/librte_node
== Build buildtools
== Build buildtools/pmdinfogen
== Build kernel
== Build kernel/linux
== Build drivers
== Build drivers/common
== Build drivers/common/cpt
== Build drivers/common/octeontx
== Build drivers/common/octeontx2
== Build drivers/common/dpaax
== Build drivers/common/iavf
== Build drivers/bus
== Build drivers/bus/dpaa
== Build drivers/bus/fslmc
== Build drivers/bus/ifpga
== Build drivers/bus/pci
== Build drivers/bus/vdev
== Build drivers/bus/vmbus
== Build drivers/mempool
== Build drivers/mempool/bucket
== Build drivers/mempool/dpaa
== Build drivers/mempool/dpaa2
== Build drivers/mempool/ring
== Build drivers/mempool/stack
== Build drivers/mempool/octeontx
== Build drivers/mempool/octeontx2
== Build drivers/net
== Build drivers/net/af_packet
== Build drivers/net/ark
== Build drivers/net/atlantic
== Build drivers/net/avp
== Build drivers/net/axgbe
== Build drivers/net/bonding
== Build drivers/net/cxgbe
== Build drivers/net/dpaa
== Build drivers/net/dpaa2
== Build drivers/net/e1000
== Build drivers/net/ena
== Build drivers/net/enetc
== Build drivers/net/enic
== Build drivers/net/failsafe
== Build drivers/net/fm10k
== Build drivers/net/hinic
== Build drivers/net/hns3
== Build drivers/net/i40e
== Build drivers/net/iavf
== Build drivers/net/ice
  CC ice_switch_filter.o
/home-local/jenkins-local/jenkins-agent/workspace/Apply-Custom-Patch-Set/dpdk/drivers/net/ice/ice_switch_filter.c: In function ‘ice_switch_inset_get’:
/home-local/jenkins-local/jenkins-agent/workspace/Apply-Custom-Patch-Set/dpdk/drivers/net/ice/ice_switch_filter.c:1064:22: error: ‘ICE_SW_TUN_AND_NON_TUN_QINQ’ undeclared (first use in this function); did you mean ‘ICE_SW_TUN_AND_NON_TUN’?
        (*tun_type == ICE_SW_TUN_AND_NON_TUN_QINQ ||
                      ^~~~~~~~~~~~~~~~~~~~~~~~~~~
                      ICE_SW_TUN_AND_NON_TUN
/home-local/jenkins-local/jenkins-agent/workspace/Apply-Custom-Patch-Set/dpdk/drivers/net/ice/ice_switch_filter.c:1064:22: note: each undeclared identifier is reported only once for each function it appears in
/home-local/jenkins-local/jenkins-agent/workspace/Apply-Custom-Patch-Set/dpdk/drivers/net/ice/ice_switch_filter.c:1065:21: error: ‘ICE_NON_TUN_QINQ’ undeclared (first use in this function); did you mean ‘ICE_NON_TUN’?
        *tun_type == ICE_NON_TUN_QINQ))
                     ^~~~~~~~~~~~~~~~
                     ICE_NON_TUN
/home-local/jenkins-local/jenkins-agent/workspace/Apply-Custom-Patch-Set/dpdk/drivers/net/ice/ice_switch_filter.c:1077:21: error: ‘ICE_VLAN_EX’ undeclared (first use in this function); did you mean ‘ICE_VXLAN_GPE’?
      list[t].type = ICE_VLAN_EX;
                     ^~~~~~~~~~~
                     ICE_VXLAN_GPE
/home-local/jenkins-local/jenkins-agent/workspace/Apply-Custom-Patch-Set/dpdk/drivers/net/ice/ice_switch_filter.c:1401:15: error: ‘ICE_SW_TUN_PPPOE_PAY_QINQ’ undeclared (first use in this function); did you mean ‘ICE_SW_TUN_PPPOE_PAY’?
   *tun_type = ICE_SW_TUN_PPPOE_PAY_QINQ;
               ^~~~~~~~~~~~~~~~~~~~~~~~~
               ICE_SW_TUN_PPPOE_PAY
/home-local/jenkins-local/jenkins-agent/workspace/Apply-Custom-Patch-Set/dpdk/drivers/net/ice/ice_switch_filter.c:1404:15: error: ‘ICE_SW_TUN_PPPOE_QINQ’ undeclared (first use in this function); did you mean ‘ICE_SW_TUN_PPPOE_PAY_QINQ’?
   *tun_type = ICE_SW_TUN_PPPOE_QINQ;
               ^~~~~~~~~~~~~~~~~~~~~
               ICE_SW_TUN_PPPOE_PAY_QINQ
/home-local/jenkins-local/jenkins-agent/workspace/Apply-Custom-Patch-Set/dpdk/drivers/net/ice/ice_switch_filter.c:1414:16: error: ‘ICE_SW_TUN_PPPOE_IPV4_QINQ’ undeclared (first use in this function); did you mean ‘ICE_SW_TUN_PPPOE_PAY_QINQ’?
    *tun_type = ICE_SW_TUN_PPPOE_IPV4_QINQ;
                ^~~~~~~~~~~~~~~~~~~~~~~~~~
                ICE_SW_TUN_PPPOE_PAY_QINQ
/home-local/jenkins-local/jenkins-agent/workspace/Apply-Custom-Patch-Set/dpdk/drivers/net/ice/ice_switch_filter.c:1416:16: error: ‘ICE_SW_TUN_PPPOE_IPV6_QINQ’ undeclared (first use in this function); did you mean ‘ICE_SW_TUN_PPPOE_IPV4_QINQ’?
    *tun_type = ICE_SW_TUN_PPPOE_IPV6_QINQ;
                ^~~~~~~~~~~~~~~~~~~~~~~~~~
                ICE_SW_TUN_PPPOE_IPV4_QINQ
/home-local/jenkins-local/jenkins-agent/workspace/Apply-Custom-Patch-Set/dpdk/drivers/net/ice/ice_switch_filter.c: In function ‘ice_switch_parse_pattern_action’:
/home-local/jenkins-local/jenkins-agent/workspace/Apply-Custom-Patch-Set/dpdk/drivers/net/ice/ice_switch_filter.c:1696:14: error: ‘ICE_SW_TUN_AND_NON_TUN_QINQ’ undeclared (first use in this function); did you mean ‘ICE_SW_TUN_AND_NON_TUN’?
   tun_type = ICE_SW_TUN_AND_NON_TUN_QINQ;
              ^~~~~~~~~~~~~~~~~~~~~~~~~~~
              ICE_SW_TUN_AND_NON_TUN
/home-local/jenkins-local/jenkins-agent/workspace/Apply-Custom-Patch-Set/dpdk/drivers/net/ice/ice_switch_filter.c:1698:14: error: ‘ICE_NON_TUN_QINQ’ undeclared (first use in this function); did you mean ‘ICE_NON_TUN’?
   tun_type = ICE_NON_TUN_QINQ;
              ^~~~~~~~~~~~~~~~
              ICE_NON_TUN
/home-local/jenkins-local/jenkins-agent/workspace/Apply-Custom-Patch-Set/dpdk/drivers/net/ice/ice_switch_filter.c: At top level:
cc1: error: unrecognized command line option ‘-Wno-address-of-packed-member’ [-Werror]
cc1: all warnings being treated as errors
/home-local/jenkins-local/jenkins-agent/workspace/Apply-Custom-Patch-Set/dpdk/mk/internal/rte.compile-pre.mk:114: recipe for target 'ice_switch_filter.o' failed
make[6]: *** [ice_switch_filter.o] Error 1
/home-local/jenkins-local/jenkins-agent/workspace/Apply-Custom-Patch-Set/dpdk/mk/rte.subdir.mk:35: recipe for target 'ice' failed
make[5]: *** [ice] Error 2
/home-local/jenkins-local/jenkins-agent/workspace/Apply-Custom-Patch-Set/dpdk/mk/rte.subdir.mk:35: recipe for target 'net' failed
make[4]: *** [net] Error 2
/home-local/jenkins-local/jenkins-agent/workspace/Apply-Custom-Patch-Set/dpdk/mk/rte.sdkbuild.mk:51: recipe for target 'drivers' failed
make[3]: *** [drivers] Error 2
/home-local/jenkins-local/jenkins-agent/workspace/Apply-Custom-Patch-Set/dpdk/mk/rte.sdkroot.mk:113: recipe for target 'all' failed
make[2]: *** [all] Error 2
/home-local/jenkins-local/jenkins-agent/workspace/Apply-Custom-Patch-Set/dpdk/mk/rte.sdkinstall.mk:60: recipe for target 'pre_install' failed
make[1]: *** [pre_install] Error 2
/home-local/jenkins-local/jenkins-agent/workspace/Apply-Custom-Patch-Set/dpdk/mk/rte.sdkroot.mk:92: recipe for target 'install' failed
make: *** [install] Error 2

https://lab.dpdk.org/results/dashboard/patchsets/12795/

UNH-IOL DPDK Community Lab


More information about the test-report mailing list