[dpdk-test-report] |FAILURE| pw(76301) [v1, 4/4] sched: add dynamic config of subport bandwidth profile

sys_stv at intel.com sys_stv at intel.com
Thu Sep 3 11:19:40 CEST 2020


Test-Label: Intel-compilation
Test-Status: FAILURE
http://dpdk.org/patch/76301

_Compilation issues_

Submitter: Savinay Dharmappa <savinay.dharmappa at intel.com>
Date: 2020-09-02 08:56:46
Reply_mail: 1599037006-3931-4-git-send-email-savinay.dharmappa at intel.com

DPDK git baseline: Repo:dpdk, CommitID: b9b10ddb4292f2bc5524ae9f427a2795514eff02


Meson build Summary: 8 Builds Done, 1 Successful, 7 Failures, 0 Blocked

Makefile build Summary: 20 Builds Done, 0 Successful, 20 Failures, 0 Blocked

                +==============================================+===========+==========+
                |                   Makefile                   |   Meson   | Document |
+----------------+------+-------+------+------------+-----------+-----------+----------+
| os             | gcc  | clang | icc  | gcc+shared | gcc+debug | gcc/clang | pdf/html |
+----------------+------+-------+------+------------+-----------+-----------+----------+
| CENTOS82-64    | FAIL | FAIL  | FAIL | FAIL       | FAIL      | FAIL      |          |
| RHEL82-64      | FAIL |       |      |            |           |           |          |
| UB1804-64      | FAIL |       |      |            |           |           |          |
| FC32-64        | FAIL | FAIL  |      |            |           | FAIL      |          |
| CENTOS77-64    | FAIL |       |      |            |           |           |          |
| UB2004-64      | FAIL | FAIL  | FAIL |            |           | FAIL      | FAIL     |
| WIN10-64       |      |       |      |            |           | pass      |          |
| UB2004-32      | FAIL |       |      |            |           | FAIL      |          |
| FreeBSD1201-64 | FAIL | FAIL  |      | FAIL       | FAIL      | FAIL      |          |
| SUSE15-64      | FAIL | FAIL  |      |            |           | FAIL      |          |
+----------------+------+-------+------+------------+-----------+-----------+----------+
Test environment and configuration as below:

** Makefile build **


OS: CENTOS82-64
	Kernel Version: 4.18.0-193.el8.x86_64
	CPU info: Intel(R) Xeon(R) Platinum 8280M CPU @ 2.70GHz
	GCC Version: gcc (GCC) 8.3.1 20191121 (Red Hat 8.3.1-5)
	Clang Version: 9.0.1 (Red Hat 9.0.1-2.module_el8.2.0+309+0c7b6b03)
	x86_64-native-linuxapp-gcc
	x86_64-native-linuxapp-clang
	x86_64-native-linuxapp-icc
	x86_64-native-linuxapp-gcc+shared
	x86_64-native-linuxapp-gcc+debug


OS: RHEL82-64
	Kernel Version: 4.18.0-193.el8.x86_64
	CPU info: Intel(R) Xeon(R) Platinum 8280M CPU @ 2.70GHz
	GCC Version: gcc (GCC) 8.3.1 20191121 (Red Hat 8.3.1-5)
	Clang Version: 8.0.1 (Red Hat 8.0.1-1.module_el8.1.0+215+a01033fb)
	x86_64-native-linuxapp-gcc


OS: UB1804-64
	Kernel Version: 5.3.0-59-generic
	CPU info: Intel(R) Xeon(R) Platinum 8180 CPU @ 2.50GHz
	GCC Version: gcc (Ubuntu 7.5.0-3ubuntu1~18.04) 7.5.0
	Clang Version: 6.0.0-1ubuntu2 (tags/RELEASE_600/final)
	x86_64-native-linuxapp-gcc


OS: FC32-64
	Kernel Version: 5.6.0-0.rc7.git0.2.fc32.x86_64
	CPU info: Intel(R) Xeon(R) Platinum 8280M CPU @ 2.70GHz
	GCC Version: gcc (GCC) 10.0.1 20200311 (Red Hat 10.0.1-0.9)
	Clang Version: 10.0.0 (Fedora 10.0.0-0.3.rc4.fc32)
	x86_64-native-linuxapp-gcc
	x86_64-native-linuxapp-clang


OS: CENTOS77-64
	Kernel Version: 3.10.0-1062.9.1.el7.x86_64
	CPU info: Intel(R) Xeon(R) Platinum 8280M CPU @ 2.70GHz
	GCC Version: gcc (GCC) 4.8.5 20150623 (Red Hat 4.8.5-39)
	Clang Version: 3.4.2 (tags/RELEASE_34/dot2-final)
	x86_64-native-linuxapp-gcc


OS: UB2004-64
	Kernel Version: 5.4.0-26-generic
	CPU info: Intel(R) Xeon(R) Platinum 8180 CPU @ 2.50GHz
	GCC Version: gcc (Ubuntu 10-20200416-0ubuntu1) 10.0.1 20200416 (experimental) [master revision 3c3f12e2a76:dcee354ce56:44b326839d864fc10c459916abcc97f35a9ac3de]
	Clang Version: 10.0.0-4ubuntu1
	x86_64-native-linuxapp-clang
	x86_64-native-linuxapp-gcc
	x86_64-native-linuxapp-icc


OS: UB2004-32
	Kernel Version: 5.4.0-26-generic
	CPU info: Intel(R) Xeon(R) Platinum 8180 CPU @ 2.50GHz
	GCC Version: gcc (Ubuntu 9.3.0-10ubuntu2) 9.3.0
	Clang Version: 10.0.0-4ubuntu1
	i686-native-linuxapp-gcc


OS: FreeBSD1201-64
	Kernel Version: 12.1-RELEASE
	CPU info: Intel(R) Xeon(R) CPU E5-2699 v3 @ 2.30GHz (2294.74-MHz K8-class CPU)
	GCC Version: gcc (FreeBSD Ports Collection) 9.2.0
	Clang Version: 8.0.1 (tags/RELEASE_801/final 366581) (based on LLVM 8.0.1)
	x86_64-native-bsdapp-gcc
	x86_64-native-bsdapp-clang
	x86_64-native-bsdapp-gcc+shared
	x86_64-native-bsdapp-gcc+debug


OS: SUSE15-64
	Kernel Version: 4.12.14-lp150.11-default
	CPU info: Intel(R) Xeon(R) CPU E5-2699 v4 @ 2.20GHz
	GCC Version: gcc (SUSE Linux) 7.3.1 20180323 [gcc-7-branch revision 258812]
	Clang Version: 5.0.1 (tags/RELEASE_501/final 312548)
	x86_64-native-linuxapp-clang
	x86_64-native-linuxapp-gcc

** Meson build **


OS: CENTOS82-64
	Kernel Version: 4.18.0-193.el8.x86_64
	CPU info: Intel(R) Xeon(R) CPU E5-2699 v4 @ 2.20GHz
	GCC Version: gcc (GCC) 8.3.1 20191121 (Red Hat 8.3.1-5)
	Clang Version: 9.0.1 (Red Hat 9.0.1-2.module_el8.2.0+309+0c7b6b03)
	./build-gcc-static
	./build-gcc-shared
	./build-clang-static
	./build-clang-shared
	./build-x86-default


OS: UB2004-64
	Kernel Version: 5.4.0-26-generic
	CPU info: Intel(R) Xeon(R) Platinum 8180 CPU @ 2.50GHz
	GCC Version: gcc (Ubuntu 9.3.0-10ubuntu2) 9.3.0
	Clang Version: 10.0.0-4ubuntu1
	x86_64-native-linuxapp-doc
	./build-gcc-static
	./build-gcc-shared
	./build-clang-static
	./build-clang-shared
	./build-x86-default


OS: FC32-64
	Kernel Version: 5.6.0-0.rc7.git0.2.fc32.x86_64
	CPU info: Intel(R) Xeon(R) CPU E5-2699 v4 @ 2.20GHz
	GCC Version: gcc (GCC) 10.0.1 20200311 (Red Hat 10.0.1-0.9)
	Clang Version: 10.0.0 (Fedora 10.0.0-0.3.rc4.fc32)
	./build-gcc-static
	./build-gcc-shared
	./build-clang-static
	./build-clang-shared
	./build-x86-default


OS: WIN10-64
	Kernel Version: N/A
	CPU info: N/A
	GCC Version: N/A
	Clang Version: Clang 8.0.0
	x86_64-windows-clang


OS: UB2004-32
	Kernel Version: 5.4.0-26-generic
	CPU info: Intel(R) Xeon(R) CPU E5-2699 v4 @ 2.20GHz
	GCC Version: gcc (Ubuntu 9.3.0-10ubuntu2) 9.3.0
	Clang Version: 10.0.0-4ubuntu1
	./build-gcc-static
	./build-gcc-shared
	./build-x86-default
	/root/UB2004-32_K4.15.0_GCC9.3.0/i686-native-linuxapp-gcc/a97f7ee35f494d71a9427a4273edff37/dpdk/build-x86-default install >/dev/null


OS: FreeBSD1201-64
	Kernel Version: 12.1-RELEASE
	CPU info: Intel(R) Xeon(R) CPU E5-2699 v4 @ 2.20GHz (2194.97-MHz K8-class CPU)
	GCC Version: gcc (FreeBSD Ports Collection) 9.2.0
	Clang Version: 8.0.1 (tags/RELEASE_801/final 366581) (based on LLVM 8.0.1)
	./build-gcc-static
	./build-gcc-shared
	./build-clang-static
	./build-clang-shared
	./build-x86-default


OS: SUSE15-64
	Kernel Version: 4.12.14-lp150.12.82-default
	CPU info: Intel(R) Xeon(R) CPU E5-2699 v4 @ 2.20GHz
	GCC Version: gcc (SUSE Linux) 7.4.1 20190905 [gcc-7-branch revision 275407]
	Clang Version: 5.0.1 (tags/RELEASE_501/final 312548)
	./build-gcc-static
	./build-gcc-shared
	./build-clang-static
	./build-clang-shared
	./build-x86-default



*Meson Build Failed #1:
OS: CENTOS82-64
Target:./build-gcc-static
FAILED: drivers/a715181@@tmp_rte_pmd_softnic at sta/net_softnic_rte_eth_softnic_tm.c.o 
gcc -Idrivers/a715181@@tmp_rte_pmd_softnic at sta -Idrivers -I../drivers -Idrivers/net/softnic -I../drivers/net/softnic -Ilib/librte_ethdev -I../lib/librte_ethdev -I. -I../ -Iconfig -I../config -Ilib/librte_eal/include -I../lib/librte_eal/include -Ilib/librte_eal/linux/include -I../lib/librte_eal/linux/include -Ilib/librte_eal/x86/include -I../lib/librte_eal/x86/include -Ilib/librte_eal/common -I../lib/librte_eal/common -Ilib/librte_eal -I../lib/librte_eal -Ilib/librte_kvargs -I../lib/librte_kvargs -Ilib/librte_telemetry/../librte_metrics -I../lib/librte_telemetry/../librte_metrics -Ilib/librte_telemetry -I../lib/librte_telemetry -Ilib/librte_net -I../lib/librte_net -Ilib/librte_mbuf -I../lib/librte_mbuf -Ilib/librte_mempool -I../lib/librte_mempool -Ilib/librte_ring -I../lib/librte_ring -Ilib/librte_meter -I../lib/librte_meter -Idrivers/bus/pci -I../drivers/bus/pci -I../drivers/bus/pci/linux -Ilib/librte_pci -I../lib/librte_pci -Idrivers/bus/vdev -I../drivers/bus/vdev -Ilib/librte_pipeline -I../lib/librte_pipeline -Ilib/librte_port -I../lib/librte_port -Ilib/librte_sched -I../lib/librte_sched -Ilib/librte_ip_frag -I../lib/librte_ip_frag -Ilib/librte_hash -I../lib/librte_hash -Ilib/librte_cryptodev -I../lib/librte_cryptodev -Ilib/librte_eventdev -I../lib/librte_eventdev -Ilib/librte_timer -I../lib/librte_timer -Ilib/librte_kni -I../lib/librte_kni -Ilib/librte_table -I../lib/librte_table -Ilib/librte_lpm -I../lib/librte_lpm -Ilib/librte_rcu -I../lib/librte_rcu -Ilib/librte_acl -I../lib/librte_acl -fdiagnostics-color=always -pipe -D_FILE_OFFSET_BITS=64 -Wall -Winvalid-pch -Werror -O2 -g -include rte_config.h -Wextra -Wcast-qual -Wdeprecated -Wformat-nonliteral -Wformat-security -Wmissing-declarations -Wmissing-prototypes -Wnested-externs -Wold-style-definition -Wpointer-arith -Wsign-compare -Wstrict-prototypes -Wundef -Wwrite-strings -Wno-packed-not-aligned -Wno-missing-field-initializers -D_GNU_SOURCE -fPIC -march=native -mno-avx512f -DALLOW_EXPERIMENTAL_API -DALLOW_INTERNAL_API -Wno-format-truncation -MD -MQ 'drivers/a715181@@tmp_rte_pmd_softnic at sta/net_softnic_rte_eth_softnic_tm.c.o' -MF 'drivers/a715181@@tmp_rte_pmd_softnic at sta/net_softnic_rte_eth_softnic_tm.c.o.d' -o 'drivers/a715181@@tmp_rte_pmd_softnic at sta/net_softnic_rte_eth_softnic_tm.c.o' -c ../drivers/net/softnic/rte_eth_softnic_tm.c
../drivers/net/softnic/rte_eth_softnic_tm.c: In function ‘update_subport_tc_rate’:
../drivers/net/softnic/rte_eth_softnic_tm.c:1068:16: error: ‘struct rte_sched_subport_params’ has no member named ‘tc_rate’
  subport_params.tc_rate[tc_id] = sp_new->params.peak.rate;
                ^
../drivers/net/softnic/rte_eth_softnic_tm.c:1052:11: error: variable ‘tc_id’ set but not used [-Werror=unused-but-set-variable]
  uint32_t tc_id = tm_node_tc_id(dev, nt);
           ^~~~~
../drivers/net/softnic/rte_eth_softnic_tm.c: In function ‘hierarchy_blueprints_create’:
../drivers/net/softnic/rte_eth_softnic_tm.c:2555:6: error: ‘struct rte_sched_subport_params’ has no member named ‘tb_rate’
     .tb_rate = n->shaper_profile->params.peak.rate,
      ^~~~~~~
../drivers/net/softnic/rte_eth_softnic_tm.c:2556:6: error: ‘struct rte_sched_subport_params’ has no member named ‘tb_size’; did you mean ‘qsize’?
     .tb_size = n->shaper_profile->params.peak.size,
      ^~~~~~~
      qsize
../drivers/net/softnic/rte_eth_softnic_tm.c:2558:6: error: ‘struct rte_sched_subport_params’ has no member named ‘tc_rate’
     .tc_rate = {tc_rate[0],
      ^~~~~~~
../drivers/net/softnic/rte_eth_softnic_tm.c:2558:5: error: braces around scalar initializer [-Werror]
     .tc_rate = {tc_rate[0],
     ^
../drivers/net/softnic/rte_eth_softnic_tm.c:2558:5: note: (near initialization for ‘(anonymous).pipe_profiles’)
../drivers/net/softnic/rte_eth_softnic_tm.c:2558:17: error: initialization of ‘struct rte_sched_pipe_params *’ from ‘uint64_t’ {aka ‘long unsigned int’} makes pointer from integer without a cast [-Werror=int-conversion]
     .tc_rate = {tc_rate[0],
                 ^~~~~~~
../drivers/net/softnic/rte_eth_softnic_tm.c:2558:17: note: (near initialization for ‘(anonymous).pipe_profiles’)
../drivers/net/softnic/rte_eth_softnic_tm.c:2559:6: error: excess elements in scalar initializer [-Werror]
      tc_rate[1],
      ^~~~~~~
../drivers/net/softnic/rte_eth_softnic_tm.c:2559:6: note: (near initialization for ‘(anonymous).pipe_profiles’)
../drivers/net/softnic/rte_eth_softnic_tm.c:2560:6: error: excess elements in scalar initializer [-Werror]
      tc_rate[2],
      ^~~~~~~
../drivers/net/softnic/rte_eth_softnic_tm.c:2560:6: note: (near initialization for ‘(anonymous).pipe_profiles’)
../drivers/net/softnic/rte_eth_softnic_tm.c:2561:6: error: excess elements in scalar initializer [-Werror]
      tc_rate[3],
      ^~~~~~~
../drivers/net/softnic/rte_eth_softnic_tm.c:2561:6: note: (near initialization for ‘(anonymous).pipe_profiles’)
../drivers/net/softnic/rte_eth_softnic_tm.c:2562:6: error: excess elements in scalar initializer [-Werror]
      tc_rate[4],
      ^~~~~~~
../drivers/net/softnic/rte_eth_softnic_tm.c:2562:6: note: (near initialization for ‘(anonymous).pipe_profiles’)
../drivers/net/softnic/rte_eth_softnic_tm.c:2563:6: error: excess elements in scalar initializer [-Werror]
      tc_rate[5],
      ^~~~~~~
../drivers/net/softnic/rte_eth_softnic_tm.c:2563:6: note: (near initialization for ‘(anonymous).pipe_profiles’)
../drivers/net/softnic/rte_eth_softnic_tm.c:2564:6: error: excess elements in scalar initializer [-Werror]
      tc_rate[6],
      ^~~~~~~
../drivers/net/softnic/rte_eth_softnic_tm.c:2564:6: note: (near initialization for ‘(anonymous).pipe_profiles’)
../drivers/net/softnic/rte_eth_softnic_tm.c:2565:6: error: excess elements in scalar initializer [-Werror]
      tc_rate[7],
      ^~~~~~~
../drivers/net/softnic/rte_eth_softnic_tm.c:2565:6: note: (near initialization for ‘(anonymous).pipe_profiles’)
../drivers/net/softnic/rte_eth_softnic_tm.c:2566:6: error: excess elements in scalar initializer [-Werror]
      tc_rate[8],
      ^~~~~~~
../drivers/net/softnic/rte_eth_softnic_tm.c:2566:6: note: (near initialization for ‘(anonymous).pipe_profiles’)
../drivers/net/softnic/rte_eth_softnic_tm.c:2567:6: error: excess elements in scalar initializer [-Werror]
      tc_rate[9],
      ^~~~~~~
../drivers/net/softnic/rte_eth_softnic_tm.c:2567:6: note: (near initialization for ‘(anonymous).pipe_profiles’)
../drivers/net/softnic/rte_eth_softnic_tm.c:2568:6: error: excess elements in scalar initializer [-Werror]
      tc_rate[10],
      ^~~~~~~
../drivers/net/softnic/rte_eth_softnic_tm.c:2568:6: note: (near initialization for ‘(anonymous).pipe_profiles’)
../drivers/net/softnic/rte_eth_softnic_tm.c:2569:6: error: excess elements in scalar initializer [-Werror]
      tc_rate[11],
      ^~~~~~~
../drivers/net/softnic/rte_eth_softnic_tm.c:2569:6: note: (near initialization for ‘(anonymous).pipe_profiles’)
../drivers/net/softnic/rte_eth_softnic_tm.c:2570:6: error: excess elements in scalar initializer [-Werror]
      tc_rate[12],
      ^~~~~~~
../drivers/net/softnic/rte_eth_softnic_tm.c:2570:6: note: (near initialization for ‘(anonymous).pipe_profiles’)
../drivers/net/softnic/rte_eth_softnic_tm.c:2554:4: error: missing braces around initializer [-Werror=missing-braces]
    (struct rte_sched_subport_params) {
    ^
../drivers/net/softnic/rte_eth_softnic_tm.c:2556:16:
     .tb_size = n->shaper_profile->params.peak.size,
                {                                  }
../drivers/net/softnic/rte_eth_softnic_tm.c:2572:6: error: ‘struct rte_sched_subport_params’ has no member named ‘tc_period’
     .tc_period = SUBPORT_TC_PERIOD,
      ^~~~~~~~~
../drivers/net/softnic/rte_eth_softnic_tm.c:2574:6: error: initialized field overwritten [-Werror=override-init]
      h->n_tm_nodes[TM_NODE_LEVEL_PIPE] /
      ^
../drivers/net/softnic/rte_eth_softnic_tm.c:2574:6: note: (near initialization for ‘(anonymous).n_pipes_per_subport_enabled’)
../drivers/net/softnic/rte_eth_softnic_tm.c:2554:4: error: missing braces around initializer [-Werror=missing-braces]
    (struct rte_sched_subport_params) {
    ^
../drivers/net/softnic/rte_eth_softnic_tm.c:2556:16:
     .tb_size = n->shaper_profile->params.peak.size,
                {                                  }
../drivers/net/softnic/rte_eth_softnic_tm.c:2576:14: error: initialized field overwritten [-Werror=override-init]
     .qsize = {p->params.tm.qsize[0],
              ^
../drivers/net/softnic/rte_eth_softnic_tm.c:2576:14: note: (near initialization for ‘(anonymous).qsize’)
../drivers/net/softnic/rte_eth_softnic_tm.c:2590:22: error: initialized field overwritten [-Werror=override-init]
     .pipe_profiles = t->pipe_profiles,
                      ^
../drivers/net/softnic/rte_eth_softnic_tm.c:2590:22: note: (near initialization for ‘(anonymous).pipe_profiles’)
../drivers/net/softnic/rte_eth_softnic_tm.c:2591:24: error: initialized field overwritten [-Werror=override-init]
     .n_pipe_profiles = t->n_pipe_profiles,
                        ^
../drivers/net/softnic/rte_eth_softnic_tm.c:2591:24: note: (near initialization for ‘(anonymous).n_pipe_profiles’)
../drivers/net/softnic/rte_eth_softnic_tm.c:2554:4: error: missing braces around initializer [-Werror=missing-braces]
    (struct rte_sched_subport_params) {
    ^
../drivers/net/softnic/rte_eth_softnic_tm.c:2556:16:
     .tb_size = n->shaper_profile->params.peak.size,
                {                                  }
../drivers/net/softnic/rte_eth_softnic_tm.c: In function ‘update_subport_rate’:
../drivers/net/softnic/rte_eth_softnic_tm.c:2838:16: error: ‘struct rte_sched_subport_params’ has no member named ‘tb_rate’
  subport_params.tb_rate = sp->params.peak.rate;
                ^
../drivers/net/softnic/rte_eth_softnic_tm.c:2839:17: error: ‘struct rte_sched_subport_params’ has no member named ‘tb_size’; did you mean ‘qsize’?
  subport_params.tb_size = sp->params.peak.size;
                 ^~~~~~~
                 qsize
cc1: all warnings being treated as errors
[1573/2441] Compiling C object 'drivers/a715181@@tmp_rte_pmd_sfc at sta/net_sfc_sfc_ef10_essb_rx.c.o'.
[1574/2441] Compiling C object 'drivers/a715181@@tmp_rte_pmd_sfc at sta/net_sfc_sfc_ef10_rx.c.o'.
[1575/2441] Compiling C object 'drivers/a715181@@tmp_rte_pmd_softnic at sta/net_softnic_rte_eth_softnic_tap.c.o'.
[1576/2441] Compiling C object 'drivers/a715181@@tmp_rte_pmd_softnic at sta/net_softnic_rte_eth_softnic_cryptodev.c.o'.
[1577/2441] Compiling C object 'drivers/a715181@@tmp_rte_pmd_softnic at sta/net_softnic_rte_eth_softnic_pipeline.c.o'.
[1578/2441] Compiling C object 'drivers/a715181@@tmp_rte_pmd_sfc at sta/net_sfc_sfc_flow.c.o'.
[1579/2441] Compiling C object 'drivers/a715181@@tmp_rte_pmd_octeontx2 at sta/net_octeontx2_otx2_rx.c.o'.
[1580/2441] Compiling C object 'drivers/a715181@@tmp_rte_pmd_softnic at sta/net_softnic_rte_eth_softnic_action.c.o'.
[1581/2441] Compiling C object 'drivers/a715181@@tmp_rte_pmd_softnic at sta/net_softnic_rte_eth_softnic_swq.c.o'.
[1582/2441] Compiling C object 'drivers/a715181@@tmp_rte_pmd_softnic at sta/net_softnic_rte_eth_softnic_mempool.c.o'.
[1583/2441] Compiling C object 'drivers/a715181@@tmp_rte_pmd_sfc at sta/net_sfc_sfc_ef10_tx.c.o'.
ninja: build stopped: subcommand failed




*Meson Build Failed #2:
OS: FC32-64
Target:./build-gcc-static
FAILED: drivers/a715181@@tmp_rte_pmd_softnic at sta/net_softnic_rte_eth_softnic_tm.c.o 
gcc -Idrivers/a715181@@tmp_rte_pmd_softnic at sta -Idrivers -I../drivers -Idrivers/net/softnic -I../drivers/net/softnic -Ilib/librte_ethdev -I../lib/librte_ethdev -I. -I../ -Iconfig -I../config -Ilib/librte_eal/include -I../lib/librte_eal/include -Ilib/librte_eal/linux/include -I../lib/librte_eal/linux/include -Ilib/librte_eal/x86/include -I../lib/librte_eal/x86/include -Ilib/librte_eal/common -I../lib/librte_eal/common -Ilib/librte_eal -I../lib/librte_eal -Ilib/librte_kvargs -I../lib/librte_kvargs -Ilib/librte_telemetry/../librte_metrics -I../lib/librte_telemetry/../librte_metrics -Ilib/librte_telemetry -I../lib/librte_telemetry -Ilib/librte_net -I../lib/librte_net -Ilib/librte_mbuf -I../lib/librte_mbuf -Ilib/librte_mempool -I../lib/librte_mempool -Ilib/librte_ring -I../lib/librte_ring -Ilib/librte_meter -I../lib/librte_meter -Idrivers/bus/pci -I../drivers/bus/pci -I../drivers/bus/pci/linux -Ilib/librte_pci -I../lib/librte_pci -Idrivers/bus/vdev -I../drivers/bus/vdev -Ilib/librte_pipeline -I../lib/librte_pipeline -Ilib/librte_port -I../lib/librte_port -Ilib/librte_sched -I../lib/librte_sched -Ilib/librte_ip_frag -I../lib/librte_ip_frag -Ilib/librte_hash -I../lib/librte_hash -Ilib/librte_cryptodev -I../lib/librte_cryptodev -Ilib/librte_eventdev -I../lib/librte_eventdev -Ilib/librte_timer -I../lib/librte_timer -Ilib/librte_kni -I../lib/librte_kni -Ilib/librte_table -I../lib/librte_table -Ilib/librte_lpm -I../lib/librte_lpm -Ilib/librte_rcu -I../lib/librte_rcu -Ilib/librte_acl -I../lib/librte_acl -fdiagnostics-color=always -pipe -D_FILE_OFFSET_BITS=64 -Wall -Winvalid-pch -Werror -O2 -g -include rte_config.h -Wextra -Wcast-qual -Wdeprecated -Wformat-nonliteral -Wformat-security -Wmissing-declarations -Wmissing-prototypes -Wnested-externs -Wold-style-definition -Wpointer-arith -Wsign-compare -Wstrict-prototypes -Wundef -Wwrite-strings -Wno-address-of-packed-member -Wno-packed-not-aligned -Wno-missing-field-initializers -Wno-zero-length-bounds -D_GNU_SOURCE -fPIC -march=native -DALLOW_EXPERIMENTAL_API -DALLOW_INTERNAL_API -Wno-format-truncation -MD -MQ 'drivers/a715181@@tmp_rte_pmd_softnic at sta/net_softnic_rte_eth_softnic_tm.c.o' -MF 'drivers/a715181@@tmp_rte_pmd_softnic at sta/net_softnic_rte_eth_softnic_tm.c.o.d' -o 'drivers/a715181@@tmp_rte_pmd_softnic at sta/net_softnic_rte_eth_softnic_tm.c.o' -c ../drivers/net/softnic/rte_eth_softnic_tm.c
../drivers/net/softnic/rte_eth_softnic_tm.c: In function ‘update_subport_tc_rate’:
../drivers/net/softnic/rte_eth_softnic_tm.c:1068:16: error: ‘struct rte_sched_subport_params’ has no member named ‘tc_rate’
 1068 |  subport_params.tc_rate[tc_id] = sp_new->params.peak.rate;
      |                ^
../drivers/net/softnic/rte_eth_softnic_tm.c:1052:11: error: variable ‘tc_id’ set but not used [-Werror=unused-but-set-variable]
 1052 |  uint32_t tc_id = tm_node_tc_id(dev, nt);
      |           ^~~~~
../drivers/net/softnic/rte_eth_softnic_tm.c: In function ‘hierarchy_blueprints_create’:
../drivers/net/softnic/rte_eth_softnic_tm.c:2555:6: error: ‘struct rte_sched_subport_params’ has no member named ‘tb_rate’
 2555 |     .tb_rate = n->shaper_profile->params.peak.rate,
      |      ^~~~~~~
../drivers/net/softnic/rte_eth_softnic_tm.c:2556:6: error: ‘struct rte_sched_subport_params’ has no member named ‘tb_size’; did you mean ‘qsize’?
 2556 |     .tb_size = n->shaper_profile->params.peak.size,
      |      ^~~~~~~
      |      qsize
../drivers/net/softnic/rte_eth_softnic_tm.c:2558:6: error: ‘struct rte_sched_subport_params’ has no member named ‘tc_rate’
 2558 |     .tc_rate = {tc_rate[0],
      |      ^~~~~~~
../drivers/net/softnic/rte_eth_softnic_tm.c:2558:5: error: braces around scalar initializer [-Werror]
 2558 |     .tc_rate = {tc_rate[0],
      |     ^
../drivers/net/softnic/rte_eth_softnic_tm.c:2558:5: note: (near initialization for ‘(anonymous).pipe_profiles’)
../drivers/net/softnic/rte_eth_softnic_tm.c:2558:17: error: initialization of ‘struct rte_sched_pipe_params *’ from ‘uint64_t’ {aka ‘long unsigned int’} makes pointer from integer without a cast [-Werror=int-conversion]
 2558 |     .tc_rate = {tc_rate[0],
      |                 ^~~~~~~
../drivers/net/softnic/rte_eth_softnic_tm.c:2558:17: note: (near initialization for ‘(anonymous).pipe_profiles’)
../drivers/net/softnic/rte_eth_softnic_tm.c:2559:6: error: excess elements in scalar initializer [-Werror]
 2559 |      tc_rate[1],
      |      ^~~~~~~
../drivers/net/softnic/rte_eth_softnic_tm.c:2559:6: note: (near initialization for ‘(anonymous).pipe_profiles’)
../drivers/net/softnic/rte_eth_softnic_tm.c:2560:6: error: excess elements in scalar initializer [-Werror]
 2560 |      tc_rate[2],
      |      ^~~~~~~
../drivers/net/softnic/rte_eth_softnic_tm.c:2560:6: note: (near initialization for ‘(anonymous).pipe_profiles’)
../drivers/net/softnic/rte_eth_softnic_tm.c:2561:6: error: excess elements in scalar initializer [-Werror]
 2561 |      tc_rate[3],
      |      ^~~~~~~
../drivers/net/softnic/rte_eth_softnic_tm.c:2561:6: note: (near initialization for ‘(anonymous).pipe_profiles’)
../drivers/net/softnic/rte_eth_softnic_tm.c:2562:6: error: excess elements in scalar initializer [-Werror]
 2562 |      tc_rate[4],
      |      ^~~~~~~
../drivers/net/softnic/rte_eth_softnic_tm.c:2562:6: note: (near initialization for ‘(anonymous).pipe_profiles’)
../drivers/net/softnic/rte_eth_softnic_tm.c:2563:6: error: excess elements in scalar initializer [-Werror]
 2563 |      tc_rate[5],
      |      ^~~~~~~
../drivers/net/softnic/rte_eth_softnic_tm.c:2563:6: note: (near initialization for ‘(anonymous).pipe_profiles’)
../drivers/net/softnic/rte_eth_softnic_tm.c:2564:6: error: excess elements in scalar initializer [-Werror]
 2564 |      tc_rate[6],
      |      ^~~~~~~
../drivers/net/softnic/rte_eth_softnic_tm.c:2564:6: note: (near initialization for ‘(anonymous).pipe_profiles’)
../drivers/net/softnic/rte_eth_softnic_tm.c:2565:6: error: excess elements in scalar initializer [-Werror]
 2565 |      tc_rate[7],
      |      ^~~~~~~
../drivers/net/softnic/rte_eth_softnic_tm.c:2565:6: note: (near initialization for ‘(anonymous).pipe_profiles’)
../drivers/net/softnic/rte_eth_softnic_tm.c:2566:6: error: excess elements in scalar initializer [-Werror]
 2566 |      tc_rate[8],
      |      ^~~~~~~
../drivers/net/softnic/rte_eth_softnic_tm.c:2566:6: note: (near initialization for ‘(anonymous).pipe_profiles’)
../drivers/net/softnic/rte_eth_softnic_tm.c:2567:6: error: excess elements in scalar initializer [-Werror]
 2567 |      tc_rate[9],
      |      ^~~~~~~
../drivers/net/softnic/rte_eth_softnic_tm.c:2567:6: note: (near initialization for ‘(anonymous).pipe_profiles’)
../drivers/net/softnic/rte_eth_softnic_tm.c:2568:6: error: excess elements in scalar initializer [-Werror]
 2568 |      tc_rate[10],
      |      ^~~~~~~
../drivers/net/softnic/rte_eth_softnic_tm.c:2568:6: note: (near initialization for ‘(anonymous).pipe_profiles’)
../drivers/net/softnic/rte_eth_softnic_tm.c:2569:6: error: excess elements in scalar initializer [-Werror]
 2569 |      tc_rate[11],
      |      ^~~~~~~
../drivers/net/softnic/rte_eth_softnic_tm.c:2569:6: note: (near initialization for ‘(anonymous).pipe_profiles’)
../drivers/net/softnic/rte_eth_softnic_tm.c:2570:6: error: excess elements in scalar initializer [-Werror]
 2570 |      tc_rate[12],
      |      ^~~~~~~
../drivers/net/softnic/rte_eth_softnic_tm.c:2570:6: note: (near initialization for ‘(anonymous).pipe_profiles’)
../drivers/net/softnic/rte_eth_softnic_tm.c:2554:4: error: missing braces around initializer [-Werror=missing-braces]
 2554 |    (struct rte_sched_subport_params) {
      |    ^
 2555 |     .tb_rate = n->shaper_profile->params.peak.rate,
 2556 |     .tb_size = n->shaper_profile->params.peak.size,
      |                {                                  }
../drivers/net/softnic/rte_eth_softnic_tm.c:2572:6: error: ‘struct rte_sched_subport_params’ has no member named ‘tc_period’
 2572 |     .tc_period = SUBPORT_TC_PERIOD,
      |      ^~~~~~~~~
../drivers/net/softnic/rte_eth_softnic_tm.c:2574:6: error: initialized field overwritten [-Werror=override-init]
 2574 |      h->n_tm_nodes[TM_NODE_LEVEL_PIPE] /
      |      ^
../drivers/net/softnic/rte_eth_softnic_tm.c:2574:6: note: (near initialization for ‘(anonymous).n_pipes_per_subport_enabled’)
../drivers/net/softnic/rte_eth_softnic_tm.c:2554:4: error: missing braces around initializer [-Werror=missing-braces]
 2554 |    (struct rte_sched_subport_params) {
      |    ^
 2555 |     .tb_rate = n->shaper_profile->params.peak.rate,
 2556 |     .tb_size = n->shaper_profile->params.peak.size,
      |                {                                  }
../drivers/net/softnic/rte_eth_softnic_tm.c:2576:14: error: initialized field overwritten [-Werror=override-init]
 2576 |     .qsize = {p->params.tm.qsize[0],
      |              ^
../drivers/net/softnic/rte_eth_softnic_tm.c:2576:14: note: (near initialization for ‘(anonymous).qsize’)
../drivers/net/softnic/rte_eth_softnic_tm.c:2590:22: error: initialized field overwritten [-Werror=override-init]
 2590 |     .pipe_profiles = t->pipe_profiles,
      |                      ^
../drivers/net/softnic/rte_eth_softnic_tm.c:2590:22: note: (near initialization for ‘(anonymous).pipe_profiles’)
../drivers/net/softnic/rte_eth_softnic_tm.c:2591:24: error: initialized field overwritten [-Werror=override-init]
 2591 |     .n_pipe_profiles = t->n_pipe_profiles,
      |                        ^
../drivers/net/softnic/rte_eth_softnic_tm.c:2591:24: note: (near initialization for ‘(anonymous).n_pipe_profiles’)
../drivers/net/softnic/rte_eth_softnic_tm.c:2554:4: error: missing braces around initializer [-Werror=missing-braces]
 2554 |    (struct rte_sched_subport_params) {
      |    ^
 2555 |     .tb_rate = n->shaper_profile->params.peak.rate,
 2556 |     .tb_size = n->shaper_profile->params.peak.size,
      |                {                                  }
../drivers/net/softnic/rte_eth_softnic_tm.c: In function ‘update_subport_rate’:
../drivers/net/softnic/rte_eth_softnic_tm.c:2838:16: error: ‘struct rte_sched_subport_params’ has no member named ‘tb_rate’
 2838 |  subport_params.tb_rate = sp->params.peak.rate;
      |                ^
../drivers/net/softnic/rte_eth_softnic_tm.c:2839:17: error: ‘struct rte_sched_subport_params’ has no member named ‘tb_size’; did you mean ‘qsize’?
 2839 |  subport_params.tb_size = sp->params.peak.size;
      |                 ^~~~~~~
      |                 qsize
cc1: all warnings being treated as errors
[1575/2442] Compiling C object 'drivers/a715181@@tmp_rte_pmd_softnic at sta/net_softnic_rte_eth_softnic_tap.c.o'.
[1576/2442] Compiling C object 'drivers/a715181@@tmp_rte_pmd_softnic at sta/net_softnic_rte_eth_softnic_action.c.o'.
[1577/2442] Compiling C object 'drivers/a715181@@tmp_rte_pmd_sfc at sta/net_sfc_sfc_flow.c.o'.
[1578/2442] Compiling C object 'drivers/a715181@@tmp_rte_pmd_softnic at sta/net_softnic_rte_eth_softnic_link.c.o'.
[1579/2442] Compiling C object 'drivers/a715181@@tmp_rte_pmd_softnic at sta/net_softnic_rte_eth_softnic_mempool.c.o'.
[1580/2442] Compiling C object 'drivers/a715181@@tmp_rte_pmd_sfc at sta/net_sfc_sfc_ef10_rx.c.o'.
[1581/2442] Compiling C object 'drivers/a715181@@tmp_rte_pmd_sfc at sta/net_sfc_sfc_ef10_tx.c.o'.
[1582/2442] Compiling C object 'drivers/a715181@@tmp_rte_pmd_octeontx2 at sta/net_octeontx2_otx2_rx.c.o'.
[1583/2442] Compiling C object 'drivers/a715181@@tmp_rte_pmd_softnic at sta/net_softnic_rte_eth_softnic_thread.c.o'.
[1584/2442] Compiling C object 'drivers/a715181@@tmp_rte_pmd_softnic at sta/net_softnic_rte_eth_softnic_cli.c.o'.
[1585/2442] Compiling C object 'drivers/a715181@@tmp_rte_pmd_octeontx2 at sta/net_octeontx2_otx2_tx.c.o'.
ninja: build stopped: subcommand failed




*Meson Build Failed #3:
OS: FreeBSD1201-64
Target:./build-gcc-static
FAILED: app/test/3062f5d@@dpdk-test at exe/test_sched.c.o 
gcc -Iapp/test/3062f5d@@dpdk-test at exe -Iapp/test -I../app/test -Ilib/librte_acl -I../lib/librte_acl -I. -I.. -Iconfig -I../config -Ilib/librte_eal/include -I../lib/librte_eal/include -Ilib/librte_eal/freebsd/include -I../lib/librte_eal/freebsd/include -Ilib/librte_eal/x86/include -I../lib/librte_eal/x86/include -Ilib/librte_eal/common -I../lib/librte_eal/common -Ilib/librte_eal -I../lib/librte_eal -Ilib/librte_kvargs -I../lib/librte_kvargs -Ilib/librte_metrics -I../lib/librte_metrics -Ilib/librte_telemetry -I../lib/librte_telemetry -Idrivers/bus/pci -I../drivers/bus/pci -I../drivers/bus/pci/bsd -Ilib/librte_pci -I../lib/librte_pci -Idrivers/bus/vdev -I../drivers/bus/vdev -Ilib/librte_bitratestats -I../lib/librte_bitratestats -Ilib/librte_ethdev -I../lib/librte_ethdev -Ilib/librte_net -I../lib/librte_net -Ilib/librte_mbuf -I../lib/librte_mbuf -Ilib/librte_mempool -I../lib/librte_mempool -Ilib/librte_ring -I../lib/librte_ring -Ilib/librte_meter -I../lib/librte_meter -Ilib/librte_bpf -I../lib/librte_bpf -Ilib/librte_cfgfile -I../lib/librte_cfgfile -Ilib/librte_cmdline -I../lib/librte_cmdline -Ilib/librte_cryptodev -I../lib/librte_cryptodev -Ilib/librte_distributor -I../lib/librte_distributor -Ilib/librte_efd -I../lib/librte_efd -Ilib/librte_hash -I../lib/librte_hash -Ilib/librte_eventdev -I../lib/librte_eventdev -Ilib/librte_timer -I../lib/librte_timer -Ilib/librte_fib -I../lib/librte_fib -Ilib/librte_rib -I../lib/librte_rib -Ilib/librte_flow_classify -I../lib/librte_flow_classify -Ilib/librte_table -I../lib/librte_table -Ilib/librte_port -I../lib/librte_port -Ilib/librte_sched -I../lib/librte_sched -Ilib/librte_ip_frag -I../lib/librte_ip_frag -Ilib/librte_lpm -I../lib/librte_lpm -Ilib/librte_rcu -I../lib/librte_rcu -Ilib/librte_graph -I../lib/librte_graph -Ilib/librte_ipsec -I../lib/librte_ipsec -Ilib/librte_security -I../lib/librte_security -Ilib/librte_latencystats -I../lib/librte_latencystats -Ilib/librte_member -I../lib/librte_member -Ilib/librte_node -I../lib/librte_node -Ilib/librte_pipeline -I../lib/librte_pipeline -Ilib/librte_rawdev -I../lib/librte_rawdev -Ilib/librte_reorder -I../lib/librte_reorder -Ilib/librte_stack -I../lib/librte_stack -Idrivers/mempool/ring -I../drivers/mempool/ring -Idrivers/mempool/stack -I../drivers/mempool/stack -Idrivers/event/skeleton -I../drivers/event/skeleton -Idrivers/net/bonding -I../drivers/net/bonding -Idrivers/net/ring -I../drivers/net/ring -Ilib/librte_pdump -I../lib/librte_pdump -Ilib/librte_compressdev -I../lib/librte_compressdev -fdiagnostics-color=always -pipe -D_FILE_OFFSET_BITS=64 -Wall -Winvalid-pch -Werror -O2 -g -include rte_config.h -Wextra -Wcast-qual -Wdeprecated -Wformat-nonliteral -Wformat-security -Wmissing-declarations -Wmissing-prototypes -Wnested-externs -Wold-style-definition -Wpointer-arith -Wsign-compare -Wstrict-prototypes -Wundef -Wwrite-strings -Wno-address-of-packed-member -Wno-packed-not-aligned -Wno-missing-field-initializers -D__BSD_VISIBLE -march=native -mno-avx512f -DALLOW_EXPERIMENTAL_API -Wno-format-truncation -D_GNU_SOURCE -fno-strict-aliasing -DALLOW_INTERNAL_API -MD -MQ 'app/test/3062f5d@@dpdk-test at exe/test_sched.c.o' -MF 'app/test/3062f5d@@dpdk-test at exe/test_sched.c.o.d' -o 'app/test/3062f5d@@dpdk-test at exe/test_sched.c.o' -c ../app/test/test_sched.c
../app/test/test_sched.c:41:4: error: 'struct rte_sched_subport_params' has no member named 'tb_rate'
   41 |   .tb_rate = 1250000000,
      |    ^~~~~~~
../app/test/test_sched.c:42:4: error: 'struct rte_sched_subport_params' has no member named 'tb_size'; did you mean 'qsize'?
   42 |   .tb_size = 1000000,
      |    ^~~~~~~
      |    qsize
../app/test/test_sched.c:42:14: error: unsigned conversion from 'int' to 'short unsigned int' changes value from '1000000' to '16960' [-Werror=overflow]
   42 |   .tb_size = 1000000,
      |              ^~~~~~~
../app/test/test_sched.c:44:4: error: 'struct rte_sched_subport_params' has no member named 'tc_rate'
   44 |   .tc_rate = {1250000000, 1250000000, 1250000000, 1250000000,
      |    ^~~~~~~
../app/test/test_sched.c:44:3: error: braces around scalar initializer [-Werror]
   44 |   .tc_rate = {1250000000, 1250000000, 1250000000, 1250000000,
      |   ^
../app/test/test_sched.c:44:3: note: (near initialization for 'subport_param[0].pipe_profiles')
../app/test/test_sched.c:44:15: error: initialization of 'struct rte_sched_pipe_params *' from 'int' makes pointer from integer without a cast [-Werror=int-conversion]
   44 |   .tc_rate = {1250000000, 1250000000, 1250000000, 1250000000,
      |               ^~~~~~~~~~
../app/test/test_sched.c:44:15: note: (near initialization for 'subport_param[0].pipe_profiles')
../app/test/test_sched.c:44:27: error: excess elements in scalar initializer [-Werror]
   44 |   .tc_rate = {1250000000, 1250000000, 1250000000, 1250000000,
      |                           ^~~~~~~~~~
../app/test/test_sched.c:44:27: note: (near initialization for 'subport_param[0].pipe_profiles')
../app/test/test_sched.c:44:39: error: excess elements in scalar initializer [-Werror]
   44 |   .tc_rate = {1250000000, 1250000000, 1250000000, 1250000000,
      |                                       ^~~~~~~~~~
../app/test/test_sched.c:44:39: note: (near initialization for 'subport_param[0].pipe_profiles')
../app/test/test_sched.c:44:51: error: excess elements in scalar initializer [-Werror]
   44 |   .tc_rate = {1250000000, 1250000000, 1250000000, 1250000000,
      |                                                   ^~~~~~~~~~
../app/test/test_sched.c:44:51: note: (near initialization for 'subport_param[0].pipe_profiles')
../app/test/test_sched.c:45:4: error: excess elements in scalar initializer [-Werror]
   45 |    1250000000, 1250000000, 1250000000, 1250000000, 1250000000,
      |    ^~~~~~~~~~
../app/test/test_sched.c:45:4: note: (near initialization for 'subport_param[0].pipe_profiles')
../app/test/test_sched.c:45:16: error: excess elements in scalar initializer [-Werror]
   45 |    1250000000, 1250000000, 1250000000, 1250000000, 1250000000,
      |                ^~~~~~~~~~
../app/test/test_sched.c:45:16: note: (near initialization for 'subport_param[0].pipe_profiles')
../app/test/test_sched.c:45:28: error: excess elements in scalar initializer [-Werror]
   45 |    1250000000, 1250000000, 1250000000, 1250000000, 1250000000,
      |                            ^~~~~~~~~~
../app/test/test_sched.c:45:28: note: (near initialization for 'subport_param[0].pipe_profiles')
../app/test/test_sched.c:45:40: error: excess elements in scalar initializer [-Werror]
   45 |    1250000000, 1250000000, 1250000000, 1250000000, 1250000000,
      |                                        ^~~~~~~~~~
../app/test/test_sched.c:45:40: note: (near initialization for 'subport_param[0].pipe_profiles')
../app/test/test_sched.c:45:52: error: excess elements in scalar initializer [-Werror]
   45 |    1250000000, 1250000000, 1250000000, 1250000000, 1250000000,
      |                                                    ^~~~~~~~~~
../app/test/test_sched.c:45:52: note: (near initialization for 'subport_param[0].pipe_profiles')
../app/test/test_sched.c:46:4: error: excess elements in scalar initializer [-Werror]
   46 |    1250000000, 1250000000, 1250000000, 1250000000},
      |    ^~~~~~~~~~
../app/test/test_sched.c:46:4: note: (near initialization for 'subport_param[0].pipe_profiles')
../app/test/test_sched.c:46:16: error: excess elements in scalar initializer [-Werror]
   46 |    1250000000, 1250000000, 1250000000, 1250000000},
      |                ^~~~~~~~~~
../app/test/test_sched.c:46:16: note: (near initialization for 'subport_param[0].pipe_profiles')
../app/test/test_sched.c:46:28: error: excess elements in scalar initializer [-Werror]
   46 |    1250000000, 1250000000, 1250000000, 1250000000},
      |                            ^~~~~~~~~~
../app/test/test_sched.c:46:28: note: (near initialization for 'subport_param[0].pipe_profiles')
../app/test/test_sched.c:46:40: error: excess elements in scalar initializer [-Werror]
   46 |    1250000000, 1250000000, 1250000000, 1250000000},
      |                                        ^~~~~~~~~~
../app/test/test_sched.c:46:40: note: (near initialization for 'subport_param[0].pipe_profiles')
../app/test/test_sched.c:39:58: error: missing braces around initializer [-Werror=missing-braces]
   39 | static struct rte_sched_subport_params subport_param[] = {
      |                                                          ^
......
   42 |   .tb_size = 1000000,
      |              {      }
../app/test/test_sched.c:47:4: error: 'struct rte_sched_subport_params' has no member named 'tc_period'
   47 |   .tc_period = 10,
      |    ^~~~~~~~~
../app/test/test_sched.c:48:34: error: initialized field overwritten [-Werror=override-init]
   48 |   .n_pipes_per_subport_enabled = 1024,
      |                                  ^~~~
../app/test/test_sched.c:48:34: note: (near initialization for 'subport_param[0].n_pipes_per_subport_enabled')
../app/test/test_sched.c:39:58: error: missing braces around initializer [-Werror=missing-braces]
   39 | static struct rte_sched_subport_params subport_param[] = {
      |                                                          ^
......
   42 |   .tb_size = 1000000,
      |              {      }
../app/test/test_sched.c:49:12: error: initialized field overwritten [-Werror=override-init]
   49 |   .qsize = {32, 32, 32, 32, 32, 32, 32, 32, 32, 32, 32, 32, 32},
      |            ^
../app/test/test_sched.c:49:12: note: (near initialization for 'subport_param[0].qsize')
../app/test/test_sched.c:50:20: error: initialized field overwritten [-Werror=override-init]
   50 |   .pipe_profiles = pipe_profile,
      |                    ^~~~~~~~~~~~
../app/test/test_sched.c:50:20: note: (near initialization for 'subport_param[0].pipe_profiles')
../app/test/test_sched.c:51:22: error: initialized field overwritten [-Werror=override-init]
   51 |   .n_pipe_profiles = 1,
      |                      ^
../app/test/test_sched.c:51:22: note: (near initialization for 'subport_param[0].n_pipe_profiles')
../app/test/test_sched.c:39:58: error: missing braces around initializer [-Werror=missing-braces]
   39 | static struct rte_sched_subport_params subport_param[] = {
      |                                                          ^
......
   42 |   .tb_size = 1000000,
      |              {      }
../app/test/test_sched.c:39:58: error: missing braces around initializer [-Werror=missing-braces]
   39 | static struct rte_sched_subport_params subport_param[] = {
      |                                                          ^
......
   42 |   .tb_size = 1000000,
      |              {      }
cc1: all warnings being treated as errors
[1713/1781] Compiling C object 'app/test/3062f5d@@dpdk-test at exe/test_stack_perf.c.o'
[1714/1781] Compiling C object 'app/test/3062f5d@@dpdk-test at exe/test_stack.c.o'
[1715/1781] Compiling C object 'app/test/3062f5d@@dpdk-test at exe/test_service_cores.c.o'
[1716/1781] Compiling C object 'app/test/3062f5d@@dpdk-test at exe/test_security.c.o'
[1717/1781] Compiling C object 'app/test/3062f5d@@dpdk-test at exe/test_memcpy_perf.c.o'
[1718/1781] Compiling C object 'app/test/3062f5d@@dpdk-test at exe/test_ring_perf.c.o'
[1719/1781] Compiling C object 'app/test/3062f5d@@dpdk-test at exe/test_ring.c.o'
[1720/1781] Compiling C object 'drivers/a715181@@tmp_rte_pmd_octeontx2_event at sta/event_octeontx2_otx2_worker.c.o'
[1721/1781] Compiling C object 'drivers/a715181@@tmp_rte_pmd_octeontx2_event at sta/event_octeontx2_otx2_worker_dual.c.o'
ninja: build stopped: subcommand failed




*Meson Build Failed #4:
OS: SUSE15-64
Target:./build-gcc-static
FAILED: drivers/a715181@@tmp_rte_pmd_softnic at sta/net_softnic_rte_eth_softnic_tm.c.o 
gcc -Idrivers/a715181@@tmp_rte_pmd_softnic at sta -Idrivers -I../drivers -Idrivers/net/softnic -I../drivers/net/softnic -Ilib/librte_ethdev -I../lib/librte_ethdev -I. -I../ -Iconfig -I../config -Ilib/librte_eal/include -I../lib/librte_eal/include -Ilib/librte_eal/linux/include -I../lib/librte_eal/linux/include -Ilib/librte_eal/x86/include -I../lib/librte_eal/x86/include -Ilib/librte_eal/common -I../lib/librte_eal/common -Ilib/librte_eal -I../lib/librte_eal -Ilib/librte_kvargs -I../lib/librte_kvargs -Ilib/librte_telemetry/../librte_metrics -I../lib/librte_telemetry/../librte_metrics -Ilib/librte_telemetry -I../lib/librte_telemetry -Ilib/librte_net -I../lib/librte_net -Ilib/librte_mbuf -I../lib/librte_mbuf -Ilib/librte_mempool -I../lib/librte_mempool -Ilib/librte_ring -I../lib/librte_ring -Ilib/librte_meter -I../lib/librte_meter -Idrivers/bus/pci -I../drivers/bus/pci -I../drivers/bus/pci/linux -Ilib/librte_pci -I../lib/librte_pci -Idrivers/bus/vdev -I../drivers/bus/vdev -Ilib/librte_pipeline -I../lib/librte_pipeline -Ilib/librte_port -I../lib/librte_port -Ilib/librte_sched -I../lib/librte_sched -Ilib/librte_ip_frag -I../lib/librte_ip_frag -Ilib/librte_hash -I../lib/librte_hash -Ilib/librte_cryptodev -I../lib/librte_cryptodev -Ilib/librte_eventdev -I../lib/librte_eventdev -Ilib/librte_timer -I../lib/librte_timer -Ilib/librte_kni -I../lib/librte_kni -Ilib/librte_table -I../lib/librte_table -Ilib/librte_lpm -I../lib/librte_lpm -Ilib/librte_rcu -I../lib/librte_rcu -Ilib/librte_acl -I../lib/librte_acl -fdiagnostics-color=always -pipe -D_FILE_OFFSET_BITS=64 -Wall -Winvalid-pch -Werror -O2 -g -include rte_config.h -Wextra -Wcast-qual -Wdeprecated -Wformat-nonliteral -Wformat-security -Wmissing-declarations -Wmissing-prototypes -Wnested-externs -Wold-style-definition -Wpointer-arith -Wsign-compare -Wstrict-prototypes -Wundef -Wwrite-strings -Wno-missing-field-initializers -D_GNU_SOURCE -fPIC -march=native -DALLOW_EXPERIMENTAL_API -DALLOW_INTERNAL_API -Wno-format-truncation -MD -MQ 'drivers/a715181@@tmp_rte_pmd_softnic at sta/net_softnic_rte_eth_softnic_tm.c.o' -MF 'drivers/a715181@@tmp_rte_pmd_softnic at sta/net_softnic_rte_eth_softnic_tm.c.o.d' -o 'drivers/a715181@@tmp_rte_pmd_softnic at sta/net_softnic_rte_eth_softnic_tm.c.o' -c ../drivers/net/softnic/rte_eth_softnic_tm.c
../drivers/net/softnic/rte_eth_softnic_tm.c: In function ‘update_subport_tc_rate’:
../drivers/net/softnic/rte_eth_softnic_tm.c:1068:16: error: ‘struct rte_sched_subport_params’ has no member named ‘tc_rate’
  subport_params.tc_rate[tc_id] = sp_new->params.peak.rate;
                ^
../drivers/net/softnic/rte_eth_softnic_tm.c:1052:11: error: variable ‘tc_id’ set but not used [-Werror=unused-but-set-variable]
  uint32_t tc_id = tm_node_tc_id(dev, nt);
           ^~~~~
../drivers/net/softnic/rte_eth_softnic_tm.c: In function ‘hierarchy_blueprints_create’:
../drivers/net/softnic/rte_eth_softnic_tm.c:2555:6: error: ‘struct rte_sched_subport_params’ has no member named ‘tb_rate’
     .tb_rate = n->shaper_profile->params.peak.rate,
      ^~~~~~~
../drivers/net/softnic/rte_eth_softnic_tm.c:2556:6: error: ‘struct rte_sched_subport_params’ has no member named ‘tb_size’; did you mean ‘qsize’?
     .tb_size = n->shaper_profile->params.peak.size,
      ^~~~~~~
      qsize
../drivers/net/softnic/rte_eth_softnic_tm.c:2558:6: error: ‘struct rte_sched_subport_params’ has no member named ‘tc_rate’
     .tc_rate = {tc_rate[0],
      ^~~~~~~
../drivers/net/softnic/rte_eth_softnic_tm.c:2558:5: error: braces around scalar initializer [-Werror]
     .tc_rate = {tc_rate[0],
     ^
../drivers/net/softnic/rte_eth_softnic_tm.c:2558:5: note: (near initialization for ‘(anonymous).pipe_profiles’)
../drivers/net/softnic/rte_eth_softnic_tm.c:2558:17: error: initialization makes pointer from integer without a cast [-Werror=int-conversion]
     .tc_rate = {tc_rate[0],
                 ^~~~~~~
../drivers/net/softnic/rte_eth_softnic_tm.c:2558:17: note: (near initialization for ‘(anonymous).pipe_profiles’)
../drivers/net/softnic/rte_eth_softnic_tm.c:2559:6: error: excess elements in scalar initializer [-Werror]
      tc_rate[1],
      ^~~~~~~
../drivers/net/softnic/rte_eth_softnic_tm.c:2559:6: note: (near initialization for ‘(anonymous).pipe_profiles’)
../drivers/net/softnic/rte_eth_softnic_tm.c:2560:6: error: excess elements in scalar initializer [-Werror]
      tc_rate[2],
      ^~~~~~~
../drivers/net/softnic/rte_eth_softnic_tm.c:2560:6: note: (near initialization for ‘(anonymous).pipe_profiles’)
../drivers/net/softnic/rte_eth_softnic_tm.c:2561:6: error: excess elements in scalar initializer [-Werror]
      tc_rate[3],
      ^~~~~~~
../drivers/net/softnic/rte_eth_softnic_tm.c:2561:6: note: (near initialization for ‘(anonymous).pipe_profiles’)
../drivers/net/softnic/rte_eth_softnic_tm.c:2562:6: error: excess elements in scalar initializer [-Werror]
      tc_rate[4],
      ^~~~~~~
../drivers/net/softnic/rte_eth_softnic_tm.c:2562:6: note: (near initialization for ‘(anonymous).pipe_profiles’)
../drivers/net/softnic/rte_eth_softnic_tm.c:2563:6: error: excess elements in scalar initializer [-Werror]
      tc_rate[5],
      ^~~~~~~
../drivers/net/softnic/rte_eth_softnic_tm.c:2563:6: note: (near initialization for ‘(anonymous).pipe_profiles’)
../drivers/net/softnic/rte_eth_softnic_tm.c:2564:6: error: excess elements in scalar initializer [-Werror]
      tc_rate[6],
      ^~~~~~~
../drivers/net/softnic/rte_eth_softnic_tm.c:2564:6: note: (near initialization for ‘(anonymous).pipe_profiles’)
../drivers/net/softnic/rte_eth_softnic_tm.c:2565:6: error: excess elements in scalar initializer [-Werror]
      tc_rate[7],
      ^~~~~~~
../drivers/net/softnic/rte_eth_softnic_tm.c:2565:6: note: (near initialization for ‘(anonymous).pipe_profiles’)
../drivers/net/softnic/rte_eth_softnic_tm.c:2566:6: error: excess elements in scalar initializer [-Werror]
      tc_rate[8],
      ^~~~~~~
../drivers/net/softnic/rte_eth_softnic_tm.c:2566:6: note: (near initialization for ‘(anonymous).pipe_profiles’)
../drivers/net/softnic/rte_eth_softnic_tm.c:2567:6: error: excess elements in scalar initializer [-Werror]
      tc_rate[9],
      ^~~~~~~
../drivers/net/softnic/rte_eth_softnic_tm.c:2567:6: note: (near initialization for ‘(anonymous).pipe_profiles’)
../drivers/net/softnic/rte_eth_softnic_tm.c:2568:6: error: excess elements in scalar initializer [-Werror]
      tc_rate[10],
      ^~~~~~~
../drivers/net/softnic/rte_eth_softnic_tm.c:2568:6: note: (near initialization for ‘(anonymous).pipe_profiles’)
../drivers/net/softnic/rte_eth_softnic_tm.c:2569:6: error: excess elements in scalar initializer [-Werror]
      tc_rate[11],
      ^~~~~~~
../drivers/net/softnic/rte_eth_softnic_tm.c:2569:6: note: (near initialization for ‘(anonymous).pipe_profiles’)
../drivers/net/softnic/rte_eth_softnic_tm.c:2570:6: error: excess elements in scalar initializer [-Werror]
      tc_rate[12],
      ^~~~~~~
../drivers/net/softnic/rte_eth_softnic_tm.c:2570:6: note: (near initialization for ‘(anonymous).pipe_profiles’)
../drivers/net/softnic/rte_eth_softnic_tm.c:2554:4: error: missing braces around initializer [-Werror=missing-braces]
    (struct rte_sched_subport_params) {
    ^
../drivers/net/softnic/rte_eth_softnic_tm.c:2556:16:
     .tb_size = n->shaper_profile->params.peak.size,
                {                                  }
../drivers/net/softnic/rte_eth_softnic_tm.c:2572:6: error: ‘struct rte_sched_subport_params’ has no member named ‘tc_period’
     .tc_period = SUBPORT_TC_PERIOD,
      ^~~~~~~~~
../drivers/net/softnic/rte_eth_softnic_tm.c:2574:6: error: initialized field overwritten [-Werror=override-init]
      h->n_tm_nodes[TM_NODE_LEVEL_PIPE] /
      ^
../drivers/net/softnic/rte_eth_softnic_tm.c:2574:6: note: (near initialization for ‘(anonymous).n_pipes_per_subport_enabled’)
../drivers/net/softnic/rte_eth_softnic_tm.c:2554:4: error: missing braces around initializer [-Werror=missing-braces]
    (struct rte_sched_subport_params) {
    ^
../drivers/net/softnic/rte_eth_softnic_tm.c:2556:16:
     .tb_size = n->shaper_profile->params.peak.size,
                {                                  }
../drivers/net/softnic/rte_eth_softnic_tm.c:2576:14: error: initialized field overwritten [-Werror=override-init]
     .qsize = {p->params.tm.qsize[0],
              ^
../drivers/net/softnic/rte_eth_softnic_tm.c:2576:14: note: (near initialization for ‘(anonymous).qsize’)
../drivers/net/softnic/rte_eth_softnic_tm.c:2590:22: error: initialized field overwritten [-Werror=override-init]
     .pipe_profiles = t->pipe_profiles,
                      ^
../drivers/net/softnic/rte_eth_softnic_tm.c:2590:22: note: (near initialization for ‘(anonymous).pipe_profiles’)
../drivers/net/softnic/rte_eth_softnic_tm.c:2591:24: error: initialized field overwritten [-Werror=override-init]
     .n_pipe_profiles = t->n_pipe_profiles,
                        ^
../drivers/net/softnic/rte_eth_softnic_tm.c:2591:24: note: (near initialization for ‘(anonymous).n_pipe_profiles’)
../drivers/net/softnic/rte_eth_softnic_tm.c:2554:4: error: missing braces around initializer [-Werror=missing-braces]
    (struct rte_sched_subport_params) {
    ^
../drivers/net/softnic/rte_eth_softnic_tm.c:2556:16:
     .tb_size = n->shaper_profile->params.peak.size,
                {                                  }
../drivers/net/softnic/rte_eth_softnic_tm.c: In function ‘update_subport_rate’:
../drivers/net/softnic/rte_eth_softnic_tm.c:2838:16: error: ‘struct rte_sched_subport_params’ has no member named ‘tb_rate’
  subport_params.tb_rate = sp->params.peak.rate;
                ^
../drivers/net/softnic/rte_eth_softnic_tm.c:2839:17: error: ‘struct rte_sched_subport_params’ has no member named ‘tb_size’; did you mean ‘qsize’?
  subport_params.tb_size = sp->params.peak.size;
                 ^~~~~~~
                 qsize
cc1: all warnings being treated as errors
[1569/2336] Compiling C object 'drivers/a715181@@tmp_rte_pmd_sfc at sta/net_sfc_sfc_ef10_essb_rx.c.o'.
[1570/2336] Compiling C object 'drivers/a715181@@tmp_rte_pmd_sfc at sta/net_sfc_sfc_ethdev.c.o'.
[1571/2336] Compiling C object 'drivers/a715181@@tmp_rte_pmd_sfc at sta/net_sfc_sfc_ef10_rx.c.o'.
[1572/2336] Compiling C object 'drivers/a715181@@tmp_rte_pmd_sfc at sta/net_sfc_sfc_flow.c.o'.
[1573/2336] Compiling C object 'drivers/a715181@@tmp_rte_pmd_softnic at sta/net_softnic_rte_eth_softnic_swq.c.o'.
[1574/2336] Compiling C object 'drivers/a715181@@tmp_rte_pmd_softnic at sta/net_softnic_rte_eth_softnic_link.c.o'.
[1575/2336] Compiling C object 'drivers/a715181@@tmp_rte_pmd_softnic at sta/net_softnic_rte_eth_softnic.c.o'.
[1576/2336] Compiling C object 'drivers/a715181@@tmp_rte_pmd_sfc at sta/net_sfc_sfc_ef10_tx.c.o'.
[1577/2336] Compiling C object 'drivers/a715181@@tmp_rte_pmd_octeontx2_event at sta/event_octeontx2_otx2_worker_dual.c.o'.
ninja: build stopped: subcommand failed




*Meson Build Failed #5:
OS: UB2004-32
Target:./build-gcc-static
FAILED: drivers/a715181@@tmp_rte_pmd_softnic at sta/net_softnic_rte_eth_softnic_tm.c.o 
gcc -Idrivers/a715181@@tmp_rte_pmd_softnic at sta -Idrivers -I../drivers -Idrivers/net/softnic -I../drivers/net/softnic -Ilib/librte_ethdev -I../lib/librte_ethdev -I. -I../ -Iconfig -I../config -Ilib/librte_eal/include -I../lib/librte_eal/include -Ilib/librte_eal/linux/include -I../lib/librte_eal/linux/include -Ilib/librte_eal/x86/include -I../lib/librte_eal/x86/include -Ilib/librte_eal/common -I../lib/librte_eal/common -Ilib/librte_eal -I../lib/librte_eal -Ilib/librte_kvargs -I../lib/librte_kvargs -Ilib/librte_telemetry/../librte_metrics -I../lib/librte_telemetry/../librte_metrics -Ilib/librte_telemetry -I../lib/librte_telemetry -Ilib/librte_net -I../lib/librte_net -Ilib/librte_mbuf -I../lib/librte_mbuf -Ilib/librte_mempool -I../lib/librte_mempool -Ilib/librte_ring -I../lib/librte_ring -Ilib/librte_meter -I../lib/librte_meter -Idrivers/bus/pci -I../drivers/bus/pci -I../drivers/bus/pci/linux -Ilib/librte_pci -I../lib/librte_pci -Idrivers/bus/vdev -I../drivers/bus/vdev -Ilib/librte_pipeline -I../lib/librte_pipeline -Ilib/librte_port -I../lib/librte_port -Ilib/librte_sched -I../lib/librte_sched -Ilib/librte_ip_frag -I../lib/librte_ip_frag -Ilib/librte_hash -I../lib/librte_hash -Ilib/librte_cryptodev -I../lib/librte_cryptodev -Ilib/librte_eventdev -I../lib/librte_eventdev -Ilib/librte_timer -I../lib/librte_timer -Ilib/librte_table -I../lib/librte_table -Ilib/librte_lpm -I../lib/librte_lpm -Ilib/librte_rcu -I../lib/librte_rcu -Ilib/librte_acl -I../lib/librte_acl -fdiagnostics-color=always -pipe -D_FILE_OFFSET_BITS=64 -Wall -Winvalid-pch -Werror -O2 -g -include rte_config.h -Wextra -Wcast-qual -Wdeprecated -Wformat-nonliteral -Wformat-security -Wmissing-declarations -Wmissing-prototypes -Wnested-externs -Wold-style-definition -Wpointer-arith -Wsign-compare -Wstrict-prototypes -Wundef -Wwrite-strings -Wno-address-of-packed-member -Wno-packed-not-aligned -Wno-missing-field-initializers -Wno-pointer-to-int-cast -D_GNU_SOURCE -m32 -fPIC -march=native -DALLOW_EXPERIMENTAL_API -DALLOW_INTERNAL_API -Wno-format-truncation -MD -MQ 'drivers/a715181@@tmp_rte_pmd_softnic at sta/net_softnic_rte_eth_softnic_tm.c.o' -MF 'drivers/a715181@@tmp_rte_pmd_softnic at sta/net_softnic_rte_eth_softnic_tm.c.o.d' -o 'drivers/a715181@@tmp_rte_pmd_softnic at sta/net_softnic_rte_eth_softnic_tm.c.o' -c ../drivers/net/softnic/rte_eth_softnic_tm.c
../drivers/net/softnic/rte_eth_softnic_tm.c: In function ‘update_subport_tc_rate’:
../drivers/net/softnic/rte_eth_softnic_tm.c:1068:16: error: ‘struct rte_sched_subport_params’ has no member named ‘tc_rate’
 1068 |  subport_params.tc_rate[tc_id] = sp_new->params.peak.rate;
      |                ^
../drivers/net/softnic/rte_eth_softnic_tm.c:1052:11: error: variable ‘tc_id’ set but not used [-Werror=unused-but-set-variable]
 1052 |  uint32_t tc_id = tm_node_tc_id(dev, nt);
      |           ^~~~~
../drivers/net/softnic/rte_eth_softnic_tm.c: In function ‘hierarchy_blueprints_create’:
../drivers/net/softnic/rte_eth_softnic_tm.c:2555:6: error: ‘struct rte_sched_subport_params’ has no member named ‘tb_rate’
 2555 |     .tb_rate = n->shaper_profile->params.peak.rate,
      |      ^~~~~~~
../drivers/net/softnic/rte_eth_softnic_tm.c:2556:6: error: ‘struct rte_sched_subport_params’ has no member named ‘tb_size’; did you mean ‘qsize’?
 2556 |     .tb_size = n->shaper_profile->params.peak.size,
      |      ^~~~~~~
      |      qsize
../drivers/net/softnic/rte_eth_softnic_tm.c:2558:6: error: ‘struct rte_sched_subport_params’ has no member named ‘tc_rate’
 2558 |     .tc_rate = {tc_rate[0],
      |      ^~~~~~~
../drivers/net/softnic/rte_eth_softnic_tm.c:2558:5: error: braces around scalar initializer [-Werror]
 2558 |     .tc_rate = {tc_rate[0],
      |     ^
../drivers/net/softnic/rte_eth_softnic_tm.c:2558:5: note: (near initialization for ‘(anonymous).pipe_profiles’)
../drivers/net/softnic/rte_eth_softnic_tm.c:2558:17: error: initialization of ‘struct rte_sched_pipe_params *’ from ‘uint64_t’ {aka ‘long long unsigned int’} makes pointer from integer without a cast [-Werror=int-conversion]
 2558 |     .tc_rate = {tc_rate[0],
      |                 ^~~~~~~
../drivers/net/softnic/rte_eth_softnic_tm.c:2558:17: note: (near initialization for ‘(anonymous).pipe_profiles’)
../drivers/net/softnic/rte_eth_softnic_tm.c:2559:6: error: excess elements in scalar initializer [-Werror]
 2559 |      tc_rate[1],
      |      ^~~~~~~
../drivers/net/softnic/rte_eth_softnic_tm.c:2559:6: note: (near initialization for ‘(anonymous).pipe_profiles’)
../drivers/net/softnic/rte_eth_softnic_tm.c:2560:6: error: excess elements in scalar initializer [-Werror]
 2560 |      tc_rate[2],
      |      ^~~~~~~
../drivers/net/softnic/rte_eth_softnic_tm.c:2560:6: note: (near initialization for ‘(anonymous).pipe_profiles’)
../drivers/net/softnic/rte_eth_softnic_tm.c:2561:6: error: excess elements in scalar initializer [-Werror]
 2561 |      tc_rate[3],
      |      ^~~~~~~
../drivers/net/softnic/rte_eth_softnic_tm.c:2561:6: note: (near initialization for ‘(anonymous).pipe_profiles’)
../drivers/net/softnic/rte_eth_softnic_tm.c:2562:6: error: excess elements in scalar initializer [-Werror]
 2562 |      tc_rate[4],
      |      ^~~~~~~
../drivers/net/softnic/rte_eth_softnic_tm.c:2562:6: note: (near initialization for ‘(anonymous).pipe_profiles’)
../drivers/net/softnic/rte_eth_softnic_tm.c:2563:6: error: excess elements in scalar initializer [-Werror]
 2563 |      tc_rate[5],
      |      ^~~~~~~
../drivers/net/softnic/rte_eth_softnic_tm.c:2563:6: note: (near initialization for ‘(anonymous).pipe_profiles’)
../drivers/net/softnic/rte_eth_softnic_tm.c:2564:6: error: excess elements in scalar initializer [-Werror]
 2564 |      tc_rate[6],
      |      ^~~~~~~
../drivers/net/softnic/rte_eth_softnic_tm.c:2564:6: note: (near initialization for ‘(anonymous).pipe_profiles’)
../drivers/net/softnic/rte_eth_softnic_tm.c:2565:6: error: excess elements in scalar initializer [-Werror]
 2565 |      tc_rate[7],
      |      ^~~~~~~
../drivers/net/softnic/rte_eth_softnic_tm.c:2565:6: note: (near initialization for ‘(anonymous).pipe_profiles’)
../drivers/net/softnic/rte_eth_softnic_tm.c:2566:6: error: excess elements in scalar initializer [-Werror]
 2566 |      tc_rate[8],
      |      ^~~~~~~
../drivers/net/softnic/rte_eth_softnic_tm.c:2566:6: note: (near initialization for ‘(anonymous).pipe_profiles’)
../drivers/net/softnic/rte_eth_softnic_tm.c:2567:6: error: excess elements in scalar initializer [-Werror]
 2567 |      tc_rate[9],
      |      ^~~~~~~
../drivers/net/softnic/rte_eth_softnic_tm.c:2567:6: note: (near initialization for ‘(anonymous).pipe_profiles’)
../drivers/net/softnic/rte_eth_softnic_tm.c:2568:6: error: excess elements in scalar initializer [-Werror]
 2568 |      tc_rate[10],
      |      ^~~~~~~
../drivers/net/softnic/rte_eth_softnic_tm.c:2568:6: note: (near initialization for ‘(anonymous).pipe_profiles’)
../drivers/net/softnic/rte_eth_softnic_tm.c:2569:6: error: excess elements in scalar initializer [-Werror]
 2569 |      tc_rate[11],
      |      ^~~~~~~
../drivers/net/softnic/rte_eth_softnic_tm.c:2569:6: note: (near initialization for ‘(anonymous).pipe_profiles’)
../drivers/net/softnic/rte_eth_softnic_tm.c:2570:6: error: excess elements in scalar initializer [-Werror]
 2570 |      tc_rate[12],
      |      ^~~~~~~
../drivers/net/softnic/rte_eth_softnic_tm.c:2570:6: note: (near initialization for ‘(anonymous).pipe_profiles’)
../drivers/net/softnic/rte_eth_softnic_tm.c:2554:4: error: missing braces around initializer [-Werror=missing-braces]
 2554 |    (struct rte_sched_subport_params) {
      |    ^
 2555 |     .tb_rate = n->shaper_profile->params.peak.rate,
 2556 |     .tb_size = n->shaper_profile->params.peak.size,
      |                {                                  }
../drivers/net/softnic/rte_eth_softnic_tm.c:2572:6: error: ‘struct rte_sched_subport_params’ has no member named ‘tc_period’
 2572 |     .tc_period = SUBPORT_TC_PERIOD,
      |      ^~~~~~~~~
../drivers/net/softnic/rte_eth_softnic_tm.c:2574:6: error: initialized field overwritten [-Werror=override-init]
 2574 |      h->n_tm_nodes[TM_NODE_LEVEL_PIPE] /
      |      ^
../drivers/net/softnic/rte_eth_softnic_tm.c:2574:6: note: (near initialization for ‘(anonymous).n_pipes_per_subport_enabled’)
../drivers/net/softnic/rte_eth_softnic_tm.c:2554:4: error: missing braces around initializer [-Werror=missing-braces]
 2554 |    (struct rte_sched_subport_params) {
      |    ^
 2555 |     .tb_rate = n->shaper_profile->params.peak.rate,
 2556 |     .tb_size = n->shaper_profile->params.peak.size,
      |                {                                  }
../drivers/net/softnic/rte_eth_softnic_tm.c:2576:14: error: initialized field overwritten [-Werror=override-init]
 2576 |     .qsize = {p->params.tm.qsize[0],
      |              ^
../drivers/net/softnic/rte_eth_softnic_tm.c:2576:14: note: (near initialization for ‘(anonymous).qsize’)
../drivers/net/softnic/rte_eth_softnic_tm.c:2590:22: error: initialized field overwritten [-Werror=override-init]
 2590 |     .pipe_profiles = t->pipe_profiles,
      |                      ^
../drivers/net/softnic/rte_eth_softnic_tm.c:2590:22: note: (near initialization for ‘(anonymous).pipe_profiles’)
../drivers/net/softnic/rte_eth_softnic_tm.c:2591:24: error: initialized field overwritten [-Werror=override-init]
 2591 |     .n_pipe_profiles = t->n_pipe_profiles,
      |                        ^
../drivers/net/softnic/rte_eth_softnic_tm.c:2591:24: note: (near initialization for ‘(anonymous).n_pipe_profiles’)
../drivers/net/softnic/rte_eth_softnic_tm.c:2554:4: error: missing braces around initializer [-Werror=missing-braces]
 2554 |    (struct rte_sched_subport_params) {
      |    ^
 2555 |     .tb_rate = n->shaper_profile->params.peak.rate,
 2556 |     .tb_size = n->shaper_profile->params.peak.size,
      |                {                                  }
../drivers/net/softnic/rte_eth_softnic_tm.c: In function ‘update_subport_rate’:
../drivers/net/softnic/rte_eth_softnic_tm.c:2838:16: error: ‘struct rte_sched_subport_params’ has no member named ‘tb_rate’
 2838 |  subport_params.tb_rate = sp->params.peak.rate;
      |                ^
../drivers/net/softnic/rte_eth_softnic_tm.c:2839:17: error: ‘struct rte_sched_subport_params’ has no member named ‘tb_size’; did you mean ‘qsize’?
 2839 |  subport_params.tb_size = sp->params.peak.size;
      |                 ^~~~~~~
      |                 qsize
cc1: all warnings being treated as errors
[1408/2212] Compiling C object 'drivers/net/qede/base/f6110d5@@qede_base at sta/ecore_sriov.c.o'.
[1409/2212] Compiling C object 'drivers/a715181@@tmp_rte_pmd_softnic at sta/net_softnic_rte_eth_softnic_swq.c.o'.
[1410/2212] Compiling C object 'drivers/a715181@@tmp_rte_pmd_softnic at sta/net_softnic_rte_eth_softnic_pipeline.c.o'.
[1411/2212] Compiling C object 'drivers/a715181@@tmp_rte_pmd_softnic at sta/net_softnic_rte_eth_softnic.c.o'.
[1412/2212] Compiling C object 'drivers/a715181@@tmp_rte_pmd_softnic at sta/net_softnic_rte_eth_softnic_tap.c.o'.
[1413/2212] Compiling C object 'drivers/a715181@@tmp_rte_pmd_softnic at sta/net_softnic_rte_eth_softnic_link.c.o'.
[1414/2212] Compiling C object 'drivers/a715181@@tmp_rte_pmd_ring at sta/net_ring_rte_eth_ring.c.o'.
[1415/2212] Compiling C object 'drivers/a715181@@tmp_rte_pmd_qede at sta/net_qede_qede_rxtx.c.o'.
[1416/2212] Compiling C object 'drivers/a715181@@tmp_rte_pmd_qede at sta/net_qede_qede_debug.c.o'.
[1417/2212] Compiling C object 'drivers/a715181@@tmp_rte_pmd_octeontx2 at sta/net_octeontx2_otx2_tx.c.o'.
[1418/2212] Compiling C object 'drivers/a715181@@tmp_rte_pmd_octeontx2 at sta/net_octeontx2_otx2_rx.c.o'.
ninja: build stopped: subcommand failed




*Meson Build Failed #6:
OS: UB2004-64
Target: x86_64-native-linuxapp-doc
[1585/2428] Compiling C object 'drivers/a715181@@tmp_rte_pmd_sfc at sta/net_sfc_sfc_ef10_rx.c.o'.
[1586/2428] Compiling C object 'drivers/a715181@@tmp_rte_pmd_sfc at sta/net_sfc_sfc_flow.c.o'.
[1587/2428] Compiling C object 'drivers/a715181@@tmp_rte_pmd_softnic at sta/net_softnic_rte_eth_softnic_tm.c.o'.
FAILED: drivers/a715181@@tmp_rte_pmd_softnic at sta/net_softnic_rte_eth_softnic_tm.c.o 
cc -Idrivers/a715181@@tmp_rte_pmd_softnic at sta -Idrivers -I../drivers -Idrivers/net/softnic -I../drivers/net/softnic -Ilib/librte_ethdev -I../lib/librte_ethdev -I. -I../ -Iconfig -I../config -Ilib/librte_eal/include -I../lib/librte_eal/include -Ilib/librte_eal/linux/include -I../lib/librte_eal/linux/include -Ilib/librte_eal/x86/include -I../lib/librte_eal/x86/include -Ilib/librte_eal/common -I../lib/librte_eal/common -Ilib/librte_eal -I../lib/librte_eal -Ilib/librte_kvargs -I../lib/librte_kvargs -Ilib/librte_telemetry/../librte_metrics -I../lib/librte_telemetry/../librte_metrics -Ilib/librte_telemetry -I../lib/librte_telemetry -Ilib/librte_net -I../lib/librte_net -Ilib/librte_mbuf -I../lib/librte_mbuf -Ilib/librte_mempool -I../lib/librte_mempool -Ilib/librte_ring -I../lib/librte_ring -Ilib/librte_meter -I../lib/librte_meter -Idrivers/bus/pci -I../drivers/bus/pci -I../drivers/bus/pci/linux -Ilib/librte_pci -I../lib/librte_pci -Idrivers/bus/vdev -I../drivers/bus/vdev -Ilib/librte_pipeline -I../lib/librte_pipeline -Ilib/librte_port -I../lib/librte_port -Ilib/librte_sched -I../lib/librte_sched -Ilib/librte_ip_frag -I../lib/librte_ip_frag -Ilib/librte_hash -I../lib/librte_hash -Ilib/librte_cryptodev -I../lib/librte_cryptodev -Ilib/librte_eventdev -I../lib/librte_eventdev -Ilib/librte_timer -I../lib/librte_timer -Ilib/librte_kni -I../lib/librte_kni -Ilib/librte_table -I../lib/librte_table -Ilib/librte_lpm -I../lib/librte_lpm -Ilib/librte_rcu -I../lib/librte_rcu -Ilib/librte_acl -I../lib/librte_acl -fdiagnostics-color=always -pipe -D_FILE_OFFSET_BITS=64 -Wall -Winvalid-pch -Werror -O3 -include rte_config.h -Wextra -Wcast-qual -Wdeprecated -Wformat-nonliteral -Wformat-security -Wmissing-declarations -Wmissing-prototypes -Wnested-externs -Wold-style-definition -Wpointer-arith -Wsign-compare -Wstrict-prototypes -Wundef -Wwrite-strings -Wno-address-of-packed-member -Wno-packed-not-aligned -Wno-missing-field-initializers -D_GNU_SOURCE -fPIC -march=native -DALLOW_EXPERIMENTAL_API -DALLOW_INTERNAL_API -Wno-format-truncation -MD -MQ 'drivers/a715181@@tmp_rte_pmd_softnic at sta/net_softnic_rte_eth_softnic_tm.c.o' -MF 'drivers/a715181@@tmp_rte_pmd_softnic at sta/net_softnic_rte_eth_softnic_tm.c.o.d' -o 'drivers/a715181@@tmp_rte_pmd_softnic at sta/net_softnic_rte_eth_softnic_tm.c.o' -c ../drivers/net/softnic/rte_eth_softnic_tm.c
../drivers/net/softnic/rte_eth_softnic_tm.c: In function ‘update_subport_tc_rate’:
../drivers/net/softnic/rte_eth_softnic_tm.c:1068:16: error: ‘struct rte_sched_subport_params’ has no member named ‘tc_rate’
 1068 |  subport_params.tc_rate[tc_id] = sp_new->params.peak.rate;
      |                ^
../drivers/net/softnic/rte_eth_softnic_tm.c:1052:11: error: variable ‘tc_id’ set but not used [-Werror=unused-but-set-variable]
 1052 |  uint32_t tc_id = tm_node_tc_id(dev, nt);
      |           ^~~~~
../drivers/net/softnic/rte_eth_softnic_tm.c: In function ‘hierarchy_blueprints_create’:
../drivers/net/softnic/rte_eth_softnic_tm.c:2555:6: error: ‘struct rte_sched_subport_params’ has no member named ‘tb_rate’
 2555 |     .tb_rate = n->shaper_profile->params.peak.rate,
      |      ^~~~~~~
../drivers/net/softnic/rte_eth_softnic_tm.c:2556:6: error: ‘struct rte_sched_subport_params’ has no member named ‘tb_size’; did you mean ‘qsize’?
 2556 |     .tb_size = n->shaper_profile->params.peak.size,
      |      ^~~~~~~
      |      qsize
../drivers/net/softnic/rte_eth_softnic_tm.c:2558:6: error: ‘struct rte_sched_subport_params’ has no member named ‘tc_rate’
 2558 |     .tc_rate = {tc_rate[0],
      |      ^~~~~~~
../drivers/net/softnic/rte_eth_softnic_tm.c:2558:5: error: braces around scalar initializer [-Werror]
 2558 |     .tc_rate = {tc_rate[0],
      |     ^
../drivers/net/softnic/rte_eth_softnic_tm.c:2558:5: note: (near initialization for ‘(anonymous).pipe_profiles’)
../drivers/net/softnic/rte_eth_softnic_tm.c:2558:17: error: initialization of ‘struct rte_sched_pipe_params *’ from ‘uint64_t’ {aka ‘long unsigned int’} makes pointer from integer without a cast [-Werror=int-conversion]
 2558 |     .tc_rate = {tc_rate[0],
      |                 ^~~~~~~
../drivers/net/softnic/rte_eth_softnic_tm.c:2558:17: note: (near initialization for ‘(anonymous).pipe_profiles’)
../drivers/net/softnic/rte_eth_softnic_tm.c:2559:6: error: excess elements in scalar initializer [-Werror]
 2559 |      tc_rate[1],
      |      ^~~~~~~
../drivers/net/softnic/rte_eth_softnic_tm.c:2559:6: note: (near initialization for ‘(anonymous).pipe_profiles’)
../drivers/net/softnic/rte_eth_softnic_tm.c:2560:6: error: excess elements in scalar initializer [-Werror]
 2560 |      tc_rate[2],
      |      ^~~~~~~
../drivers/net/softnic/rte_eth_softnic_tm.c:2560:6: note: (near initialization for ‘(anonymous).pipe_profiles’)
../drivers/net/softnic/rte_eth_softnic_tm.c:2561:6: error: excess elements in scalar initializer [-Werror]
 2561 |      tc_rate[3],
      |      ^~~~~~~
../drivers/net/softnic/rte_eth_softnic_tm.c:2561:6: note: (near initialization for ‘(anonymous).pipe_profiles’)
../drivers/net/softnic/rte_eth_softnic_tm.c:2562:6: error: excess elements in scalar initializer [-Werror]
 2562 |      tc_rate[4],
      |      ^~~~~~~
../drivers/net/softnic/rte_eth_softnic_tm.c:2562:6: note: (near initialization for ‘(anonymous).pipe_profiles’)
../drivers/net/softnic/rte_eth_softnic_tm.c:2563:6: error: excess elements in scalar initializer [-Werror]
 2563 |      tc_rate[5],
      |      ^~~~~~~
../drivers/net/softnic/rte_eth_softnic_tm.c:2563:6: note: (near initialization for ‘(anonymous).pipe_profiles’)
../drivers/net/softnic/rte_eth_softnic_tm.c:2564:6: error: excess elements in scalar initializer [-Werror]
 2564 |      tc_rate[6],
      |      ^~~~~~~
../drivers/net/softnic/rte_eth_softnic_tm.c:2564:6: note: (near initialization for ‘(anonymous).pipe_profiles’)
../drivers/net/softnic/rte_eth_softnic_tm.c:2565:6: error: excess elements in scalar initializer [-Werror]
 2565 |      tc_rate[7],
      |      ^~~~~~~
../drivers/net/softnic/rte_eth_softnic_tm.c:2565:6: note: (near initialization for ‘(anonymous).pipe_profiles’)
../drivers/net/softnic/rte_eth_softnic_tm.c:2566:6: error: excess elements in scalar initializer [-Werror]
 2566 |      tc_rate[8],
      |      ^~~~~~~
../drivers/net/softnic/rte_eth_softnic_tm.c:2566:6: note: (near initialization for ‘(anonymous).pipe_profiles’)
../drivers/net/softnic/rte_eth_softnic_tm.c:2567:6: error: excess elements in scalar initializer [-Werror]
 2567 |      tc_rate[9],
      |      ^~~~~~~
../drivers/net/softnic/rte_eth_softnic_tm.c:2567:6: note: (near initialization for ‘(anonymous).pipe_profiles’)
../drivers/net/softnic/rte_eth_softnic_tm.c:2568:6: error: excess elements in scalar initializer [-Werror]
 2568 |      tc_rate[10],
      |      ^~~~~~~
../drivers/net/softnic/rte_eth_softnic_tm.c:2568:6: note: (near initialization for ‘(anonymous).pipe_profiles’)
../drivers/net/softnic/rte_eth_softnic_tm.c:2569:6: error: excess elements in scalar initializer [-Werror]
 2569 |      tc_rate[11],
      |      ^~~~~~~
../drivers/net/softnic/rte_eth_softnic_tm.c:2569:6: note: (near initialization for ‘(anonymous).pipe_profiles’)
../drivers/net/softnic/rte_eth_softnic_tm.c:2570:6: error: excess elements in scalar initializer [-Werror]
 2570 |      tc_rate[12],
      |      ^~~~~~~
../drivers/net/softnic/rte_eth_softnic_tm.c:2570:6: note: (near initialization for ‘(anonymous).pipe_profiles’)
../drivers/net/softnic/rte_eth_softnic_tm.c:2554:4: error: missing braces around initializer [-Werror=missing-braces]
 2554 |    (struct rte_sched_subport_params) {
      |    ^
 2555 |     .tb_rate = n->shaper_profile->params.peak.rate,
 2556 |     .tb_size = n->shaper_profile->params.peak.size,
      |                {                                  }
../drivers/net/softnic/rte_eth_softnic_tm.c:2572:6: error: ‘struct rte_sched_subport_params’ has no member named ‘tc_period’
 2572 |     .tc_period = SUBPORT_TC_PERIOD,
      |      ^~~~~~~~~
../drivers/net/softnic/rte_eth_softnic_tm.c:2574:6: error: initialized field overwritten [-Werror=override-init]
 2574 |      h->n_tm_nodes[TM_NODE_LEVEL_PIPE] /
      |      ^
../drivers/net/softnic/rte_eth_softnic_tm.c:2574:6: note: (near initialization for ‘(anonymous).n_pipes_per_subport_enabled’)
../drivers/net/softnic/rte_eth_softnic_tm.c:2554:4: error: missing braces around initializer [-Werror=missing-braces]
 2554 |    (struct rte_sched_subport_params) {
      |    ^
 2555 |     .tb_rate = n->shaper_profile->params.peak.rate,
 2556 |     .tb_size = n->shaper_profile->params.peak.size,
      |                {                                  }
../drivers/net/softnic/rte_eth_softnic_tm.c:2576:14: error: initialized field overwritten [-Werror=override-init]
 2576 |     .qsize = {p->params.tm.qsize[0],
      |              ^
../drivers/net/softnic/rte_eth_softnic_tm.c:2576:14: note: (near initialization for ‘(anonymous).qsize’)
../drivers/net/softnic/rte_eth_softnic_tm.c:2590:22: error: initialized field overwritten [-Werror=override-init]
 2590 |     .pipe_profiles = t->pipe_profiles,
      |                      ^
../drivers/net/softnic/rte_eth_softnic_tm.c:2590:22: note: (near initialization for ‘(anonymous).pipe_profiles’)
../drivers/net/softnic/rte_eth_softnic_tm.c:2591:24: error: initialized field overwritten [-Werror=override-init]
 2591 |     .n_pipe_profiles = t->n_pipe_profiles,
      |                        ^
../drivers/net/softnic/rte_eth_softnic_tm.c:2591:24: note: (near initialization for ‘(anonymous).n_pipe_profiles’)
../drivers/net/softnic/rte_eth_softnic_tm.c:2554:4: error: missing braces around initializer [-Werror=missing-braces]
 2554 |    (struct rte_sched_subport_params) {
      |    ^
 2555 |     .tb_rate = n->shaper_profile->params.peak.rate,
 2556 |     .tb_size = n->shaper_profile->params.peak.size,
      |                {                                  }
../drivers/net/softnic/rte_eth_softnic_tm.c: In function ‘update_subport_rate’:
../drivers/net/softnic/rte_eth_softnic_tm.c:2838:16: error: ‘struct rte_sched_subport_params’ has no member named ‘tb_rate’
 2838 |  subport_params.tb_rate = sp->params.peak.rate;
      |                ^
../drivers/net/softnic/rte_eth_softnic_tm.c:2839:17: error: ‘struct rte_sched_subport_params’ has no member named ‘tb_size’; did you mean ‘qsize’?
 2839 |  subport_params.tb_size = sp->params.peak.size;
      |                 ^~~~~~~
      |                 qsize
--
[1590/2428] Compiling C object 'drivers/a715181@@tmp_rte_pmd_softnic at sta/net_softnic_rte_eth_softnic_action.c.o'.
[1591/2428] Compiling C object 'drivers/a715181@@tmp_rte_pmd_sfc at sta/net_sfc_sfc_ef10_tx.c.o'.
[1592/2428] Compiling C object 'drivers/a715181@@tmp_rte_pmd_softnic at sta/net_softnic_rte_eth_softnic_pipeline.c.o'.
ninja: build stopped: subcommand failed.


*Meson Build Failed #7:
OS: UB2004-64
Target:./build-gcc-static
FAILED: drivers/a715181@@tmp_rte_pmd_softnic at sta/net_softnic_rte_eth_softnic_tm.c.o 
gcc -Idrivers/a715181@@tmp_rte_pmd_softnic at sta -Idrivers -I../drivers -Idrivers/net/softnic -I../drivers/net/softnic -Ilib/librte_ethdev -I../lib/librte_ethdev -I. -I../ -Iconfig -I../config -Ilib/librte_eal/include -I../lib/librte_eal/include -Ilib/librte_eal/linux/include -I../lib/librte_eal/linux/include -Ilib/librte_eal/x86/include -I../lib/librte_eal/x86/include -Ilib/librte_eal/common -I../lib/librte_eal/common -Ilib/librte_eal -I../lib/librte_eal -Ilib/librte_kvargs -I../lib/librte_kvargs -Ilib/librte_telemetry/../librte_metrics -I../lib/librte_telemetry/../librte_metrics -Ilib/librte_telemetry -I../lib/librte_telemetry -Ilib/librte_net -I../lib/librte_net -Ilib/librte_mbuf -I../lib/librte_mbuf -Ilib/librte_mempool -I../lib/librte_mempool -Ilib/librte_ring -I../lib/librte_ring -Ilib/librte_meter -I../lib/librte_meter -Idrivers/bus/pci -I../drivers/bus/pci -I../drivers/bus/pci/linux -Ilib/librte_pci -I../lib/librte_pci -Idrivers/bus/vdev -I../drivers/bus/vdev -Ilib/librte_pipeline -I../lib/librte_pipeline -Ilib/librte_port -I../lib/librte_port -Ilib/librte_sched -I../lib/librte_sched -Ilib/librte_ip_frag -I../lib/librte_ip_frag -Ilib/librte_hash -I../lib/librte_hash -Ilib/librte_cryptodev -I../lib/librte_cryptodev -Ilib/librte_eventdev -I../lib/librte_eventdev -Ilib/librte_timer -I../lib/librte_timer -Ilib/librte_kni -I../lib/librte_kni -Ilib/librte_table -I../lib/librte_table -Ilib/librte_lpm -I../lib/librte_lpm -Ilib/librte_rcu -I../lib/librte_rcu -Ilib/librte_acl -I../lib/librte_acl -fdiagnostics-color=always -pipe -D_FILE_OFFSET_BITS=64 -Wall -Winvalid-pch -Werror -O2 -g -include rte_config.h -Wextra -Wcast-qual -Wdeprecated -Wformat-nonliteral -Wformat-security -Wmissing-declarations -Wmissing-prototypes -Wnested-externs -Wold-style-definition -Wpointer-arith -Wsign-compare -Wstrict-prototypes -Wundef -Wwrite-strings -Wno-address-of-packed-member -Wno-packed-not-aligned -Wno-missing-field-initializers -D_GNU_SOURCE -fPIC -march=native -DALLOW_EXPERIMENTAL_API -DALLOW_INTERNAL_API -Wno-format-truncation -MD -MQ 'drivers/a715181@@tmp_rte_pmd_softnic at sta/net_softnic_rte_eth_softnic_tm.c.o' -MF 'drivers/a715181@@tmp_rte_pmd_softnic at sta/net_softnic_rte_eth_softnic_tm.c.o.d' -o 'drivers/a715181@@tmp_rte_pmd_softnic at sta/net_softnic_rte_eth_softnic_tm.c.o' -c ../drivers/net/softnic/rte_eth_softnic_tm.c
../drivers/net/softnic/rte_eth_softnic_tm.c: In function ‘update_subport_tc_rate’:
../drivers/net/softnic/rte_eth_softnic_tm.c:1068:16: error: ‘struct rte_sched_subport_params’ has no member named ‘tc_rate’
 1068 |  subport_params.tc_rate[tc_id] = sp_new->params.peak.rate;
      |                ^
../drivers/net/softnic/rte_eth_softnic_tm.c:1052:11: error: variable ‘tc_id’ set but not used [-Werror=unused-but-set-variable]
 1052 |  uint32_t tc_id = tm_node_tc_id(dev, nt);
      |           ^~~~~
../drivers/net/softnic/rte_eth_softnic_tm.c: In function ‘hierarchy_blueprints_create’:
../drivers/net/softnic/rte_eth_softnic_tm.c:2555:6: error: ‘struct rte_sched_subport_params’ has no member named ‘tb_rate’
 2555 |     .tb_rate = n->shaper_profile->params.peak.rate,
      |      ^~~~~~~
../drivers/net/softnic/rte_eth_softnic_tm.c:2556:6: error: ‘struct rte_sched_subport_params’ has no member named ‘tb_size’; did you mean ‘qsize’?
 2556 |     .tb_size = n->shaper_profile->params.peak.size,
      |      ^~~~~~~
      |      qsize
../drivers/net/softnic/rte_eth_softnic_tm.c:2558:6: error: ‘struct rte_sched_subport_params’ has no member named ‘tc_rate’
 2558 |     .tc_rate = {tc_rate[0],
      |      ^~~~~~~
../drivers/net/softnic/rte_eth_softnic_tm.c:2558:5: error: braces around scalar initializer [-Werror]
 2558 |     .tc_rate = {tc_rate[0],
      |     ^
../drivers/net/softnic/rte_eth_softnic_tm.c:2558:5: note: (near initialization for ‘(anonymous).pipe_profiles’)
../drivers/net/softnic/rte_eth_softnic_tm.c:2558:17: error: initialization of ‘struct rte_sched_pipe_params *’ from ‘uint64_t’ {aka ‘long unsigned int’} makes pointer from integer without a cast [-Werror=int-conversion]
 2558 |     .tc_rate = {tc_rate[0],
      |                 ^~~~~~~
../drivers/net/softnic/rte_eth_softnic_tm.c:2558:17: note: (near initialization for ‘(anonymous).pipe_profiles’)
../drivers/net/softnic/rte_eth_softnic_tm.c:2559:6: error: excess elements in scalar initializer [-Werror]
 2559 |      tc_rate[1],
      |      ^~~~~~~
../drivers/net/softnic/rte_eth_softnic_tm.c:2559:6: note: (near initialization for ‘(anonymous).pipe_profiles’)
../drivers/net/softnic/rte_eth_softnic_tm.c:2560:6: error: excess elements in scalar initializer [-Werror]
 2560 |      tc_rate[2],
      |      ^~~~~~~
../drivers/net/softnic/rte_eth_softnic_tm.c:2560:6: note: (near initialization for ‘(anonymous).pipe_profiles’)
../drivers/net/softnic/rte_eth_softnic_tm.c:2561:6: error: excess elements in scalar initializer [-Werror]
 2561 |      tc_rate[3],
      |      ^~~~~~~
../drivers/net/softnic/rte_eth_softnic_tm.c:2561:6: note: (near initialization for ‘(anonymous).pipe_profiles’)
../drivers/net/softnic/rte_eth_softnic_tm.c:2562:6: error: excess elements in scalar initializer [-Werror]
 2562 |      tc_rate[4],
      |      ^~~~~~~
../drivers/net/softnic/rte_eth_softnic_tm.c:2562:6: note: (near initialization for ‘(anonymous).pipe_profiles’)
../drivers/net/softnic/rte_eth_softnic_tm.c:2563:6: error: excess elements in scalar initializer [-Werror]
 2563 |      tc_rate[5],
      |      ^~~~~~~
../drivers/net/softnic/rte_eth_softnic_tm.c:2563:6: note: (near initialization for ‘(anonymous).pipe_profiles’)
../drivers/net/softnic/rte_eth_softnic_tm.c:2564:6: error: excess elements in scalar initializer [-Werror]
 2564 |      tc_rate[6],
      |      ^~~~~~~
../drivers/net/softnic/rte_eth_softnic_tm.c:2564:6: note: (near initialization for ‘(anonymous).pipe_profiles’)
../drivers/net/softnic/rte_eth_softnic_tm.c:2565:6: error: excess elements in scalar initializer [-Werror]
 2565 |      tc_rate[7],
      |      ^~~~~~~
../drivers/net/softnic/rte_eth_softnic_tm.c:2565:6: note: (near initialization for ‘(anonymous).pipe_profiles’)
../drivers/net/softnic/rte_eth_softnic_tm.c:2566:6: error: excess elements in scalar initializer [-Werror]
 2566 |      tc_rate[8],
      |      ^~~~~~~
../drivers/net/softnic/rte_eth_softnic_tm.c:2566:6: note: (near initialization for ‘(anonymous).pipe_profiles’)
../drivers/net/softnic/rte_eth_softnic_tm.c:2567:6: error: excess elements in scalar initializer [-Werror]
 2567 |      tc_rate[9],
      |      ^~~~~~~
../drivers/net/softnic/rte_eth_softnic_tm.c:2567:6: note: (near initialization for ‘(anonymous).pipe_profiles’)
../drivers/net/softnic/rte_eth_softnic_tm.c:2568:6: error: excess elements in scalar initializer [-Werror]
 2568 |      tc_rate[10],
      |      ^~~~~~~
../drivers/net/softnic/rte_eth_softnic_tm.c:2568:6: note: (near initialization for ‘(anonymous).pipe_profiles’)
../drivers/net/softnic/rte_eth_softnic_tm.c:2569:6: error: excess elements in scalar initializer [-Werror]
 2569 |      tc_rate[11],
      |      ^~~~~~~
../drivers/net/softnic/rte_eth_softnic_tm.c:2569:6: note: (near initialization for ‘(anonymous).pipe_profiles’)
../drivers/net/softnic/rte_eth_softnic_tm.c:2570:6: error: excess elements in scalar initializer [-Werror]
 2570 |      tc_rate[12],
      |      ^~~~~~~
../drivers/net/softnic/rte_eth_softnic_tm.c:2570:6: note: (near initialization for ‘(anonymous).pipe_profiles’)
../drivers/net/softnic/rte_eth_softnic_tm.c:2554:4: error: missing braces around initializer [-Werror=missing-braces]
 2554 |    (struct rte_sched_subport_params) {
      |    ^
 2555 |     .tb_rate = n->shaper_profile->params.peak.rate,
 2556 |     .tb_size = n->shaper_profile->params.peak.size,
      |                {                                  }
../drivers/net/softnic/rte_eth_softnic_tm.c:2572:6: error: ‘struct rte_sched_subport_params’ has no member named ‘tc_period’
 2572 |     .tc_period = SUBPORT_TC_PERIOD,
      |      ^~~~~~~~~
../drivers/net/softnic/rte_eth_softnic_tm.c:2574:6: error: initialized field overwritten [-Werror=override-init]
 2574 |      h->n_tm_nodes[TM_NODE_LEVEL_PIPE] /
      |      ^
../drivers/net/softnic/rte_eth_softnic_tm.c:2574:6: note: (near initialization for ‘(anonymous).n_pipes_per_subport_enabled’)
../drivers/net/softnic/rte_eth_softnic_tm.c:2554:4: error: missing braces around initializer [-Werror=missing-braces]
 2554 |    (struct rte_sched_subport_params) {
      |    ^
 2555 |     .tb_rate = n->shaper_profile->params.peak.rate,
 2556 |     .tb_size = n->shaper_profile->params.peak.size,
      |                {                                  }
../drivers/net/softnic/rte_eth_softnic_tm.c:2576:14: error: initialized field overwritten [-Werror=override-init]
 2576 |     .qsize = {p->params.tm.qsize[0],
      |              ^
../drivers/net/softnic/rte_eth_softnic_tm.c:2576:14: note: (near initialization for ‘(anonymous).qsize’)
../drivers/net/softnic/rte_eth_softnic_tm.c:2590:22: error: initialized field overwritten [-Werror=override-init]
 2590 |     .pipe_profiles = t->pipe_profiles,
      |                      ^
../drivers/net/softnic/rte_eth_softnic_tm.c:2590:22: note: (near initialization for ‘(anonymous).pipe_profiles’)
../drivers/net/softnic/rte_eth_softnic_tm.c:2591:24: error: initialized field overwritten [-Werror=override-init]
 2591 |     .n_pipe_profiles = t->n_pipe_profiles,
      |                        ^
../drivers/net/softnic/rte_eth_softnic_tm.c:2591:24: note: (near initialization for ‘(anonymous).n_pipe_profiles’)
../drivers/net/softnic/rte_eth_softnic_tm.c:2554:4: error: missing braces around initializer [-Werror=missing-braces]
 2554 |    (struct rte_sched_subport_params) {
      |    ^
 2555 |     .tb_rate = n->shaper_profile->params.peak.rate,
 2556 |     .tb_size = n->shaper_profile->params.peak.size,
      |                {                                  }
../drivers/net/softnic/rte_eth_softnic_tm.c: In function ‘update_subport_rate’:
../drivers/net/softnic/rte_eth_softnic_tm.c:2838:16: error: ‘struct rte_sched_subport_params’ has no member named ‘tb_rate’
 2838 |  subport_params.tb_rate = sp->params.peak.rate;
      |                ^
../drivers/net/softnic/rte_eth_softnic_tm.c:2839:17: error: ‘struct rte_sched_subport_params’ has no member named ‘tb_size’; did you mean ‘qsize’?
 2839 |  subport_params.tb_size = sp->params.peak.size;
      |                 ^~~~~~~
      |                 qsize
cc1: all warnings being treated as errors
[1579/2432] Compiling C object 'drivers/a715181@@tmp_rte_pmd_softnic at sta/net_softnic_rte_eth_softnic_swq.c.o'.
[1580/2432] Compiling C object 'drivers/a715181@@tmp_rte_pmd_sfc at sta/net_sfc_sfc_ef10_rx.c.o'.
[1581/2432] Compiling C object 'drivers/a715181@@tmp_rte_pmd_softnic at sta/net_softnic_rte_eth_softnic_action.c.o'.
[1582/2432] Compiling C object 'drivers/a715181@@tmp_rte_pmd_softnic at sta/net_softnic_rte_eth_softnic_cryptodev.c.o'.
[1583/2432] Compiling C object 'drivers/a715181@@tmp_rte_pmd_softnic at sta/net_softnic_rte_eth_softnic_tap.c.o'.
[1584/2432] Compiling C object 'drivers/a715181@@tmp_rte_pmd_sfc at sta/net_sfc_sfc_flow.c.o'.
[1585/2432] Compiling C object 'drivers/a715181@@tmp_rte_pmd_softnic at sta/net_softnic_rte_eth_softnic_pipeline.c.o'.
[1586/2432] Compiling C object 'drivers/a715181@@tmp_rte_pmd_softnic at sta/net_softnic_rte_eth_softnic_mempool.c.o'.
[1587/2432] Compiling C object 'drivers/a715181@@tmp_rte_pmd_sfc at sta/net_sfc_sfc_ef10_tx.c.o'.
[1588/2432] Compiling C object 'drivers/a715181@@tmp_rte_pmd_softnic at sta/net_softnic_rte_eth_softnic_thread.c.o'.
[1589/2432] Compiling C object 'drivers/a715181@@tmp_rte_pmd_octeontx2 at sta/net_octeontx2_otx2_rx.c.o'.
ninja: build stopped: subcommand failed



*Makefile Build Failed #1:
OS: CENTOS77-64
Target: x86_64-native-linuxapp-gcc
  CC ef10_tx.o
  CC ef10_vpd.o
/root/CENTOS77-64_K3.10.0_GCC4.8.5/x86_64-native-linuxapp-gcc/a97f7ee35f494d71a9427a4273edff37/dpdk/drivers/net/softnic/rte_eth_softnic_tm.c: In function ‘update_subport_tc_rate’:
/root/CENTOS77-64_K3.10.0_GCC4.8.5/x86_64-native-linuxapp-gcc/a97f7ee35f494d71a9427a4273edff37/dpdk/drivers/net/softnic/rte_eth_softnic_tm.c:1068:16: error: ‘struct rte_sched_subport_params’ has no member named ‘tc_rate’
  subport_params.tc_rate[tc_id] = sp_new->params.peak.rate;
                ^
/root/CENTOS77-64_K3.10.0_GCC4.8.5/x86_64-native-linuxapp-gcc/a97f7ee35f494d71a9427a4273edff37/dpdk/drivers/net/softnic/rte_eth_softnic_tm.c:1052:11: warning: variable ‘tc_id’ set but not used [-Wunused-but-set-variable]
  uint32_t tc_id = tm_node_tc_id(dev, nt);
           ^
/root/CENTOS77-64_K3.10.0_GCC4.8.5/x86_64-native-linuxapp-gcc/a97f7ee35f494d71a9427a4273edff37/dpdk/drivers/net/softnic/rte_eth_softnic_tm.c: In function ‘hierarchy_blueprints_create’:
/root/CENTOS77-64_K3.10.0_GCC4.8.5/x86_64-native-linuxapp-gcc/a97f7ee35f494d71a9427a4273edff37/dpdk/drivers/net/softnic/rte_eth_softnic_tm.c:2555:5: error: unknown field ‘tb_rate’ specified in initializer
     .tb_rate = n->shaper_profile->params.peak.rate,
     ^
/root/CENTOS77-64_K3.10.0_GCC4.8.5/x86_64-native-linuxapp-gcc/a97f7ee35f494d71a9427a4273edff37/dpdk/drivers/net/softnic/rte_eth_softnic_tm.c:2556:5: error: unknown field ‘tb_size’ specified in initializer
     .tb_size = n->shaper_profile->params.peak.size,
     ^
/root/CENTOS77-64_K3.10.0_GCC4.8.5/x86_64-native-linuxapp-gcc/a97f7ee35f494d71a9427a4273edff37/dpdk/drivers/net/softnic/rte_eth_softnic_tm.c:2556:5: warning: missing braces around initializer [-Wmissing-braces]
/root/CENTOS77-64_K3.10.0_GCC4.8.5/x86_64-native-linuxapp-gcc/a97f7ee35f494d71a9427a4273edff37/dpdk/drivers/net/softnic/rte_eth_softnic_tm.c:2556:5: warning: (near initialization for ‘(anonymous).qsize’) [-Wmissing-braces]
/root/CENTOS77-64_K3.10.0_GCC4.8.5/x86_64-native-linuxapp-gcc/a97f7ee35f494d71a9427a4273edff37/dpdk/drivers/net/softnic/rte_eth_softnic_tm.c:2558:5: error: unknown field ‘tc_rate’ specified in initializer
     .tc_rate = {tc_rate[0],
     ^
/root/CENTOS77-64_K3.10.0_GCC4.8.5/x86_64-native-linuxapp-gcc/a97f7ee35f494d71a9427a4273edff37/dpdk/drivers/net/softnic/rte_eth_softnic_tm.c:2558:5: warning: braces around scalar initializer [enabled by default]
--
      tc_rate[12],
      ^
/root/CENTOS77-64_K3.10.0_GCC4.8.5/x86_64-native-linuxapp-gcc/a97f7ee35f494d71a9427a4273edff37/dpdk/drivers/net/softnic/rte_eth_softnic_tm.c:2570:6: warning: (near initialization for ‘(anonymous).pipe_profiles’) [enabled by default]
/root/CENTOS77-64_K3.10.0_GCC4.8.5/x86_64-native-linuxapp-gcc/a97f7ee35f494d71a9427a4273edff37/dpdk/drivers/net/softnic/rte_eth_softnic_tm.c:2572:5: error: unknown field ‘tc_period’ specified in initializer
     .tc_period = SUBPORT_TC_PERIOD,
     ^
/root/CENTOS77-64_K3.10.0_GCC4.8.5/x86_64-native-linuxapp-gcc/a97f7ee35f494d71a9427a4273edff37/dpdk/drivers/net/softnic/rte_eth_softnic_tm.c:2575:6: warning: initialized field overwritten [-Woverride-init]
--
     ^
/root/CENTOS77-64_K3.10.0_GCC4.8.5/x86_64-native-linuxapp-gcc/a97f7ee35f494d71a9427a4273edff37/dpdk/drivers/net/softnic/rte_eth_softnic_tm.c:2591:5: warning: (near initialization for ‘(anonymous).n_pipe_profiles’) [-Woverride-init]
/root/CENTOS77-64_K3.10.0_GCC4.8.5/x86_64-native-linuxapp-gcc/a97f7ee35f494d71a9427a4273edff37/dpdk/drivers/net/softnic/rte_eth_softnic_tm.c: In function ‘update_subport_rate’:
/root/CENTOS77-64_K3.10.0_GCC4.8.5/x86_64-native-linuxapp-gcc/a97f7ee35f494d71a9427a4273edff37/dpdk/drivers/net/softnic/rte_eth_softnic_tm.c:2838:16: error: ‘struct rte_sched_subport_params’ has no member named ‘tb_rate’
  subport_params.tb_rate = sp->params.peak.rate;
                ^
/root/CENTOS77-64_K3.10.0_GCC4.8.5/x86_64-native-linuxapp-gcc/a97f7ee35f494d71a9427a4273edff37/dpdk/drivers/net/softnic/rte_eth_softnic_tm.c:2839:16: error: ‘struct rte_sched_subport_params’ has no member named ‘tb_size’
  subport_params.tb_size = sp->params.peak.size;
                ^
/root/CENTOS77-64_K3.10.0_GCC4.8.5/x86_64-native-linuxapp-gcc/a97f7ee35f494d71a9427a4273edff37/dpdk/drivers/net/softnic/rte_eth_softnic_tm.c: At top level:
cc1: warning: unrecognized command line option "-Wno-address-of-packed-member" [enabled by default]
make[6]: *** [rte_eth_softnic_tm.o] Error 1
make[6]: *** Waiting for unfinished jobs....
  CC medford_nic.o
  CC medford2_nic.o
--
  PMDINFO rte_eth_vhost.o.pmd.c
  CC rte_eth_vhost.o.pmd.o
  LD rte_eth_vhost.o
make[5]: *** [softnic] Error 2
make[5]: *** Waiting for unfinished jobs....
  AR librte_pmd_vhost.a
  INSTALL-LIB librte_pmd_vhost.a
make[4]: *** [net] Error 2
make[3]: *** [drivers] Error 2
make[2]: *** [all] Error 2
make[1]: *** [pre_install] Error 2
make: *** [install] Error 2


*Makefile Build Failed #2:
OS: CENTOS82-64
Target: x86_64-native-linuxapp-gcc
  CC efx_lic.o
  CC efx_mac.o
/root/CENTOS82-64_K4.18.0_GCC8.3.1/x86_64-native-linuxapp-gcc/a97f7ee35f494d71a9427a4273edff37/dpdk/drivers/net/softnic/rte_eth_softnic_tm.c: In function ‘update_subport_tc_rate’:
/root/CENTOS82-64_K4.18.0_GCC8.3.1/x86_64-native-linuxapp-gcc/a97f7ee35f494d71a9427a4273edff37/dpdk/drivers/net/softnic/rte_eth_softnic_tm.c:1068:16: error: ‘struct rte_sched_subport_params’ has no member named ‘tc_rate’
  subport_params.tc_rate[tc_id] = sp_new->params.peak.rate;
                ^
/root/CENTOS82-64_K4.18.0_GCC8.3.1/x86_64-native-linuxapp-gcc/a97f7ee35f494d71a9427a4273edff37/dpdk/drivers/net/softnic/rte_eth_softnic_tm.c:1052:11: warning: variable ‘tc_id’ set but not used [-Wunused-but-set-variable]
  uint32_t tc_id = tm_node_tc_id(dev, nt);
           ^~~~~
/root/CENTOS82-64_K4.18.0_GCC8.3.1/x86_64-native-linuxapp-gcc/a97f7ee35f494d71a9427a4273edff37/dpdk/drivers/net/softnic/rte_eth_softnic_tm.c: In function ‘hierarchy_blueprints_create’:
/root/CENTOS82-64_K4.18.0_GCC8.3.1/x86_64-native-linuxapp-gcc/a97f7ee35f494d71a9427a4273edff37/dpdk/drivers/net/softnic/rte_eth_softnic_tm.c:2555:6: error: ‘struct rte_sched_subport_params’ has no member named ‘tb_rate’
     .tb_rate = n->shaper_profile->params.peak.rate,
      ^~~~~~~
/root/CENTOS82-64_K4.18.0_GCC8.3.1/x86_64-native-linuxapp-gcc/a97f7ee35f494d71a9427a4273edff37/dpdk/drivers/net/softnic/rte_eth_softnic_tm.c:2556:6: error: ‘struct rte_sched_subport_params’ has no member named ‘tb_size’; did you mean ‘qsize’?
     .tb_size = n->shaper_profile->params.peak.size,
      ^~~~~~~
      qsize
/root/CENTOS82-64_K4.18.0_GCC8.3.1/x86_64-native-linuxapp-gcc/a97f7ee35f494d71a9427a4273edff37/dpdk/drivers/net/softnic/rte_eth_softnic_tm.c:2558:6: error: ‘struct rte_sched_subport_params’ has no member named ‘tc_rate’
     .tc_rate = {tc_rate[0],
      ^~~~~~~
/root/CENTOS82-64_K4.18.0_GCC8.3.1/x86_64-native-linuxapp-gcc/a97f7ee35f494d71a9427a4273edff37/dpdk/drivers/net/softnic/rte_eth_softnic_tm.c:2558:5: warning: braces around scalar initializer
--
/root/CENTOS82-64_K4.18.0_GCC8.3.1/x86_64-native-linuxapp-gcc/a97f7ee35f494d71a9427a4273edff37/dpdk/drivers/net/softnic/rte_eth_softnic_tm.c:2556:16:
     .tb_size = n->shaper_profile->params.peak.size,
                {                                  }
/root/CENTOS82-64_K4.18.0_GCC8.3.1/x86_64-native-linuxapp-gcc/a97f7ee35f494d71a9427a4273edff37/dpdk/drivers/net/softnic/rte_eth_softnic_tm.c:2572:6: error: ‘struct rte_sched_subport_params’ has no member named ‘tc_period’
     .tc_period = SUBPORT_TC_PERIOD,
      ^~~~~~~~~
/root/CENTOS82-64_K4.18.0_GCC8.3.1/x86_64-native-linuxapp-gcc/a97f7ee35f494d71a9427a4273edff37/dpdk/drivers/net/softnic/rte_eth_softnic_tm.c:2574:6: warning: initialized field overwritten [-Woverride-init]
--
     .tb_size = n->shaper_profile->params.peak.size,
                {                                  }
/root/CENTOS82-64_K4.18.0_GCC8.3.1/x86_64-native-linuxapp-gcc/a97f7ee35f494d71a9427a4273edff37/dpdk/drivers/net/softnic/rte_eth_softnic_tm.c: In function ‘update_subport_rate’:
/root/CENTOS82-64_K4.18.0_GCC8.3.1/x86_64-native-linuxapp-gcc/a97f7ee35f494d71a9427a4273edff37/dpdk/drivers/net/softnic/rte_eth_softnic_tm.c:2838:16: error: ‘struct rte_sched_subport_params’ has no member named ‘tb_rate’
  subport_params.tb_rate = sp->params.peak.rate;
                ^
/root/CENTOS82-64_K4.18.0_GCC8.3.1/x86_64-native-linuxapp-gcc/a97f7ee35f494d71a9427a4273edff37/dpdk/drivers/net/softnic/rte_eth_softnic_tm.c:2839:17: error: ‘struct rte_sched_subport_params’ has no member named ‘tb_size’; did you mean ‘qsize’?
  subport_params.tb_size = sp->params.peak.size;
                 ^~~~~~~
                 qsize
/root/CENTOS82-64_K4.18.0_GCC8.3.1/x86_64-native-linuxapp-gcc/a97f7ee35f494d71a9427a4273edff37/dpdk/drivers/net/softnic/rte_eth_softnic_tm.c: At top level:
cc1: warning: unrecognized command line option ‘-Wno-address-of-packed-member’
  CC tf_core/tfp.o
make[6]: *** [/root/CENTOS82-64_K4.18.0_GCC8.3.1/x86_64-native-linuxapp-gcc/a97f7ee35f494d71a9427a4273edff37/dpdk/mk/internal/rte.compile-pre.mk:114: rte_eth_softnic_tm.o] Error 1
make[6]: *** Waiting for unfinished jobs....
  CC tf_core/tf_msg.o
  CC tf_core/tf_tbl.o
make[5]: *** [/root/CENTOS82-64_K4.18.0_GCC8.3.1/x86_64-native-linuxapp-gcc/a97f7ee35f494d71a9427a4273edff37/dpdk/mk/rte.subdir.mk:35: softnic] Error 2
make[5]: *** Waiting for unfinished jobs....
  CC tf_core/tf_em_common.o
  CC efx_mcdi.o
--
  INSTALL-LIB librte_pmd_octeontx2.a
  AR librte_pmd_qede.a
  INSTALL-LIB librte_pmd_qede.a
make[4]: *** [/root/CENTOS82-64_K4.18.0_GCC8.3.1/x86_64-native-linuxapp-gcc/a97f7ee35f494d71a9427a4273edff37/dpdk/mk/rte.subdir.mk:35: net] Error 2
make[3]: *** [/root/CENTOS82-64_K4.18.0_GCC8.3.1/x86_64-native-linuxapp-gcc/a97f7ee35f494d71a9427a4273edff37/dpdk/mk/rte.sdkbuild.mk:51: drivers] Error 2
make[2]: *** [/root/CENTOS82-64_K4.18.0_GCC8.3.1/x86_64-native-linuxapp-gcc/a97f7ee35f494d71a9427a4273edff37/dpdk/mk/rte.sdkroot.mk:115: all] Error 2
make[1]: *** [/root/CENTOS82-64_K4.18.0_GCC8.3.1/x86_64-native-linuxapp-gcc/a97f7ee35f494d71a9427a4273edff37/dpdk/mk/rte.sdkinstall.mk:61: pre_install] Error 2
make: *** [/root/CENTOS82-64_K4.18.0_GCC8.3.1/x86_64-native-linuxapp-gcc/a97f7ee35f494d71a9427a4273edff37/dpdk/mk/rte.sdkroot.mk:92: install] Error 2


*Makefile Build Failed #3:
OS: CENTOS82-64
Target: x86_64-native-linuxapp-clang
  CC otx2_ptp.o
  CC rte_eth_softnic_tap.o
  CC virtio_ethdev.o
/root/CENTOS82-64_K4.18.0_Clang7.0.1/x86_64-native-linuxapp-clang/a97f7ee35f494d71a9427a4273edff37/dpdk/drivers/net/softnic/rte_eth_softnic_tm.c:1068:17: error: no member named 'tc_rate' in 'struct rte_sched_subport_params'
        subport_params.tc_rate[tc_id] = sp_new->params.peak.rate;
        ~~~~~~~~~~~~~~ ^
/root/CENTOS82-64_K4.18.0_Clang7.0.1/x86_64-native-linuxapp-clang/a97f7ee35f494d71a9427a4273edff37/dpdk/drivers/net/softnic/rte_eth_softnic_tm.c:2555:6: error: field designator 'tb_rate' does not refer to any field in type 'struct rte_sched_subport_params'
                                .tb_rate = n->shaper_profile->params.peak.rate,
                                 ^
/root/CENTOS82-64_K4.18.0_Clang7.0.1/x86_64-native-linuxapp-clang/a97f7ee35f494d71a9427a4273edff37/dpdk/drivers/net/softnic/rte_eth_softnic_tm.c:2556:6: error: field designator 'tb_size' does not refer to any field in type 'struct rte_sched_subport_params'
                                .tb_size = n->shaper_profile->params.peak.size,
                                 ^
/root/CENTOS82-64_K4.18.0_Clang7.0.1/x86_64-native-linuxapp-clang/a97f7ee35f494d71a9427a4273edff37/dpdk/drivers/net/softnic/rte_eth_softnic_tm.c:2558:6: error: field designator 'tc_rate' does not refer to any field in type 'struct rte_sched_subport_params'
                                .tc_rate = {tc_rate[0],
                                 ^
/root/CENTOS82-64_K4.18.0_Clang7.0.1/x86_64-native-linuxapp-clang/a97f7ee35f494d71a9427a4273edff37/dpdk/drivers/net/softnic/rte_eth_softnic_tm.c:2572:6: error: field designator 'tc_period' does not refer to any field in type 'struct rte_sched_subport_params'
                                .tc_period = SUBPORT_TC_PERIOD,
                                 ^
/root/CENTOS82-64_K4.18.0_Clang7.0.1/x86_64-native-linuxapp-clang/a97f7ee35f494d71a9427a4273edff37/dpdk/drivers/net/softnic/rte_eth_softnic_tm.c:2838:17: error: no member named 'tb_rate' in 'struct rte_sched_subport_params'
        subport_params.tb_rate = sp->params.peak.rate;
        ~~~~~~~~~~~~~~ ^
/root/CENTOS82-64_K4.18.0_Clang7.0.1/x86_64-native-linuxapp-clang/a97f7ee35f494d71a9427a4273edff37/dpdk/drivers/net/softnic/rte_eth_softnic_tm.c:2839:17: error: no member named 'tb_size' in 'struct rte_sched_subport_params'
        subport_params.tb_size = sp->params.peak.size;
        ~~~~~~~~~~~~~~ ^
7 errors generated.
make[6]: *** [/root/CENTOS82-64_K4.18.0_Clang7.0.1/x86_64-native-linuxapp-clang/a97f7ee35f494d71a9427a4273edff37/dpdk/mk/internal/rte.compile-pre.mk:114: rte_eth_softnic_tm.o] Error 1
make[6]: *** Waiting for unfinished jobs....
  CC efx_crc32.o
  CC efx_ev.o
--
  CC efx_evb.o
  CC efx_filter.o
  CC efx_hash.o
make[5]: *** [/root/CENTOS82-64_K4.18.0_Clang7.0.1/x86_64-native-linuxapp-clang/a97f7ee35f494d71a9427a4273edff37/dpdk/mk/rte.subdir.mk:35: softnic] Error 2
make[5]: *** Waiting for unfinished jobs....
  CC efx_intr.o
  CC efx_lic.o
--
  CC hcapi/hcapi_cfa_p4.o
  AR librte_pmd_bnxt.a
  INSTALL-LIB librte_pmd_bnxt.a
make[4]: *** [/root/CENTOS82-64_K4.18.0_Clang7.0.1/x86_64-native-linuxapp-clang/a97f7ee35f494d71a9427a4273edff37/dpdk/mk/rte.subdir.mk:35: net] Error 2
make[3]: *** [/root/CENTOS82-64_K4.18.0_Clang7.0.1/x86_64-native-linuxapp-clang/a97f7ee35f494d71a9427a4273edff37/dpdk/mk/rte.sdkbuild.mk:51: drivers] Error 2
make[2]: *** [/root/CENTOS82-64_K4.18.0_Clang7.0.1/x86_64-native-linuxapp-clang/a97f7ee35f494d71a9427a4273edff37/dpdk/mk/rte.sdkroot.mk:115: all] Error 2
make[1]: *** [/root/CENTOS82-64_K4.18.0_Clang7.0.1/x86_64-native-linuxapp-clang/a97f7ee35f494d71a9427a4273edff37/dpdk/mk/rte.sdkinstall.mk:61: pre_install] Error 2
make: *** [/root/CENTOS82-64_K4.18.0_Clang7.0.1/x86_64-native-linuxapp-clang/a97f7ee35f494d71a9427a4273edff37/dpdk/mk/rte.sdkroot.mk:92: install] Error 2


*Makefile Build Failed #4:
OS: CENTOS82-64
Target: x86_64-native-linuxapp-icc
  CC otx2_ethdev_debug.o
  PMDINFO vmxnet3_ethdev.o.pmd.c
  CC vmxnet3_ethdev.o.pmd.o
/root/CENTOS82-64_K4.18.0_ICC19.1.1/x86_64-native-linuxapp-icc/a97f7ee35f494d71a9427a4273edff37/dpdk/drivers/net/softnic/rte_eth_softnic_tm.c(1068): error: struct "rte_sched_subport_params" has no field "tc_rate"
  	subport_params.tc_rate[tc_id] = sp_new->params.peak.rate;
  	               ^

/root/CENTOS82-64_K4.18.0_ICC19.1.1/x86_64-native-linuxapp-icc/a97f7ee35f494d71a9427a4273edff37/dpdk/drivers/net/softnic/rte_eth_softnic_tm.c(2555): error: struct "rte_sched_subport_params" has no field "tb_rate"
  				.tb_rate = n->shaper_profile->params.peak.rate,
  				 ^

/root/CENTOS82-64_K4.18.0_ICC19.1.1/x86_64-native-linuxapp-icc/a97f7ee35f494d71a9427a4273edff37/dpdk/drivers/net/softnic/rte_eth_softnic_tm.c(2838): error: struct "rte_sched_subport_params" has no field "tb_rate"
  	subport_params.tb_rate = sp->params.peak.rate;
  	               ^

/root/CENTOS82-64_K4.18.0_ICC19.1.1/x86_64-native-linuxapp-icc/a97f7ee35f494d71a9427a4273edff37/dpdk/drivers/net/softnic/rte_eth_softnic_tm.c(2839): error: struct "rte_sched_subport_params" has no field "tb_size"
  	subport_params.tb_size = sp->params.peak.size;
  	               ^

compilation aborted for /root/CENTOS82-64_K4.18.0_ICC19.1.1/x86_64-native-linuxapp-icc/a97f7ee35f494d71a9427a4273edff37/dpdk/drivers/net/softnic/rte_eth_softnic_tm.c (code 2)
make[6]: *** [/root/CENTOS82-64_K4.18.0_ICC19.1.1/x86_64-native-linuxapp-icc/a97f7ee35f494d71a9427a4273edff37/dpdk/mk/internal/rte.compile-pre.mk:114: rte_eth_softnic_tm.o] Error 2
make[5]: *** [/root/CENTOS82-64_K4.18.0_ICC19.1.1/x86_64-native-linuxapp-icc/a97f7ee35f494d71a9427a4273edff37/dpdk/mk/rte.subdir.mk:35: softnic] Error 2
make[5]: *** Waiting for unfinished jobs....
  CC otx2_ethdev_devargs.o
  CC qede_debug.o
--
  INSTALL-LIB librte_pmd_qede.a
  AR librte_pmd_octeontx2.a
  INSTALL-LIB librte_pmd_octeontx2.a
make[4]: *** [/root/CENTOS82-64_K4.18.0_ICC19.1.1/x86_64-native-linuxapp-icc/a97f7ee35f494d71a9427a4273edff37/dpdk/mk/rte.subdir.mk:35: net] Error 2
make[3]: *** [/root/CENTOS82-64_K4.18.0_ICC19.1.1/x86_64-native-linuxapp-icc/a97f7ee35f494d71a9427a4273edff37/dpdk/mk/rte.sdkbuild.mk:51: drivers] Error 2
make[2]: *** [/root/CENTOS82-64_K4.18.0_ICC19.1.1/x86_64-native-linuxapp-icc/a97f7ee35f494d71a9427a4273edff37/dpdk/mk/rte.sdkroot.mk:115: all] Error 2
make[1]: *** [/root/CENTOS82-64_K4.18.0_ICC19.1.1/x86_64-native-linuxapp-icc/a97f7ee35f494d71a9427a4273edff37/dpdk/mk/rte.sdkinstall.mk:61: pre_install] Error 2
make: *** [/root/CENTOS82-64_K4.18.0_ICC19.1.1/x86_64-native-linuxapp-icc/a97f7ee35f494d71a9427a4273edff37/dpdk/mk/rte.sdkroot.mk:92: install] Error 2


*Makefile Build Failed #5:
OS: CENTOS82-64
Target: x86_64-native-linuxapp-gcc+shared
  CC tf_core/tf_em_common.o
  CC efx_evb.o
/root/CENTOS82-64_K4.18.0_GCC8.3.1/x86_64-native-linuxapp-gcc+shared/a97f7ee35f494d71a9427a4273edff37/dpdk/drivers/net/softnic/rte_eth_softnic_tm.c: In function ‘update_subport_tc_rate’:
/root/CENTOS82-64_K4.18.0_GCC8.3.1/x86_64-native-linuxapp-gcc+shared/a97f7ee35f494d71a9427a4273edff37/dpdk/drivers/net/softnic/rte_eth_softnic_tm.c:1068:16: error: ‘struct rte_sched_subport_params’ has no member named ‘tc_rate’
  subport_params.tc_rate[tc_id] = sp_new->params.peak.rate;
                ^
/root/CENTOS82-64_K4.18.0_GCC8.3.1/x86_64-native-linuxapp-gcc+shared/a97f7ee35f494d71a9427a4273edff37/dpdk/drivers/net/softnic/rte_eth_softnic_tm.c:1052:11: warning: variable ‘tc_id’ set but not used [-Wunused-but-set-variable]
  uint32_t tc_id = tm_node_tc_id(dev, nt);
           ^~~~~
/root/CENTOS82-64_K4.18.0_GCC8.3.1/x86_64-native-linuxapp-gcc+shared/a97f7ee35f494d71a9427a4273edff37/dpdk/drivers/net/softnic/rte_eth_softnic_tm.c: In function ‘hierarchy_blueprints_create’:
/root/CENTOS82-64_K4.18.0_GCC8.3.1/x86_64-native-linuxapp-gcc+shared/a97f7ee35f494d71a9427a4273edff37/dpdk/drivers/net/softnic/rte_eth_softnic_tm.c:2555:6: error: ‘struct rte_sched_subport_params’ has no member named ‘tb_rate’
     .tb_rate = n->shaper_profile->params.peak.rate,
      ^~~~~~~
/root/CENTOS82-64_K4.18.0_GCC8.3.1/x86_64-native-linuxapp-gcc+shared/a97f7ee35f494d71a9427a4273edff37/dpdk/drivers/net/softnic/rte_eth_softnic_tm.c:2556:6: error: ‘struct rte_sched_subport_params’ has no member named ‘tb_size’; did you mean ‘qsize’?
     .tb_size = n->shaper_profile->params.peak.size,
      ^~~~~~~
      qsize
/root/CENTOS82-64_K4.18.0_GCC8.3.1/x86_64-native-linuxapp-gcc+shared/a97f7ee35f494d71a9427a4273edff37/dpdk/drivers/net/softnic/rte_eth_softnic_tm.c:2558:6: error: ‘struct rte_sched_subport_params’ has no member named ‘tc_rate’
     .tc_rate = {tc_rate[0],
      ^~~~~~~
/root/CENTOS82-64_K4.18.0_GCC8.3.1/x86_64-native-linuxapp-gcc+shared/a97f7ee35f494d71a9427a4273edff37/dpdk/drivers/net/softnic/rte_eth_softnic_tm.c:2558:5: warning: braces around scalar initializer
--
/root/CENTOS82-64_K4.18.0_GCC8.3.1/x86_64-native-linuxapp-gcc+shared/a97f7ee35f494d71a9427a4273edff37/dpdk/drivers/net/softnic/rte_eth_softnic_tm.c:2556:16:
     .tb_size = n->shaper_profile->params.peak.size,
                {                                  }
/root/CENTOS82-64_K4.18.0_GCC8.3.1/x86_64-native-linuxapp-gcc+shared/a97f7ee35f494d71a9427a4273edff37/dpdk/drivers/net/softnic/rte_eth_softnic_tm.c:2572:6: error: ‘struct rte_sched_subport_params’ has no member named ‘tc_period’
     .tc_period = SUBPORT_TC_PERIOD,
      ^~~~~~~~~
/root/CENTOS82-64_K4.18.0_GCC8.3.1/x86_64-native-linuxapp-gcc+shared/a97f7ee35f494d71a9427a4273edff37/dpdk/drivers/net/softnic/rte_eth_softnic_tm.c:2574:6: warning: initialized field overwritten [-Woverride-init]
--
     .tb_size = n->shaper_profile->params.peak.size,
                {                                  }
/root/CENTOS82-64_K4.18.0_GCC8.3.1/x86_64-native-linuxapp-gcc+shared/a97f7ee35f494d71a9427a4273edff37/dpdk/drivers/net/softnic/rte_eth_softnic_tm.c: In function ‘update_subport_rate’:
/root/CENTOS82-64_K4.18.0_GCC8.3.1/x86_64-native-linuxapp-gcc+shared/a97f7ee35f494d71a9427a4273edff37/dpdk/drivers/net/softnic/rte_eth_softnic_tm.c:2838:16: error: ‘struct rte_sched_subport_params’ has no member named ‘tb_rate’
  subport_params.tb_rate = sp->params.peak.rate;
                ^
/root/CENTOS82-64_K4.18.0_GCC8.3.1/x86_64-native-linuxapp-gcc+shared/a97f7ee35f494d71a9427a4273edff37/dpdk/drivers/net/softnic/rte_eth_softnic_tm.c:2839:17: error: ‘struct rte_sched_subport_params’ has no member named ‘tb_size’; did you mean ‘qsize’?
  subport_params.tb_size = sp->params.peak.size;
                 ^~~~~~~
                 qsize
/root/CENTOS82-64_K4.18.0_GCC8.3.1/x86_64-native-linuxapp-gcc+shared/a97f7ee35f494d71a9427a4273edff37/dpdk/drivers/net/softnic/rte_eth_softnic_tm.c: At top level:
cc1: warning: unrecognized command line option ‘-Wno-address-of-packed-member’
make[6]: *** [/root/CENTOS82-64_K4.18.0_GCC8.3.1/x86_64-native-linuxapp-gcc+shared/a97f7ee35f494d71a9427a4273edff37/dpdk/mk/internal/rte.compile-pre.mk:114: rte_eth_softnic_tm.o] Error 1
make[5]: *** [/root/CENTOS82-64_K4.18.0_GCC8.3.1/x86_64-native-linuxapp-gcc+shared/a97f7ee35f494d71a9427a4273edff37/dpdk/mk/rte.subdir.mk:35: softnic] Error 2
make[5]: *** Waiting for unfinished jobs....
  CC efx_filter.o
  CC otx2_ethdev_ops.o
--
  CC medford2_nic.o
  LD librte_pmd_sfc_efx.so.21.0
  INSTALL-LIB librte_pmd_sfc_efx.so.21.0
make[4]: *** [/root/CENTOS82-64_K4.18.0_GCC8.3.1/x86_64-native-linuxapp-gcc+shared/a97f7ee35f494d71a9427a4273edff37/dpdk/mk/rte.subdir.mk:35: net] Error 2
make[3]: *** [/root/CENTOS82-64_K4.18.0_GCC8.3.1/x86_64-native-linuxapp-gcc+shared/a97f7ee35f494d71a9427a4273edff37/dpdk/mk/rte.sdkbuild.mk:51: drivers] Error 2
make[2]: *** [/root/CENTOS82-64_K4.18.0_GCC8.3.1/x86_64-native-linuxapp-gcc+shared/a97f7ee35f494d71a9427a4273edff37/dpdk/mk/rte.sdkroot.mk:115: all] Error 2
make[1]: *** [/root/CENTOS82-64_K4.18.0_GCC8.3.1/x86_64-native-linuxapp-gcc+shared/a97f7ee35f494d71a9427a4273edff37/dpdk/mk/rte.sdkinstall.mk:61: pre_install] Error 2
make: *** [/root/CENTOS82-64_K4.18.0_GCC8.3.1/x86_64-native-linuxapp-gcc+shared/a97f7ee35f494d71a9427a4273edff37/dpdk/mk/rte.sdkroot.mk:92: install] Error 2


*Makefile Build Failed #6:
OS: CENTOS82-64
Target: x86_64-native-linuxapp-gcc+debug
  CC tf_ulp/ulp_template_db_class.o
  CC efx_mon.o
/root/CENTOS82-64_K4.18.0_GCC8.3.1/x86_64-native-linuxapp-gcc+debug/a97f7ee35f494d71a9427a4273edff37/dpdk/drivers/net/softnic/rte_eth_softnic_tm.c: In function ‘update_subport_tc_rate’:
/root/CENTOS82-64_K4.18.0_GCC8.3.1/x86_64-native-linuxapp-gcc+debug/a97f7ee35f494d71a9427a4273edff37/dpdk/drivers/net/softnic/rte_eth_softnic_tm.c:1068:16: error: ‘struct rte_sched_subport_params’ has no member named ‘tc_rate’
  subport_params.tc_rate[tc_id] = sp_new->params.peak.rate;
                ^
/root/CENTOS82-64_K4.18.0_GCC8.3.1/x86_64-native-linuxapp-gcc+debug/a97f7ee35f494d71a9427a4273edff37/dpdk/drivers/net/softnic/rte_eth_softnic_tm.c:1052:11: warning: variable ‘tc_id’ set but not used [-Wunused-but-set-variable]
  uint32_t tc_id = tm_node_tc_id(dev, nt);
           ^~~~~
/root/CENTOS82-64_K4.18.0_GCC8.3.1/x86_64-native-linuxapp-gcc+debug/a97f7ee35f494d71a9427a4273edff37/dpdk/drivers/net/softnic/rte_eth_softnic_tm.c: In function ‘hierarchy_blueprints_create’:
/root/CENTOS82-64_K4.18.0_GCC8.3.1/x86_64-native-linuxapp-gcc+debug/a97f7ee35f494d71a9427a4273edff37/dpdk/drivers/net/softnic/rte_eth_softnic_tm.c:2555:6: error: ‘struct rte_sched_subport_params’ has no member named ‘tb_rate’
     .tb_rate = n->shaper_profile->params.peak.rate,
      ^~~~~~~
/root/CENTOS82-64_K4.18.0_GCC8.3.1/x86_64-native-linuxapp-gcc+debug/a97f7ee35f494d71a9427a4273edff37/dpdk/drivers/net/softnic/rte_eth_softnic_tm.c:2556:6: error: ‘struct rte_sched_subport_params’ has no member named ‘tb_size’; did you mean ‘qsize’?
     .tb_size = n->shaper_profile->params.peak.size,
      ^~~~~~~
      qsize
/root/CENTOS82-64_K4.18.0_GCC8.3.1/x86_64-native-linuxapp-gcc+debug/a97f7ee35f494d71a9427a4273edff37/dpdk/drivers/net/softnic/rte_eth_softnic_tm.c:2558:6: error: ‘struct rte_sched_subport_params’ has no member named ‘tc_rate’
     .tc_rate = {tc_rate[0],
      ^~~~~~~
/root/CENTOS82-64_K4.18.0_GCC8.3.1/x86_64-native-linuxapp-gcc+debug/a97f7ee35f494d71a9427a4273edff37/dpdk/drivers/net/softnic/rte_eth_softnic_tm.c:2558:5: warning: braces around scalar initializer
--
/root/CENTOS82-64_K4.18.0_GCC8.3.1/x86_64-native-linuxapp-gcc+debug/a97f7ee35f494d71a9427a4273edff37/dpdk/drivers/net/softnic/rte_eth_softnic_tm.c:2556:16:
     .tb_size = n->shaper_profile->params.peak.size,
                {                                  }
/root/CENTOS82-64_K4.18.0_GCC8.3.1/x86_64-native-linuxapp-gcc+debug/a97f7ee35f494d71a9427a4273edff37/dpdk/drivers/net/softnic/rte_eth_softnic_tm.c:2572:6: error: ‘struct rte_sched_subport_params’ has no member named ‘tc_period’
     .tc_period = SUBPORT_TC_PERIOD,
      ^~~~~~~~~
/root/CENTOS82-64_K4.18.0_GCC8.3.1/x86_64-native-linuxapp-gcc+debug/a97f7ee35f494d71a9427a4273edff37/dpdk/drivers/net/softnic/rte_eth_softnic_tm.c:2574:6: warning: initialized field overwritten [-Woverride-init]
--
     .tb_size = n->shaper_profile->params.peak.size,
                {                                  }
/root/CENTOS82-64_K4.18.0_GCC8.3.1/x86_64-native-linuxapp-gcc+debug/a97f7ee35f494d71a9427a4273edff37/dpdk/drivers/net/softnic/rte_eth_softnic_tm.c: In function ‘update_subport_rate’:
/root/CENTOS82-64_K4.18.0_GCC8.3.1/x86_64-native-linuxapp-gcc+debug/a97f7ee35f494d71a9427a4273edff37/dpdk/drivers/net/softnic/rte_eth_softnic_tm.c:2838:16: error: ‘struct rte_sched_subport_params’ has no member named ‘tb_rate’
  subport_params.tb_rate = sp->params.peak.rate;
                ^
/root/CENTOS82-64_K4.18.0_GCC8.3.1/x86_64-native-linuxapp-gcc+debug/a97f7ee35f494d71a9427a4273edff37/dpdk/drivers/net/softnic/rte_eth_softnic_tm.c:2839:17: error: ‘struct rte_sched_subport_params’ has no member named ‘tb_size’; did you mean ‘qsize’?
  subport_params.tb_size = sp->params.peak.size;
                 ^~~~~~~
                 qsize
/root/CENTOS82-64_K4.18.0_GCC8.3.1/x86_64-native-linuxapp-gcc+debug/a97f7ee35f494d71a9427a4273edff37/dpdk/drivers/net/softnic/rte_eth_softnic_tm.c: At top level:
cc1: warning: unrecognized command line option ‘-Wno-address-of-packed-member’
  CC rte_eth_softnic_tap.o
make[6]: *** [/root/CENTOS82-64_K4.18.0_GCC8.3.1/x86_64-native-linuxapp-gcc+debug/a97f7ee35f494d71a9427a4273edff37/dpdk/mk/internal/rte.compile-pre.mk:116: rte_eth_softnic_tm.o] Error 1
make[6]: *** Waiting for unfinished jobs....
  CC tf_ulp/ulp_template_db_act.o
  CC efx_nic.o
--
  CC tf_ulp/ulp_matcher.o
  CC otx2_ethdev_sec.o
  CC efx_port.o
make[5]: *** [/root/CENTOS82-64_K4.18.0_GCC8.3.1/x86_64-native-linuxapp-gcc+debug/a97f7ee35f494d71a9427a4273edff37/dpdk/mk/rte.subdir.mk:35: softnic] Error 2
make[5]: *** Waiting for unfinished jobs....
  PMDINFO qede_ethdev.o.pmd.c
  CC qede_ethdev.o.pmd.o
--
  INSTALL-LIB librte_pmd_sfc_efx.a
  AR librte_pmd_bnxt.a
  INSTALL-LIB librte_pmd_bnxt.a
make[4]: *** [/root/CENTOS82-64_K4.18.0_GCC8.3.1/x86_64-native-linuxapp-gcc+debug/a97f7ee35f494d71a9427a4273edff37/dpdk/mk/rte.subdir.mk:35: net] Error 2
make[3]: *** [/root/CENTOS82-64_K4.18.0_GCC8.3.1/x86_64-native-linuxapp-gcc+debug/a97f7ee35f494d71a9427a4273edff37/dpdk/mk/rte.sdkbuild.mk:51: drivers] Error 2
make[2]: *** [/root/CENTOS82-64_K4.18.0_GCC8.3.1/x86_64-native-linuxapp-gcc+debug/a97f7ee35f494d71a9427a4273edff37/dpdk/mk/rte.sdkroot.mk:115: all] Error 2
make[1]: *** [/root/CENTOS82-64_K4.18.0_GCC8.3.1/x86_64-native-linuxapp-gcc+debug/a97f7ee35f494d71a9427a4273edff37/dpdk/mk/rte.sdkinstall.mk:61: pre_install] Error 2
make: *** [/root/CENTOS82-64_K4.18.0_GCC8.3.1/x86_64-native-linuxapp-gcc+debug/a97f7ee35f494d71a9427a4273edff37/dpdk/mk/rte.sdkroot.mk:92: install] Error 2


*Makefile Build Failed #7:
OS: FC32-64
Target: x86_64-native-linuxapp-gcc
  CC rte_eth_softnic_action.o
  CC rte_eth_softnic_pipeline.o
/root/FC32-64_K5.6.0_GCC10.0.1/x86_64-native-linuxapp-gcc/a97f7ee35f494d71a9427a4273edff37/dpdk/drivers/net/softnic/rte_eth_softnic_tm.c: In function ‘update_subport_tc_rate’:
/root/FC32-64_K5.6.0_GCC10.0.1/x86_64-native-linuxapp-gcc/a97f7ee35f494d71a9427a4273edff37/dpdk/drivers/net/softnic/rte_eth_softnic_tm.c:1068:16: error: ‘struct rte_sched_subport_params’ has no member named ‘tc_rate’
 1068 |  subport_params.tc_rate[tc_id] = sp_new->params.peak.rate;
      |                ^
/root/FC32-64_K5.6.0_GCC10.0.1/x86_64-native-linuxapp-gcc/a97f7ee35f494d71a9427a4273edff37/dpdk/drivers/net/softnic/rte_eth_softnic_tm.c:1052:11: warning: variable ‘tc_id’ set but not used [-Wunused-but-set-variable]
 1052 |  uint32_t tc_id = tm_node_tc_id(dev, nt);
      |           ^~~~~
/root/FC32-64_K5.6.0_GCC10.0.1/x86_64-native-linuxapp-gcc/a97f7ee35f494d71a9427a4273edff37/dpdk/drivers/net/softnic/rte_eth_softnic_tm.c: In function ‘hierarchy_blueprints_create’:
/root/FC32-64_K5.6.0_GCC10.0.1/x86_64-native-linuxapp-gcc/a97f7ee35f494d71a9427a4273edff37/dpdk/drivers/net/softnic/rte_eth_softnic_tm.c:2555:6: error: ‘struct rte_sched_subport_params’ has no member named ‘tb_rate’
 2555 |     .tb_rate = n->shaper_profile->params.peak.rate,
      |      ^~~~~~~
/root/FC32-64_K5.6.0_GCC10.0.1/x86_64-native-linuxapp-gcc/a97f7ee35f494d71a9427a4273edff37/dpdk/drivers/net/softnic/rte_eth_softnic_tm.c:2556:6: error: ‘struct rte_sched_subport_params’ has no member named ‘tb_size’; did you mean ‘qsize’?
 2556 |     .tb_size = n->shaper_profile->params.peak.size,
      |      ^~~~~~~
      |      qsize
/root/FC32-64_K5.6.0_GCC10.0.1/x86_64-native-linuxapp-gcc/a97f7ee35f494d71a9427a4273edff37/dpdk/drivers/net/softnic/rte_eth_softnic_tm.c:2558:6: error: ‘struct rte_sched_subport_params’ has no member named ‘tc_rate’
 2558 |     .tc_rate = {tc_rate[0],
      |      ^~~~~~~
/root/FC32-64_K5.6.0_GCC10.0.1/x86_64-native-linuxapp-gcc/a97f7ee35f494d71a9427a4273edff37/dpdk/drivers/net/softnic/rte_eth_softnic_tm.c:2558:5: warning: braces around scalar initializer
--
 2555 |     .tb_rate = n->shaper_profile->params.peak.rate,
 2556 |     .tb_size = n->shaper_profile->params.peak.size,
      |                {                                  }
/root/FC32-64_K5.6.0_GCC10.0.1/x86_64-native-linuxapp-gcc/a97f7ee35f494d71a9427a4273edff37/dpdk/drivers/net/softnic/rte_eth_softnic_tm.c:2572:6: error: ‘struct rte_sched_subport_params’ has no member named ‘tc_period’
 2572 |     .tc_period = SUBPORT_TC_PERIOD,
      |      ^~~~~~~~~
/root/FC32-64_K5.6.0_GCC10.0.1/x86_64-native-linuxapp-gcc/a97f7ee35f494d71a9427a4273edff37/dpdk/drivers/net/softnic/rte_eth_softnic_tm.c:2574:6: warning: initialized field overwritten [-Woverride-init]
--
 2556 |     .tb_size = n->shaper_profile->params.peak.size,
      |                {                                  }
/root/FC32-64_K5.6.0_GCC10.0.1/x86_64-native-linuxapp-gcc/a97f7ee35f494d71a9427a4273edff37/dpdk/drivers/net/softnic/rte_eth_softnic_tm.c: In function ‘update_subport_rate’:
/root/FC32-64_K5.6.0_GCC10.0.1/x86_64-native-linuxapp-gcc/a97f7ee35f494d71a9427a4273edff37/dpdk/drivers/net/softnic/rte_eth_softnic_tm.c:2838:16: error: ‘struct rte_sched_subport_params’ has no member named ‘tb_rate’
 2838 |  subport_params.tb_rate = sp->params.peak.rate;
      |                ^
/root/FC32-64_K5.6.0_GCC10.0.1/x86_64-native-linuxapp-gcc/a97f7ee35f494d71a9427a4273edff37/dpdk/drivers/net/softnic/rte_eth_softnic_tm.c:2839:17: error: ‘struct rte_sched_subport_params’ has no member named ‘tb_size’; did you mean ‘qsize’?
 2839 |  subport_params.tb_size = sp->params.peak.size;
      |                 ^~~~~~~
      |                 qsize
make[6]: *** [/root/FC32-64_K5.6.0_GCC10.0.1/x86_64-native-linuxapp-gcc/a97f7ee35f494d71a9427a4273edff37/dpdk/mk/internal/rte.compile-pre.mk:116: rte_eth_softnic_tm.o] Error 1
make[6]: *** Waiting for unfinished jobs....
  CC virtio_user/vhost_kernel.o
  CC efx_rx.o
--
  CC virtio_user/virtio_user_dev.o
  CC virtio_user_ethdev.o
  CC efx_tunnel.o
make[5]: *** [/root/FC32-64_K5.6.0_GCC10.0.1/x86_64-native-linuxapp-gcc/a97f7ee35f494d71a9427a4273edff37/dpdk/mk/rte.subdir.mk:35: softnic] Error 2
make[5]: *** Waiting for unfinished jobs....
  CC efx_tx.o
  CC efx_vpd.o
--
  CC medford2_nic.o
  AR librte_pmd_sfc_efx.a
  INSTALL-LIB librte_pmd_sfc_efx.a
make[4]: *** [/root/FC32-64_K5.6.0_GCC10.0.1/x86_64-native-linuxapp-gcc/a97f7ee35f494d71a9427a4273edff37/dpdk/mk/rte.subdir.mk:35: net] Error 2
make[3]: *** [/root/FC32-64_K5.6.0_GCC10.0.1/x86_64-native-linuxapp-gcc/a97f7ee35f494d71a9427a4273edff37/dpdk/mk/rte.sdkbuild.mk:51: drivers] Error 2
make[2]: *** [/root/FC32-64_K5.6.0_GCC10.0.1/x86_64-native-linuxapp-gcc/a97f7ee35f494d71a9427a4273edff37/dpdk/mk/rte.sdkroot.mk:115: all] Error 2
make[1]: *** [/root/FC32-64_K5.6.0_GCC10.0.1/x86_64-native-linuxapp-gcc/a97f7ee35f494d71a9427a4273edff37/dpdk/mk/rte.sdkinstall.mk:61: pre_install] Error 2
make: *** [/root/FC32-64_K5.6.0_GCC10.0.1/x86_64-native-linuxapp-gcc/a97f7ee35f494d71a9427a4273edff37/dpdk/mk/rte.sdkroot.mk:92: install] Error 2


*Makefile Build Failed #8:
OS: FC32-64
Target: x86_64-native-linuxapp-clang
  CC rte_eth_softnic_cli.o
  CC sfc_ef10_tx.o
  CC tf_core/tf_shadow_identifier.o
/root/FC32-64_K5.6.0_Clang10.0.0/x86_64-native-linuxapp-clang/a97f7ee35f494d71a9427a4273edff37/dpdk/drivers/net/softnic/rte_eth_softnic_tm.c:1068:17: error: no member named 'tc_rate' in 'struct rte_sched_subport_params'
        subport_params.tc_rate[tc_id] = sp_new->params.peak.rate;
        ~~~~~~~~~~~~~~ ^
/root/FC32-64_K5.6.0_Clang10.0.0/x86_64-native-linuxapp-clang/a97f7ee35f494d71a9427a4273edff37/dpdk/drivers/net/softnic/rte_eth_softnic_tm.c:2555:6: error: field designator 'tb_rate' does not refer to any field in type 'struct rte_sched_subport_params'
                                .tb_rate = n->shaper_profile->params.peak.rate,
                                 ^
/root/FC32-64_K5.6.0_Clang10.0.0/x86_64-native-linuxapp-clang/a97f7ee35f494d71a9427a4273edff37/dpdk/drivers/net/softnic/rte_eth_softnic_tm.c:2556:6: error: field designator 'tb_size' does not refer to any field in type 'struct rte_sched_subport_params'
                                .tb_size = n->shaper_profile->params.peak.size,
                                 ^
/root/FC32-64_K5.6.0_Clang10.0.0/x86_64-native-linuxapp-clang/a97f7ee35f494d71a9427a4273edff37/dpdk/drivers/net/softnic/rte_eth_softnic_tm.c:2558:6: error: field designator 'tc_rate' does not refer to any field in type 'struct rte_sched_subport_params'
                                .tc_rate = {tc_rate[0],
                                 ^
/root/FC32-64_K5.6.0_Clang10.0.0/x86_64-native-linuxapp-clang/a97f7ee35f494d71a9427a4273edff37/dpdk/drivers/net/softnic/rte_eth_softnic_tm.c:2572:6: error: field designator 'tc_period' does not refer to any field in type 'struct rte_sched_subport_params'
                                .tc_period = SUBPORT_TC_PERIOD,
                                 ^
/root/FC32-64_K5.6.0_Clang10.0.0/x86_64-native-linuxapp-clang/a97f7ee35f494d71a9427a4273edff37/dpdk/drivers/net/softnic/rte_eth_softnic_tm.c:2838:17: error: no member named 'tb_rate' in 'struct rte_sched_subport_params'
        subport_params.tb_rate = sp->params.peak.rate;
        ~~~~~~~~~~~~~~ ^
/root/FC32-64_K5.6.0_Clang10.0.0/x86_64-native-linuxapp-clang/a97f7ee35f494d71a9427a4273edff37/dpdk/drivers/net/softnic/rte_eth_softnic_tm.c:2839:17: error: no member named 'tb_size' in 'struct rte_sched_subport_params'
        subport_params.tb_size = sp->params.peak.size;
        ~~~~~~~~~~~~~~ ^
7 errors generated.
make[6]: *** [/root/FC32-64_K5.6.0_Clang10.0.0/x86_64-native-linuxapp-clang/a97f7ee35f494d71a9427a4273edff37/dpdk/mk/internal/rte.compile-pre.mk:116: rte_eth_softnic_tm.o] Error 1
make[6]: *** Waiting for unfinished jobs....
  CC efx_bootcfg.o
  CC tf_core/tf_hash.o
--
  CC mcdi_mon.o
  CC siena_mac.o
  CC siena_mcdi.o
make[5]: *** [/root/FC32-64_K5.6.0_Clang10.0.0/x86_64-native-linuxapp-clang/a97f7ee35f494d71a9427a4273edff37/dpdk/mk/rte.subdir.mk:35: softnic] Error 2
make[5]: *** Waiting for unfinished jobs....
  CC siena_nic.o
  CC siena_nvram.o
--
  CC medford2_nic.o
  AR librte_pmd_sfc_efx.a
  INSTALL-LIB librte_pmd_sfc_efx.a
make[4]: *** [/root/FC32-64_K5.6.0_Clang10.0.0/x86_64-native-linuxapp-clang/a97f7ee35f494d71a9427a4273edff37/dpdk/mk/rte.subdir.mk:35: net] Error 2
make[3]: *** [/root/FC32-64_K5.6.0_Clang10.0.0/x86_64-native-linuxapp-clang/a97f7ee35f494d71a9427a4273edff37/dpdk/mk/rte.sdkbuild.mk:51: drivers] Error 2
make[2]: *** [/root/FC32-64_K5.6.0_Clang10.0.0/x86_64-native-linuxapp-clang/a97f7ee35f494d71a9427a4273edff37/dpdk/mk/rte.sdkroot.mk:115: all] Error 2
make[1]: *** [/root/FC32-64_K5.6.0_Clang10.0.0/x86_64-native-linuxapp-clang/a97f7ee35f494d71a9427a4273edff37/dpdk/mk/rte.sdkinstall.mk:61: pre_install] Error 2
make: *** [/root/FC32-64_K5.6.0_Clang10.0.0/x86_64-native-linuxapp-clang/a97f7ee35f494d71a9427a4273edff37/dpdk/mk/rte.sdkroot.mk:92: install] Error 2


*Makefile Build Failed #9:
OS: FreeBSD1201-64
Target: x86_64-native-bsdapp-gcc
awk -f /usr/src/sys/tools/makeobjops.awk /usr/src/sys/dev/pci/pci_if.m -h
awk -f /usr/src/sys/tools/makeobjops.awk /usr/src/sys/kern/bus_if.m -h
Warning: Object directory not changed from original /root/FreeBSD1201-64_K12.1_GCC9.2.0/x86_64-native-bsdapp-gcc/a97f7ee35f494d71a9427a4273edff37/dpdk/x86_64-native-bsdapp-gcc/build/kernel/freebsd/nic_uio
cc  -Winline -Wall -Werror -include /root/FreeBSD1201-64_K12.1_GCC9.2.0/x86_64-native-bsdapp-gcc/a97f7ee35f494d71a9427a4273edff37/dpdk/x86_64-native-bsdapp-gcc/include/rte_config.h  -Werror -D_KERNEL -DKLD_MODULE -nostdinc  -I/root/FreeBSD1201-64_K12.1_GCC9.2.0/x86_64-native-bsdapp-gcc/a97f7ee35f494d71a9427a4273edff37/dpdk/kernel/freebsd/nic_uio -I/root/FreeBSD1201-64_K12.1_GCC9.2.0/x86_64-native-bsdapp-gcc/a97f7ee35f494d71a9427a4273edff37/dpdk/x86_64-native-bsdapp-gcc/include -I. -I/usr/src/sys -I/usr/src/sys/contrib/ck/include -fno-common  -fno-omit-frame-pointer -mno-omit-leaf-frame-pointer -fdebug-prefix-map=./machine=/usr/src/sys/amd64/include -fdebug-prefix-map=./x86=/usr/src/sys/x86/include   -MD  -MF.depend.nic_uio.o -MTnic_uio.o -mcmodel=kernel -mno-red-zone -mno-mmx -mno-sse -msoft-float  -fno-asynchronous-unwind-tables -ffreestanding -fwrapv -fstack-protector -Wall -Wredundant-decls -Wnested-externs -Wstrict-prototypes -Wmissing-prototypes -Wpointer-arith -Wcast-qual -Wundef -Wno-pointer-sign -D__printf__=__freebsd_kprintf__ -Wmissing-include-dirs -fdiagnostics-show-option -Wno-unknown-pragmas -Wno-error-tautological-compare -Wno-error-empty-body -Wno-error-parentheses-equality -Wno-error-unused-function -Wno-error-pointer-sign -Wno-error-shift-negative-value -Wno-address-of-packed-member  -mno-aes -mno-avx  -std=iso9899:1999 -c nic_uio.c -o nic_uio.o
Warning: Object directory not changed from original /root/FreeBSD1201-64_K12.1_GCC9.2.0/x86_64-native-bsdapp-gcc/a97f7ee35f494d71a9427a4273edff37/dpdk/x86_64-native-bsdapp-gcc/build/kernel/freebsd/contigmem
cc  -Winline -Wall -Werror -include /root/FreeBSD1201-64_K12.1_GCC9.2.0/x86_64-native-bsdapp-gcc/a97f7ee35f494d71a9427a4273edff37/dpdk/x86_64-native-bsdapp-gcc/include/rte_config.h  -Werror -D_KERNEL -DKLD_MODULE -nostdinc  -I/root/FreeBSD1201-64_K12.1_GCC9.2.0/x86_64-native-bsdapp-gcc/a97f7ee35f494d71a9427a4273edff37/dpdk/kernel/freebsd/contigmem -I/root/FreeBSD1201-64_K12.1_GCC9.2.0/x86_64-native-bsdapp-gcc/a97f7ee35f494d71a9427a4273edff37/dpdk/x86_64-native-bsdapp-gcc/include -I. -I/usr/src/sys -I/usr/src/sys/contrib/ck/include -fno-common  -fno-omit-frame-pointer -mno-omit-leaf-frame-pointer -fdebug-prefix-map=./machine=/usr/src/sys/amd64/include -fdebug-prefix-map=./x86=/usr/src/sys/x86/include   -MD  -MF.depend.contigmem.o -MTcontigmem.o -mcmodel=kernel -mno-red-zone -mno-mmx -mno-sse -msoft-float  -fno-asynchronous-unwind-tables -ffreestanding -fwrapv -fstack-protector -Wall -Wredundant-decls -Wnested-externs -Wstrict-prototypes -Wmissing-prototypes -Wpointer-arith -Wcast-qual -Wundef -Wno-pointer-sign -D__printf__=__freebsd_kprintf__ -Wmissing-include-dirs -fdiagnostics-show-option -Wno-unknown-pragmas -Wno-error-tautological-compare -Wno-error-empty-body -Wno-error-parentheses-equality -Wno-error-unused-function -Wno-error-pointer-sign -Wno-error-shift-negative-value -Wno-address-of-packed-member  -mno-aes -mno-avx  -std=iso9899:1999 -c contigmem.c -o contigmem.o
== Build drivers/common
ld -m elf_x86_64_fbsd -L/root/FreeBSD1201-64_K12.1_GCC9.2.0/x86_64-native-bsdapp-gcc/a97f7ee35f494d71a9427a4273edff37/dpdk/x86_64-native-bsdapp-gcc/lib -d -warn-common --build-id=sha1 -r -d -o nic_uio.ko nic_uio.o
ld -m elf_x86_64_fbsd -L/root/FreeBSD1201-64_K12.1_GCC9.2.0/x86_64-native-bsdapp-gcc/a97f7ee35f494d71a9427a4273edff37/dpdk/x86_64-native-bsdapp-gcc/lib -d -warn-common --build-id=sha1 -r -d -o contigmem.ko contigmem.o
--
  CC test_meter.o
  CC test_common.o
  CC test_distributor.o
/root/FreeBSD1201-64_K12.1_GCC9.2.0/x86_64-native-bsdapp-gcc/a97f7ee35f494d71a9427a4273edff37/dpdk/app/test/test_sched.c:41:4: error: 'struct rte_sched_subport_params' has no member named 'tb_rate'
   41 |   .tb_rate = 1250000000,
      |    ^~~~~~~
/root/FreeBSD1201-64_K12.1_GCC9.2.0/x86_64-native-bsdapp-gcc/a97f7ee35f494d71a9427a4273edff37/dpdk/app/test/test_sched.c:42:4: error: 'struct rte_sched_subport_params' has no member named 'tb_size'; did you mean 'qsize'?
   42 |   .tb_size = 1000000,
      |    ^~~~~~~
      |    qsize
/root/FreeBSD1201-64_K12.1_GCC9.2.0/x86_64-native-bsdapp-gcc/a97f7ee35f494d71a9427a4273edff37/dpdk/app/test/test_sched.c:42:14: warning: unsigned conversion from 'int' to 'short unsigned int' changes value from '1000000' to '16960' [-Woverflow]
   42 |   .tb_size = 1000000,
      |              ^~~~~~~
/root/FreeBSD1201-64_K12.1_GCC9.2.0/x86_64-native-bsdapp-gcc/a97f7ee35f494d71a9427a4273edff37/dpdk/app/test/test_sched.c:44:4: error: 'struct rte_sched_subport_params' has no member named 'tc_rate'
   44 |   .tc_rate = {1250000000, 1250000000, 1250000000, 1250000000,
      |    ^~~~~~~
/root/FreeBSD1201-64_K12.1_GCC9.2.0/x86_64-native-bsdapp-gcc/a97f7ee35f494d71a9427a4273edff37/dpdk/app/test/test_sched.c:44:3: warning: braces around scalar initializer
--
......
   42 |   .tb_size = 1000000,
      |              {      }
/root/FreeBSD1201-64_K12.1_GCC9.2.0/x86_64-native-bsdapp-gcc/a97f7ee35f494d71a9427a4273edff37/dpdk/app/test/test_sched.c:47:4: error: 'struct rte_sched_subport_params' has no member named 'tc_period'
   47 |   .tc_period = 10,
      |    ^~~~~~~~~
/root/FreeBSD1201-64_K12.1_GCC9.2.0/x86_64-native-bsdapp-gcc/a97f7ee35f494d71a9427a4273edff37/dpdk/app/test/test_sched.c:48:34: warning: initialized field overwritten [-Woverride-init]
--
......
   42 |   .tb_size = 1000000,
      |              {      }
gmake[5]: *** [/root/FreeBSD1201-64_K12.1_GCC9.2.0/x86_64-native-bsdapp-gcc/a97f7ee35f494d71a9427a4273edff37/dpdk/mk/internal/rte.compile-pre.mk:116: test_sched.o] Error 1
gmake[5]: *** Waiting for unfinished jobs....
gmake[4]: *** [/root/FreeBSD1201-64_K12.1_GCC9.2.0/x86_64-native-bsdapp-gcc/a97f7ee35f494d71a9427a4273edff37/dpdk/mk/rte.subdir.mk:35: test] Error 2
gmake[3]: *** [/root/FreeBSD1201-64_K12.1_GCC9.2.0/x86_64-native-bsdapp-gcc/a97f7ee35f494d71a9427a4273edff37/dpdk/mk/rte.sdkbuild.mk:53: app] Error 2
gmake[2]: *** [/root/FreeBSD1201-64_K12.1_GCC9.2.0/x86_64-native-bsdapp-gcc/a97f7ee35f494d71a9427a4273edff37/dpdk/mk/rte.sdkroot.mk:115: all] Error 2
gmake[1]: *** [/root/FreeBSD1201-64_K12.1_GCC9.2.0/x86_64-native-bsdapp-gcc/a97f7ee35f494d71a9427a4273edff37/dpdk/mk/rte.sdkinstall.mk:61: pre_install] Error 2
gmake: *** [/root/FreeBSD1201-64_K12.1_GCC9.2.0/x86_64-native-bsdapp-gcc/a97f7ee35f494d71a9427a4273edff37/dpdk/mk/rte.sdkroot.mk:92: install] Error 2


*Makefile Build Failed #10:
OS: FreeBSD1201-64
Target: x86_64-native-bsdapp-clang
awk -f /usr/src/sys/tools/makeobjops.awk /usr/src/sys/kern/bus_if.m -h
awk -f /usr/src/sys/tools/makeobjops.awk /usr/src/sys/dev/pci/pci_if.m -h
Warning: Object directory not changed from original /root/FreeBSD1201-64_K12.1_Clang8.0.1/x86_64-native-bsdapp-clang/a97f7ee35f494d71a9427a4273edff37/dpdk/x86_64-native-bsdapp-clang/build/kernel/freebsd/contigmem
cc  -Winline -Wall -Werror -include /root/FreeBSD1201-64_K12.1_Clang8.0.1/x86_64-native-bsdapp-clang/a97f7ee35f494d71a9427a4273edff37/dpdk/x86_64-native-bsdapp-clang/include/rte_config.h  -Werror -D_KERNEL -DKLD_MODULE -nostdinc  -I/root/FreeBSD1201-64_K12.1_Clang8.0.1/x86_64-native-bsdapp-clang/a97f7ee35f494d71a9427a4273edff37/dpdk/kernel/freebsd/contigmem -I/root/FreeBSD1201-64_K12.1_Clang8.0.1/x86_64-native-bsdapp-clang/a97f7ee35f494d71a9427a4273edff37/dpdk/x86_64-native-bsdapp-clang/include -I. -I/usr/src/sys -I/usr/src/sys/contrib/ck/include -fno-common  -fno-omit-frame-pointer -mno-omit-leaf-frame-pointer -fdebug-prefix-map=./machine=/usr/src/sys/amd64/include -fdebug-prefix-map=./x86=/usr/src/sys/x86/include   -MD  -MF.depend.contigmem.o -MTcontigmem.o -mcmodel=kernel -mno-red-zone -mno-mmx -mno-sse -msoft-float  -fno-asynchronous-unwind-tables -ffreestanding -fwrapv -fstack-protector -Wall -Wredundant-decls -Wnested-externs -Wstrict-prototypes -Wmissing-prototypes -Wpointer-arith -Wcast-qual -Wundef -Wno-pointer-sign -D__printf__=__freebsd_kprintf__ -Wmissing-include-dirs -fdiagnostics-show-option -Wno-unknown-pragmas -Wno-error-tautological-compare -Wno-error-empty-body -Wno-error-parentheses-equality -Wno-error-unused-function -Wno-error-pointer-sign -Wno-error-shift-negative-value -Wno-address-of-packed-member  -mno-aes -mno-avx  -std=iso9899:1999 -c contigmem.c -o contigmem.o
Warning: Object directory not changed from original /root/FreeBSD1201-64_K12.1_Clang8.0.1/x86_64-native-bsdapp-clang/a97f7ee35f494d71a9427a4273edff37/dpdk/x86_64-native-bsdapp-clang/build/kernel/freebsd/nic_uio
cc  -Winline -Wall -Werror -include /root/FreeBSD1201-64_K12.1_Clang8.0.1/x86_64-native-bsdapp-clang/a97f7ee35f494d71a9427a4273edff37/dpdk/x86_64-native-bsdapp-clang/include/rte_config.h  -Werror -D_KERNEL -DKLD_MODULE -nostdinc  -I/root/FreeBSD1201-64_K12.1_Clang8.0.1/x86_64-native-bsdapp-clang/a97f7ee35f494d71a9427a4273edff37/dpdk/kernel/freebsd/nic_uio -I/root/FreeBSD1201-64_K12.1_Clang8.0.1/x86_64-native-bsdapp-clang/a97f7ee35f494d71a9427a4273edff37/dpdk/x86_64-native-bsdapp-clang/include -I. -I/usr/src/sys -I/usr/src/sys/contrib/ck/include -fno-common  -fno-omit-frame-pointer -mno-omit-leaf-frame-pointer -fdebug-prefix-map=./machine=/usr/src/sys/amd64/include -fdebug-prefix-map=./x86=/usr/src/sys/x86/include   -MD  -MF.depend.nic_uio.o -MTnic_uio.o -mcmodel=kernel -mno-red-zone -mno-mmx -mno-sse -msoft-float  -fno-asynchronous-unwind-tables -ffreestanding -fwrapv -fstack-protector -Wall -Wredundant-decls -Wnested-externs -Wstrict-prototypes -Wmissing-prototypes -Wpointer-arith -Wcast-qual -Wundef -Wno-pointer-sign -D__printf__=__freebsd_kprintf__ -Wmissing-include-dirs -fdiagnostics-show-option -Wno-unknown-pragmas -Wno-error-tautological-compare -Wno-error-empty-body -Wno-error-parentheses-equality -Wno-error-unused-function -Wno-error-pointer-sign -Wno-error-shift-negative-value -Wno-address-of-packed-member  -mno-aes -mno-avx  -std=iso9899:1999 -c nic_uio.c -o nic_uio.o
== Build drivers/common
== Build drivers/common/octeontx
== Build drivers/common/octeontx2
--
                                                  /root/FreeBSD1201-64_K12.1_Clang8.0.1/x86_64-native-bsdapp-clang/a97f7ee35f494d71a9427a4273edff37/dpdk/x86_64-native-bsdapp-clang/lib/librte_pmd_sfc_efx.a(sfc_intr.o)
efx_intr_enable                                   /root/FreeBSD1201-64_K12.1_Clang8.0.1/x86_64-native-bsdapp-clang/a97f7ee35f494d71a9427a4273edff37/dpdk/x86_64-native-bsdapp-clang/lib/librte_pmd_sfc_efx.a(efx_intr.o)
                                                  /root/FreeBSD1201-64_K12.1_Clang8.0.1/x86_64-native-bsdapp-clang/a97f7ee35f494d71a9427a4273edff37/dpdk/x86_64-native-bsdapp-clang/lib/librte_pmd_sfc_efx.a(sfc_intr.o)
efx_intr_fatal                                    /root/FreeBSD1201-64_K12.1_Clang8.0.1/x86_64-native-bsdapp-clang/a97f7ee35f494d71a9427a4273edff37/dpdk/x86_64-native-bsdapp-clang/lib/librte_pmd_sfc_efx.a(efx_intr.o)
                                                  /root/FreeBSD1201-64_K12.1_Clang8.0.1/x86_64-native-bsdapp-clang/a97f7ee35f494d71a9427a4273edff37/dpdk/x86_64-native-bsdapp-clang/lib/librte_pmd_sfc_efx.a(sfc_intr.o)
efx_intr_status_line                              /root/FreeBSD1201-64_K12.1_Clang8.0.1/x86_64-native-bsdapp-clang/a97f7ee35f494d71a9427a4273edff37/dpdk/x86_64-native-bsdapp-clang/lib/librte_pmd_sfc_efx.a(efx_intr.o)
                                                  /root/FreeBSD1201-64_K12.1_Clang8.0.1/x86_64-native-bsdapp-clang/a97f7ee35f494d71a9427a4273edff37/dpdk/x86_64-native-bsdapp-clang/lib/librte_pmd_sfc_efx.a(sfc_intr.o)
--
                                                  /root/FreeBSD1201-64_K12.1_Clang8.0.1/x86_64-native-bsdapp-clang/a97f7ee35f494d71a9427a4273edff37/dpdk/x86_64-native-bsdapp-clang/lib/librte_pmd_sfc_efx.a(sfc_tx.o)
sfc_rx_qflush_done                                /root/FreeBSD1201-64_K12.1_Clang8.0.1/x86_64-native-bsdapp-clang/a97f7ee35f494d71a9427a4273edff37/dpdk/x86_64-native-bsdapp-clang/lib/librte_pmd_sfc_efx.a(sfc_rx.o)
                                                  /root/FreeBSD1201-64_K12.1_Clang8.0.1/x86_64-native-bsdapp-clang/a97f7ee35f494d71a9427a4273edff37/dpdk/x86_64-native-bsdapp-clang/lib/librte_pmd_sfc_efx.a(sfc_ev.o)
sfc_rx_qflush_failed                              /root/FreeBSD1201-64_K12.1_Clang8.0.1/x86_64-native-bsdapp-clang/a97f7ee35f494d71a9427a4273edff37/dpdk/x86_64-native-bsdapp-clang/lib/librte_pmd_sfc_efx.a(sfc_rx.o)
                                                  /root/FreeBSD1201-64_K12.1_Clang8.0.1/x86_64-native-bsdapp-clang/a97f7ee35f494d71a9427a4273edff37/dpdk/x86_64-native-bsdapp-clang/lib/librte_pmd_sfc_efx.a(sfc_ev.o)
sfc_rxq_info_by_dp_rxq                            /root/FreeBSD1201-64_K12.1_Clang8.0.1/x86_64-native-bsdapp-clang/a97f7ee35f494d71a9427a4273edff37/dpdk/x86_64-native-bsdapp-clang/lib/librte_pmd_sfc_efx.a(sfc_rx.o)
                                                  /root/FreeBSD1201-64_K12.1_Clang8.0.1/x86_64-native-bsdapp-clang/a97f7ee35f494d71a9427a4273edff37/dpdk/x86_64-native-bsdapp-clang/lib/librte_pmd_sfc_efx.a(sfc_ev.o)
--
                                                  /root/FreeBSD1201-64_K12.1_Clang8.0.1/x86_64-native-bsdapp-clang/a97f7ee35f494d71a9427a4273edff37/dpdk/x86_64-native-bsdapp-clang/lib/librte_pmd_sfc_efx.a(efx_intr.o)
ef10_intr_enable                                  /root/FreeBSD1201-64_K12.1_Clang8.0.1/x86_64-native-bsdapp-clang/a97f7ee35f494d71a9427a4273edff37/dpdk/x86_64-native-bsdapp-clang/lib/librte_pmd_sfc_efx.a(ef10_intr.o)
                                                  /root/FreeBSD1201-64_K12.1_Clang8.0.1/x86_64-native-bsdapp-clang/a97f7ee35f494d71a9427a4273edff37/dpdk/x86_64-native-bsdapp-clang/lib/librte_pmd_sfc_efx.a(efx_intr.o)
ef10_intr_fatal                                   /root/FreeBSD1201-64_K12.1_Clang8.0.1/x86_64-native-bsdapp-clang/a97f7ee35f494d71a9427a4273edff37/dpdk/x86_64-native-bsdapp-clang/lib/librte_pmd_sfc_efx.a(ef10_intr.o)
                                                  /root/FreeBSD1201-64_K12.1_Clang8.0.1/x86_64-native-bsdapp-clang/a97f7ee35f494d71a9427a4273edff37/dpdk/x86_64-native-bsdapp-clang/lib/librte_pmd_sfc_efx.a(efx_intr.o)
ef10_intr_fini                                    /root/FreeBSD1201-64_K12.1_Clang8.0.1/x86_64-native-bsdapp-clang/a97f7ee35f494d71a9427a4273edff37/dpdk/x86_64-native-bsdapp-clang/lib/librte_pmd_sfc_efx.a(ef10_intr.o)
                                                  /root/FreeBSD1201-64_K12.1_Clang8.0.1/x86_64-native-bsdapp-clang/a97f7ee35f494d71a9427a4273edff37/dpdk/x86_64-native-bsdapp-clang/lib/librte_pmd_sfc_efx.a(efx_intr.o)
--
                                                  /root/FreeBSD1201-64_K12.1_Clang8.0.1/x86_64-native-bsdapp-clang/a97f7ee35f494d71a9427a4273edff37/dpdk/x86_64-native-bsdapp-clang/lib/librte_pmd_sfc_efx.a(sfc_intr.o)
efx_intr_enable                                   /root/FreeBSD1201-64_K12.1_Clang8.0.1/x86_64-native-bsdapp-clang/a97f7ee35f494d71a9427a4273edff37/dpdk/x86_64-native-bsdapp-clang/lib/librte_pmd_sfc_efx.a(efx_intr.o)
                                                  /root/FreeBSD1201-64_K12.1_Clang8.0.1/x86_64-native-bsdapp-clang/a97f7ee35f494d71a9427a4273edff37/dpdk/x86_64-native-bsdapp-clang/lib/librte_pmd_sfc_efx.a(sfc_intr.o)
efx_intr_fatal                                    /root/FreeBSD1201-64_K12.1_Clang8.0.1/x86_64-native-bsdapp-clang/a97f7ee35f494d71a9427a4273edff37/dpdk/x86_64-native-bsdapp-clang/lib/librte_pmd_sfc_efx.a(efx_intr.o)
                                                  /root/FreeBSD1201-64_K12.1_Clang8.0.1/x86_64-native-bsdapp-clang/a97f7ee35f494d71a9427a4273edff37/dpdk/x86_64-native-bsdapp-clang/lib/librte_pmd_sfc_efx.a(sfc_intr.o)
efx_intr_status_line                              /root/FreeBSD1201-64_K12.1_Clang8.0.1/x86_64-native-bsdapp-clang/a97f7ee35f494d71a9427a4273edff37/dpdk/x86_64-native-bsdapp-clang/lib/librte_pmd_sfc_efx.a(efx_intr.o)
                                                  /root/FreeBSD1201-64_K12.1_Clang8.0.1/x86_64-native-bsdapp-clang/a97f7ee35f494d71a9427a4273edff37/dpdk/x86_64-native-bsdapp-clang/lib/librte_pmd_sfc_efx.a(sfc_intr.o)
--
                                                  /root/FreeBSD1201-64_K12.1_Clang8.0.1/x86_64-native-bsdapp-clang/a97f7ee35f494d71a9427a4273edff37/dpdk/x86_64-native-bsdapp-clang/lib/librte_pmd_sfc_efx.a(sfc_tx.o)
sfc_rx_qflush_done                                /root/FreeBSD1201-64_K12.1_Clang8.0.1/x86_64-native-bsdapp-clang/a97f7ee35f494d71a9427a4273edff37/dpdk/x86_64-native-bsdapp-clang/lib/librte_pmd_sfc_efx.a(sfc_rx.o)
                                                  /root/FreeBSD1201-64_K12.1_Clang8.0.1/x86_64-native-bsdapp-clang/a97f7ee35f494d71a9427a4273edff37/dpdk/x86_64-native-bsdapp-clang/lib/librte_pmd_sfc_efx.a(sfc_ev.o)
sfc_rx_qflush_failed                              /root/FreeBSD1201-64_K12.1_Clang8.0.1/x86_64-native-bsdapp-clang/a97f7ee35f494d71a9427a4273edff37/dpdk/x86_64-native-bsdapp-clang/lib/librte_pmd_sfc_efx.a(sfc_rx.o)
                                                  /root/FreeBSD1201-64_K12.1_Clang8.0.1/x86_64-native-bsdapp-clang/a97f7ee35f494d71a9427a4273edff37/dpdk/x86_64-native-bsdapp-clang/lib/librte_pmd_sfc_efx.a(sfc_ev.o)
sfc_rxq_info_by_dp_rxq                            /root/FreeBSD1201-64_K12.1_Clang8.0.1/x86_64-native-bsdapp-clang/a97f7ee35f494d71a9427a4273edff37/dpdk/x86_64-native-bsdapp-clang/lib/librte_pmd_sfc_efx.a(sfc_rx.o)
                                                  /root/FreeBSD1201-64_K12.1_Clang8.0.1/x86_64-native-bsdapp-clang/a97f7ee35f494d71a9427a4273edff37/dpdk/x86_64-native-bsdapp-clang/lib/librte_pmd_sfc_efx.a(sfc_ev.o)
--
                                                  /root/FreeBSD1201-64_K12.1_Clang8.0.1/x86_64-native-bsdapp-clang/a97f7ee35f494d71a9427a4273edff37/dpdk/x86_64-native-bsdapp-clang/lib/librte_pmd_sfc_efx.a(efx_intr.o)
ef10_intr_enable                                  /root/FreeBSD1201-64_K12.1_Clang8.0.1/x86_64-native-bsdapp-clang/a97f7ee35f494d71a9427a4273edff37/dpdk/x86_64-native-bsdapp-clang/lib/librte_pmd_sfc_efx.a(ef10_intr.o)
                                                  /root/FreeBSD1201-64_K12.1_Clang8.0.1/x86_64-native-bsdapp-clang/a97f7ee35f494d71a9427a4273edff37/dpdk/x86_64-native-bsdapp-clang/lib/librte_pmd_sfc_efx.a(efx_intr.o)
ef10_intr_fatal                                   /root/FreeBSD1201-64_K12.1_Clang8.0.1/x86_64-native-bsdapp-clang/a97f7ee35f494d71a9427a4273edff37/dpdk/x86_64-native-bsdapp-clang/lib/librte_pmd_sfc_efx.a(ef10_intr.o)
                                                  /root/FreeBSD1201-64_K12.1_Clang8.0.1/x86_64-native-bsdapp-clang/a97f7ee35f494d71a9427a4273edff37/dpdk/x86_64-native-bsdapp-clang/lib/librte_pmd_sfc_efx.a(efx_intr.o)
ef10_intr_fini                                    /root/FreeBSD1201-64_K12.1_Clang8.0.1/x86_64-native-bsdapp-clang/a97f7ee35f494d71a9427a4273edff37/dpdk/x86_64-native-bsdapp-clang/lib/librte_pmd_sfc_efx.a(ef10_intr.o)
                                                  /root/FreeBSD1201-64_K12.1_Clang8.0.1/x86_64-native-bsdapp-clang/a97f7ee35f494d71a9427a4273edff37/dpdk/x86_64-native-bsdapp-clang/lib/librte_pmd_sfc_efx.a(efx_intr.o)
--
                                                  /root/FreeBSD1201-64_K12.1_Clang8.0.1/x86_64-native-bsdapp-clang/a97f7ee35f494d71a9427a4273edff37/dpdk/x86_64-native-bsdapp-clang/lib/librte_pmd_sfc_efx.a(sfc_intr.o)
efx_intr_enable                                   /root/FreeBSD1201-64_K12.1_Clang8.0.1/x86_64-native-bsdapp-clang/a97f7ee35f494d71a9427a4273edff37/dpdk/x86_64-native-bsdapp-clang/lib/librte_pmd_sfc_efx.a(efx_intr.o)
                                                  /root/FreeBSD1201-64_K12.1_Clang8.0.1/x86_64-native-bsdapp-clang/a97f7ee35f494d71a9427a4273edff37/dpdk/x86_64-native-bsdapp-clang/lib/librte_pmd_sfc_efx.a(sfc_intr.o)
efx_intr_fatal                                    /root/FreeBSD1201-64_K12.1_Clang8.0.1/x86_64-native-bsdapp-clang/a97f7ee35f494d71a9427a4273edff37/dpdk/x86_64-native-bsdapp-clang/lib/librte_pmd_sfc_efx.a(efx_intr.o)
                                                  /root/FreeBSD1201-64_K12.1_Clang8.0.1/x86_64-native-bsdapp-clang/a97f7ee35f494d71a9427a4273edff37/dpdk/x86_64-native-bsdapp-clang/lib/librte_pmd_sfc_efx.a(sfc_intr.o)
efx_intr_status_line                              /root/FreeBSD1201-64_K12.1_Clang8.0.1/x86_64-native-bsdapp-clang/a97f7ee35f494d71a9427a4273edff37/dpdk/x86_64-native-bsdapp-clang/lib/librte_pmd_sfc_efx.a(efx_intr.o)
                                                  /root/FreeBSD1201-64_K12.1_Clang8.0.1/x86_64-native-bsdapp-clang/a97f7ee35f494d71a9427a4273edff37/dpdk/x86_64-native-bsdapp-clang/lib/librte_pmd_sfc_efx.a(sfc_intr.o)
--
                                                  /root/FreeBSD1201-64_K12.1_Clang8.0.1/x86_64-native-bsdapp-clang/a97f7ee35f494d71a9427a4273edff37/dpdk/x86_64-native-bsdapp-clang/lib/librte_pmd_sfc_efx.a(sfc_tx.o)
sfc_rx_qflush_done                                /root/FreeBSD1201-64_K12.1_Clang8.0.1/x86_64-native-bsdapp-clang/a97f7ee35f494d71a9427a4273edff37/dpdk/x86_64-native-bsdapp-clang/lib/librte_pmd_sfc_efx.a(sfc_rx.o)
                                                  /root/FreeBSD1201-64_K12.1_Clang8.0.1/x86_64-native-bsdapp-clang/a97f7ee35f494d71a9427a4273edff37/dpdk/x86_64-native-bsdapp-clang/lib/librte_pmd_sfc_efx.a(sfc_ev.o)
sfc_rx_qflush_failed                              /root/FreeBSD1201-64_K12.1_Clang8.0.1/x86_64-native-bsdapp-clang/a97f7ee35f494d71a9427a4273edff37/dpdk/x86_64-native-bsdapp-clang/lib/librte_pmd_sfc_efx.a(sfc_rx.o)
                                                  /root/FreeBSD1201-64_K12.1_Clang8.0.1/x86_64-native-bsdapp-clang/a97f7ee35f494d71a9427a4273edff37/dpdk/x86_64-native-bsdapp-clang/lib/librte_pmd_sfc_efx.a(sfc_ev.o)
sfc_rxq_info_by_dp_rxq                            /root/FreeBSD1201-64_K12.1_Clang8.0.1/x86_64-native-bsdapp-clang/a97f7ee35f494d71a9427a4273edff37/dpdk/x86_64-native-bsdapp-clang/lib/librte_pmd_sfc_efx.a(sfc_rx.o)
                                                  /root/FreeBSD1201-64_K12.1_Clang8.0.1/x86_64-native-bsdapp-clang/a97f7ee35f494d71a9427a4273edff37/dpdk/x86_64-native-bsdapp-clang/lib/librte_pmd_sfc_efx.a(sfc_ev.o)
--
                                                  /root/FreeBSD1201-64_K12.1_Clang8.0.1/x86_64-native-bsdapp-clang/a97f7ee35f494d71a9427a4273edff37/dpdk/x86_64-native-bsdapp-clang/lib/librte_pmd_sfc_efx.a(efx_intr.o)
ef10_intr_enable                                  /root/FreeBSD1201-64_K12.1_Clang8.0.1/x86_64-native-bsdapp-clang/a97f7ee35f494d71a9427a4273edff37/dpdk/x86_64-native-bsdapp-clang/lib/librte_pmd_sfc_efx.a(ef10_intr.o)
                                                  /root/FreeBSD1201-64_K12.1_Clang8.0.1/x86_64-native-bsdapp-clang/a97f7ee35f494d71a9427a4273edff37/dpdk/x86_64-native-bsdapp-clang/lib/librte_pmd_sfc_efx.a(efx_intr.o)
ef10_intr_fatal                                   /root/FreeBSD1201-64_K12.1_Clang8.0.1/x86_64-native-bsdapp-clang/a97f7ee35f494d71a9427a4273edff37/dpdk/x86_64-native-bsdapp-clang/lib/librte_pmd_sfc_efx.a(ef10_intr.o)
                                                  /root/FreeBSD1201-64_K12.1_Clang8.0.1/x86_64-native-bsdapp-clang/a97f7ee35f494d71a9427a4273edff37/dpdk/x86_64-native-bsdapp-clang/lib/librte_pmd_sfc_efx.a(efx_intr.o)
ef10_intr_fini                                    /root/FreeBSD1201-64_K12.1_Clang8.0.1/x86_64-native-bsdapp-clang/a97f7ee35f494d71a9427a4273edff37/dpdk/x86_64-native-bsdapp-clang/lib/librte_pmd_sfc_efx.a(ef10_intr.o)
                                                  /root/FreeBSD1201-64_K12.1_Clang8.0.1/x86_64-native-bsdapp-clang/a97f7ee35f494d71a9427a4273edff37/dpdk/x86_64-native-bsdapp-clang/lib/librte_pmd_sfc_efx.a(efx_intr.o)
--
                                                  /root/FreeBSD1201-64_K12.1_Clang8.0.1/x86_64-native-bsdapp-clang/a97f7ee35f494d71a9427a4273edff37/dpdk/x86_64-native-bsdapp-clang/lib/librte_pmd_sfc_efx.a(sfc_intr.o)
efx_intr_enable                                   /root/FreeBSD1201-64_K12.1_Clang8.0.1/x86_64-native-bsdapp-clang/a97f7ee35f494d71a9427a4273edff37/dpdk/x86_64-native-bsdapp-clang/lib/librte_pmd_sfc_efx.a(efx_intr.o)
                                                  /root/FreeBSD1201-64_K12.1_Clang8.0.1/x86_64-native-bsdapp-clang/a97f7ee35f494d71a9427a4273edff37/dpdk/x86_64-native-bsdapp-clang/lib/librte_pmd_sfc_efx.a(sfc_intr.o)
efx_intr_fatal                                    /root/FreeBSD1201-64_K12.1_Clang8.0.1/x86_64-native-bsdapp-clang/a97f7ee35f494d71a9427a4273edff37/dpdk/x86_64-native-bsdapp-clang/lib/librte_pmd_sfc_efx.a(efx_intr.o)
                                                  /root/FreeBSD1201-64_K12.1_Clang8.0.1/x86_64-native-bsdapp-clang/a97f7ee35f494d71a9427a4273edff37/dpdk/x86_64-native-bsdapp-clang/lib/librte_pmd_sfc_efx.a(sfc_intr.o)
efx_intr_status_line                              /root/FreeBSD1201-64_K12.1_Clang8.0.1/x86_64-native-bsdapp-clang/a97f7ee35f494d71a9427a4273edff37/dpdk/x86_64-native-bsdapp-clang/lib/librte_pmd_sfc_efx.a(efx_intr.o)
                                                  /root/FreeBSD1201-64_K12.1_Clang8.0.1/x86_64-native-bsdapp-clang/a97f7ee35f494d71a9427a4273edff37/dpdk/x86_64-native-bsdapp-clang/lib/librte_pmd_sfc_efx.a(sfc_intr.o)
--
                                                  /root/FreeBSD1201-64_K12.1_Clang8.0.1/x86_64-native-bsdapp-clang/a97f7ee35f494d71a9427a4273edff37/dpdk/x86_64-native-bsdapp-clang/lib/librte_pmd_sfc_efx.a(sfc_tx.o)
sfc_rx_qflush_done                                /root/FreeBSD1201-64_K12.1_Clang8.0.1/x86_64-native-bsdapp-clang/a97f7ee35f494d71a9427a4273edff37/dpdk/x86_64-native-bsdapp-clang/lib/librte_pmd_sfc_efx.a(sfc_rx.o)
                                                  /root/FreeBSD1201-64_K12.1_Clang8.0.1/x86_64-native-bsdapp-clang/a97f7ee35f494d71a9427a4273edff37/dpdk/x86_64-native-bsdapp-clang/lib/librte_pmd_sfc_efx.a(sfc_ev.o)
sfc_rx_qflush_failed                              /root/FreeBSD1201-64_K12.1_Clang8.0.1/x86_64-native-bsdapp-clang/a97f7ee35f494d71a9427a4273edff37/dpdk/x86_64-native-bsdapp-clang/lib/librte_pmd_sfc_efx.a(sfc_rx.o)
                                                  /root/FreeBSD1201-64_K12.1_Clang8.0.1/x86_64-native-bsdapp-clang/a97f7ee35f494d71a9427a4273edff37/dpdk/x86_64-native-bsdapp-clang/lib/librte_pmd_sfc_efx.a(sfc_ev.o)
sfc_rxq_info_by_dp_rxq                            /root/FreeBSD1201-64_K12.1_Clang8.0.1/x86_64-native-bsdapp-clang/a97f7ee35f494d71a9427a4273edff37/dpdk/x86_64-native-bsdapp-clang/lib/librte_pmd_sfc_efx.a(sfc_rx.o)
                                                  /root/FreeBSD1201-64_K12.1_Clang8.0.1/x86_64-native-bsdapp-clang/a97f7ee35f494d71a9427a4273edff37/dpdk/x86_64-native-bsdapp-clang/lib/librte_pmd_sfc_efx.a(sfc_ev.o)
--
                                                  /root/FreeBSD1201-64_K12.1_Clang8.0.1/x86_64-native-bsdapp-clang/a97f7ee35f494d71a9427a4273edff37/dpdk/x86_64-native-bsdapp-clang/lib/librte_pmd_sfc_efx.a(efx_intr.o)
ef10_intr_enable                                  /root/FreeBSD1201-64_K12.1_Clang8.0.1/x86_64-native-bsdapp-clang/a97f7ee35f494d71a9427a4273edff37/dpdk/x86_64-native-bsdapp-clang/lib/librte_pmd_sfc_efx.a(ef10_intr.o)
                                                  /root/FreeBSD1201-64_K12.1_Clang8.0.1/x86_64-native-bsdapp-clang/a97f7ee35f494d71a9427a4273edff37/dpdk/x86_64-native-bsdapp-clang/lib/librte_pmd_sfc_efx.a(efx_intr.o)
ef10_intr_fatal                                   /root/FreeBSD1201-64_K12.1_Clang8.0.1/x86_64-native-bsdapp-clang/a97f7ee35f494d71a9427a4273edff37/dpdk/x86_64-native-bsdapp-clang/lib/librte_pmd_sfc_efx.a(ef10_intr.o)
                                                  /root/FreeBSD1201-64_K12.1_Clang8.0.1/x86_64-native-bsdapp-clang/a97f7ee35f494d71a9427a4273edff37/dpdk/x86_64-native-bsdapp-clang/lib/librte_pmd_sfc_efx.a(efx_intr.o)
ef10_intr_fini                                    /root/FreeBSD1201-64_K12.1_Clang8.0.1/x86_64-native-bsdapp-clang/a97f7ee35f494d71a9427a4273edff37/dpdk/x86_64-native-bsdapp-clang/lib/librte_pmd_sfc_efx.a(ef10_intr.o)
                                                  /root/FreeBSD1201-64_K12.1_Clang8.0.1/x86_64-native-bsdapp-clang/a97f7ee35f494d71a9427a4273edff37/dpdk/x86_64-native-bsdapp-clang/lib/librte_pmd_sfc_efx.a(efx_intr.o)
--
                                                  /root/FreeBSD1201-64_K12.1_Clang8.0.1/x86_64-native-bsdapp-clang/a97f7ee35f494d71a9427a4273edff37/dpdk/x86_64-native-bsdapp-clang/lib/librte_pmd_sfc_efx.a(sfc_intr.o)
efx_intr_enable                                   /root/FreeBSD1201-64_K12.1_Clang8.0.1/x86_64-native-bsdapp-clang/a97f7ee35f494d71a9427a4273edff37/dpdk/x86_64-native-bsdapp-clang/lib/librte_pmd_sfc_efx.a(efx_intr.o)
                                                  /root/FreeBSD1201-64_K12.1_Clang8.0.1/x86_64-native-bsdapp-clang/a97f7ee35f494d71a9427a4273edff37/dpdk/x86_64-native-bsdapp-clang/lib/librte_pmd_sfc_efx.a(sfc_intr.o)
efx_intr_fatal                                    /root/FreeBSD1201-64_K12.1_Clang8.0.1/x86_64-native-bsdapp-clang/a97f7ee35f494d71a9427a4273edff37/dpdk/x86_64-native-bsdapp-clang/lib/librte_pmd_sfc_efx.a(efx_intr.o)
                                                  /root/FreeBSD1201-64_K12.1_Clang8.0.1/x86_64-native-bsdapp-clang/a97f7ee35f494d71a9427a4273edff37/dpdk/x86_64-native-bsdapp-clang/lib/librte_pmd_sfc_efx.a(sfc_intr.o)
efx_intr_status_line                              /root/FreeBSD1201-64_K12.1_Clang8.0.1/x86_64-native-bsdapp-clang/a97f7ee35f494d71a9427a4273edff37/dpdk/x86_64-native-bsdapp-clang/lib/librte_pmd_sfc_efx.a(efx_intr.o)
                                                  /root/FreeBSD1201-64_K12.1_Clang8.0.1/x86_64-native-bsdapp-clang/a97f7ee35f494d71a9427a4273edff37/dpdk/x86_64-native-bsdapp-clang/lib/librte_pmd_sfc_efx.a(sfc_intr.o)
--
                                                  /root/FreeBSD1201-64_K12.1_Clang8.0.1/x86_64-native-bsdapp-clang/a97f7ee35f494d71a9427a4273edff37/dpdk/x86_64-native-bsdapp-clang/lib/librte_pmd_sfc_efx.a(sfc_tx.o)
sfc_rx_qflush_done                                /root/FreeBSD1201-64_K12.1_Clang8.0.1/x86_64-native-bsdapp-clang/a97f7ee35f494d71a9427a4273edff37/dpdk/x86_64-native-bsdapp-clang/lib/librte_pmd_sfc_efx.a(sfc_rx.o)
                                                  /root/FreeBSD1201-64_K12.1_Clang8.0.1/x86_64-native-bsdapp-clang/a97f7ee35f494d71a9427a4273edff37/dpdk/x86_64-native-bsdapp-clang/lib/librte_pmd_sfc_efx.a(sfc_ev.o)
sfc_rx_qflush_failed                              /root/FreeBSD1201-64_K12.1_Clang8.0.1/x86_64-native-bsdapp-clang/a97f7ee35f494d71a9427a4273edff37/dpdk/x86_64-native-bsdapp-clang/lib/librte_pmd_sfc_efx.a(sfc_rx.o)
                                                  /root/FreeBSD1201-64_K12.1_Clang8.0.1/x86_64-native-bsdapp-clang/a97f7ee35f494d71a9427a4273edff37/dpdk/x86_64-native-bsdapp-clang/lib/librte_pmd_sfc_efx.a(sfc_ev.o)
sfc_rxq_info_by_dp_rxq                            /root/FreeBSD1201-64_K12.1_Clang8.0.1/x86_64-native-bsdapp-clang/a97f7ee35f494d71a9427a4273edff37/dpdk/x86_64-native-bsdapp-clang/lib/librte_pmd_sfc_efx.a(sfc_rx.o)
                                                  /root/FreeBSD1201-64_K12.1_Clang8.0.1/x86_64-native-bsdapp-clang/a97f7ee35f494d71a9427a4273edff37/dpdk/x86_64-native-bsdapp-clang/lib/librte_pmd_sfc_efx.a(sfc_ev.o)
--
                                                  /root/FreeBSD1201-64_K12.1_Clang8.0.1/x86_64-native-bsdapp-clang/a97f7ee35f494d71a9427a4273edff37/dpdk/x86_64-native-bsdapp-clang/lib/librte_pmd_sfc_efx.a(efx_intr.o)
ef10_intr_enable                                  /root/FreeBSD1201-64_K12.1_Clang8.0.1/x86_64-native-bsdapp-clang/a97f7ee35f494d71a9427a4273edff37/dpdk/x86_64-native-bsdapp-clang/lib/librte_pmd_sfc_efx.a(ef10_intr.o)
                                                  /root/FreeBSD1201-64_K12.1_Clang8.0.1/x86_64-native-bsdapp-clang/a97f7ee35f494d71a9427a4273edff37/dpdk/x86_64-native-bsdapp-clang/lib/librte_pmd_sfc_efx.a(efx_intr.o)
ef10_intr_fatal                                   /root/FreeBSD1201-64_K12.1_Clang8.0.1/x86_64-native-bsdapp-clang/a97f7ee35f494d71a9427a4273edff37/dpdk/x86_64-native-bsdapp-clang/lib/librte_pmd_sfc_efx.a(ef10_intr.o)
                                                  /root/FreeBSD1201-64_K12.1_Clang8.0.1/x86_64-native-bsdapp-clang/a97f7ee35f494d71a9427a4273edff37/dpdk/x86_64-native-bsdapp-clang/lib/librte_pmd_sfc_efx.a(efx_intr.o)
ef10_intr_fini                                    /root/FreeBSD1201-64_K12.1_Clang8.0.1/x86_64-native-bsdapp-clang/a97f7ee35f494d71a9427a4273edff37/dpdk/x86_64-native-bsdapp-clang/lib/librte_pmd_sfc_efx.a(ef10_intr.o)
                                                  /root/FreeBSD1201-64_K12.1_Clang8.0.1/x86_64-native-bsdapp-clang/a97f7ee35f494d71a9427a4273edff37/dpdk/x86_64-native-bsdapp-clang/lib/librte_pmd_sfc_efx.a(efx_intr.o)
--
                                                  /root/FreeBSD1201-64_K12.1_Clang8.0.1/x86_64-native-bsdapp-clang/a97f7ee35f494d71a9427a4273edff37/dpdk/x86_64-native-bsdapp-clang/lib/librte_pmd_sfc_efx.a(sfc_intr.o)
efx_intr_enable                                   /root/FreeBSD1201-64_K12.1_Clang8.0.1/x86_64-native-bsdapp-clang/a97f7ee35f494d71a9427a4273edff37/dpdk/x86_64-native-bsdapp-clang/lib/librte_pmd_sfc_efx.a(efx_intr.o)
                                                  /root/FreeBSD1201-64_K12.1_Clang8.0.1/x86_64-native-bsdapp-clang/a97f7ee35f494d71a9427a4273edff37/dpdk/x86_64-native-bsdapp-clang/lib/librte_pmd_sfc_efx.a(sfc_intr.o)
efx_intr_fatal                                    /root/FreeBSD1201-64_K12.1_Clang8.0.1/x86_64-native-bsdapp-clang/a97f7ee35f494d71a9427a4273edff37/dpdk/x86_64-native-bsdapp-clang/lib/librte_pmd_sfc_efx.a(efx_intr.o)
                                                  /root/FreeBSD1201-64_K12.1_Clang8.0.1/x86_64-native-bsdapp-clang/a97f7ee35f494d71a9427a4273edff37/dpdk/x86_64-native-bsdapp-clang/lib/librte_pmd_sfc_efx.a(sfc_intr.o)
efx_intr_status_line                              /root/FreeBSD1201-64_K12.1_Clang8.0.1/x86_64-native-bsdapp-clang/a97f7ee35f494d71a9427a4273edff37/dpdk/x86_64-native-bsdapp-clang/lib/librte_pmd_sfc_efx.a(efx_intr.o)
                                                  /root/FreeBSD1201-64_K12.1_Clang8.0.1/x86_64-native-bsdapp-clang/a97f7ee35f494d71a9427a4273edff37/dpdk/x86_64-native-bsdapp-clang/lib/librte_pmd_sfc_efx.a(sfc_intr.o)
--
                                                  /root/FreeBSD1201-64_K12.1_Clang8.0.1/x86_64-native-bsdapp-clang/a97f7ee35f494d71a9427a4273edff37/dpdk/x86_64-native-bsdapp-clang/lib/librte_pmd_sfc_efx.a(sfc_tx.o)
sfc_rx_qflush_done                                /root/FreeBSD1201-64_K12.1_Clang8.0.1/x86_64-native-bsdapp-clang/a97f7ee35f494d71a9427a4273edff37/dpdk/x86_64-native-bsdapp-clang/lib/librte_pmd_sfc_efx.a(sfc_rx.o)
                                                  /root/FreeBSD1201-64_K12.1_Clang8.0.1/x86_64-native-bsdapp-clang/a97f7ee35f494d71a9427a4273edff37/dpdk/x86_64-native-bsdapp-clang/lib/librte_pmd_sfc_efx.a(sfc_ev.o)
sfc_rx_qflush_failed                              /root/FreeBSD1201-64_K12.1_Clang8.0.1/x86_64-native-bsdapp-clang/a97f7ee35f494d71a9427a4273edff37/dpdk/x86_64-native-bsdapp-clang/lib/librte_pmd_sfc_efx.a(sfc_rx.o)
                                                  /root/FreeBSD1201-64_K12.1_Clang8.0.1/x86_64-native-bsdapp-clang/a97f7ee35f494d71a9427a4273edff37/dpdk/x86_64-native-bsdapp-clang/lib/librte_pmd_sfc_efx.a(sfc_ev.o)
sfc_rxq_info_by_dp_rxq                            /root/FreeBSD1201-64_K12.1_Clang8.0.1/x86_64-native-bsdapp-clang/a97f7ee35f494d71a9427a4273edff37/dpdk/x86_64-native-bsdapp-clang/lib/librte_pmd_sfc_efx.a(sfc_rx.o)
                                                  /root/FreeBSD1201-64_K12.1_Clang8.0.1/x86_64-native-bsdapp-clang/a97f7ee35f494d71a9427a4273edff37/dpdk/x86_64-native-bsdapp-clang/lib/librte_pmd_sfc_efx.a(sfc_ev.o)
--
                                                  /root/FreeBSD1201-64_K12.1_Clang8.0.1/x86_64-native-bsdapp-clang/a97f7ee35f494d71a9427a4273edff37/dpdk/x86_64-native-bsdapp-clang/lib/librte_pmd_sfc_efx.a(efx_intr.o)
ef10_intr_enable                                  /root/FreeBSD1201-64_K12.1_Clang8.0.1/x86_64-native-bsdapp-clang/a97f7ee35f494d71a9427a4273edff37/dpdk/x86_64-native-bsdapp-clang/lib/librte_pmd_sfc_efx.a(ef10_intr.o)
                                                  /root/FreeBSD1201-64_K12.1_Clang8.0.1/x86_64-native-bsdapp-clang/a97f7ee35f494d71a9427a4273edff37/dpdk/x86_64-native-bsdapp-clang/lib/librte_pmd_sfc_efx.a(efx_intr.o)
ef10_intr_fatal                                   /root/FreeBSD1201-64_K12.1_Clang8.0.1/x86_64-native-bsdapp-clang/a97f7ee35f494d71a9427a4273edff37/dpdk/x86_64-native-bsdapp-clang/lib/librte_pmd_sfc_efx.a(ef10_intr.o)
                                                  /root/FreeBSD1201-64_K12.1_Clang8.0.1/x86_64-native-bsdapp-clang/a97f7ee35f494d71a9427a4273edff37/dpdk/x86_64-native-bsdapp-clang/lib/librte_pmd_sfc_efx.a(efx_intr.o)
ef10_intr_fini                                    /root/FreeBSD1201-64_K12.1_Clang8.0.1/x86_64-native-bsdapp-clang/a97f7ee35f494d71a9427a4273edff37/dpdk/x86_64-native-bsdapp-clang/lib/librte_pmd_sfc_efx.a(ef10_intr.o)
                                                  /root/FreeBSD1201-64_K12.1_Clang8.0.1/x86_64-native-bsdapp-clang/a97f7ee35f494d71a9427a4273edff37/dpdk/x86_64-native-bsdapp-clang/lib/librte_pmd_sfc_efx.a(efx_intr.o)
--
                                                  /root/FreeBSD1201-64_K12.1_Clang8.0.1/x86_64-native-bsdapp-clang/a97f7ee35f494d71a9427a4273edff37/dpdk/x86_64-native-bsdapp-clang/lib/librte_pmd_sfc_efx.a(sfc_intr.o)
efx_intr_enable                                   /root/FreeBSD1201-64_K12.1_Clang8.0.1/x86_64-native-bsdapp-clang/a97f7ee35f494d71a9427a4273edff37/dpdk/x86_64-native-bsdapp-clang/lib/librte_pmd_sfc_efx.a(efx_intr.o)
                                                  /root/FreeBSD1201-64_K12.1_Clang8.0.1/x86_64-native-bsdapp-clang/a97f7ee35f494d71a9427a4273edff37/dpdk/x86_64-native-bsdapp-clang/lib/librte_pmd_sfc_efx.a(sfc_intr.o)
efx_intr_fatal                                    /root/FreeBSD1201-64_K12.1_Clang8.0.1/x86_64-native-bsdapp-clang/a97f7ee35f494d71a9427a4273edff37/dpdk/x86_64-native-bsdapp-clang/lib/librte_pmd_sfc_efx.a(efx_intr.o)
                                                  /root/FreeBSD1201-64_K12.1_Clang8.0.1/x86_64-native-bsdapp-clang/a97f7ee35f494d71a9427a4273edff37/dpdk/x86_64-native-bsdapp-clang/lib/librte_pmd_sfc_efx.a(sfc_intr.o)
efx_intr_status_line                              /root/FreeBSD1201-64_K12.1_Clang8.0.1/x86_64-native-bsdapp-clang/a97f7ee35f494d71a9427a4273edff37/dpdk/x86_64-native-bsdapp-clang/lib/librte_pmd_sfc_efx.a(efx_intr.o)
                                                  /root/FreeBSD1201-64_K12.1_Clang8.0.1/x86_64-native-bsdapp-clang/a97f7ee35f494d71a9427a4273edff37/dpdk/x86_64-native-bsdapp-clang/lib/librte_pmd_sfc_efx.a(sfc_intr.o)
--
                                                  /root/FreeBSD1201-64_K12.1_Clang8.0.1/x86_64-native-bsdapp-clang/a97f7ee35f494d71a9427a4273edff37/dpdk/x86_64-native-bsdapp-clang/lib/librte_pmd_sfc_efx.a(sfc_tx.o)
sfc_rx_qflush_done                                /root/FreeBSD1201-64_K12.1_Clang8.0.1/x86_64-native-bsdapp-clang/a97f7ee35f494d71a9427a4273edff37/dpdk/x86_64-native-bsdapp-clang/lib/librte_pmd_sfc_efx.a(sfc_rx.o)
                                                  /root/FreeBSD1201-64_K12.1_Clang8.0.1/x86_64-native-bsdapp-clang/a97f7ee35f494d71a9427a4273edff37/dpdk/x86_64-native-bsdapp-clang/lib/librte_pmd_sfc_efx.a(sfc_ev.o)
sfc_rx_qflush_failed                              /root/FreeBSD1201-64_K12.1_Clang8.0.1/x86_64-native-bsdapp-clang/a97f7ee35f494d71a9427a4273edff37/dpdk/x86_64-native-bsdapp-clang/lib/librte_pmd_sfc_efx.a(sfc_rx.o)
                                                  /root/FreeBSD1201-64_K12.1_Clang8.0.1/x86_64-native-bsdapp-clang/a97f7ee35f494d71a9427a4273edff37/dpdk/x86_64-native-bsdapp-clang/lib/librte_pmd_sfc_efx.a(sfc_ev.o)
sfc_rxq_info_by_dp_rxq                            /root/FreeBSD1201-64_K12.1_Clang8.0.1/x86_64-native-bsdapp-clang/a97f7ee35f494d71a9427a4273edff37/dpdk/x86_64-native-bsdapp-clang/lib/librte_pmd_sfc_efx.a(sfc_rx.o)
                                                  /root/FreeBSD1201-64_K12.1_Clang8.0.1/x86_64-native-bsdapp-clang/a97f7ee35f494d71a9427a4273edff37/dpdk/x86_64-native-bsdapp-clang/lib/librte_pmd_sfc_efx.a(sfc_ev.o)
--
                                                  /root/FreeBSD1201-64_K12.1_Clang8.0.1/x86_64-native-bsdapp-clang/a97f7ee35f494d71a9427a4273edff37/dpdk/x86_64-native-bsdapp-clang/lib/librte_pmd_sfc_efx.a(efx_intr.o)
ef10_intr_enable                                  /root/FreeBSD1201-64_K12.1_Clang8.0.1/x86_64-native-bsdapp-clang/a97f7ee35f494d71a9427a4273edff37/dpdk/x86_64-native-bsdapp-clang/lib/librte_pmd_sfc_efx.a(ef10_intr.o)
                                                  /root/FreeBSD1201-64_K12.1_Clang8.0.1/x86_64-native-bsdapp-clang/a97f7ee35f494d71a9427a4273edff37/dpdk/x86_64-native-bsdapp-clang/lib/librte_pmd_sfc_efx.a(efx_intr.o)
ef10_intr_fatal                                   /root/FreeBSD1201-64_K12.1_Clang8.0.1/x86_64-native-bsdapp-clang/a97f7ee35f494d71a9427a4273edff37/dpdk/x86_64-native-bsdapp-clang/lib/librte_pmd_sfc_efx.a(ef10_intr.o)
                                                  /root/FreeBSD1201-64_K12.1_Clang8.0.1/x86_64-native-bsdapp-clang/a97f7ee35f494d71a9427a4273edff37/dpdk/x86_64-native-bsdapp-clang/lib/librte_pmd_sfc_efx.a(efx_intr.o)
ef10_intr_fini                                    /root/FreeBSD1201-64_K12.1_Clang8.0.1/x86_64-native-bsdapp-clang/a97f7ee35f494d71a9427a4273edff37/dpdk/x86_64-native-bsdapp-clang/lib/librte_pmd_sfc_efx.a(ef10_intr.o)
                                                  /root/FreeBSD1201-64_K12.1_Clang8.0.1/x86_64-native-bsdapp-clang/a97f7ee35f494d71a9427a4273edff37/dpdk/x86_64-native-bsdapp-clang/lib/librte_pmd_sfc_efx.a(efx_intr.o)
--
                                                  /root/FreeBSD1201-64_K12.1_Clang8.0.1/x86_64-native-bsdapp-clang/a97f7ee35f494d71a9427a4273edff37/dpdk/x86_64-native-bsdapp-clang/lib/librte_pmd_sfc_efx.a(sfc_intr.o)
efx_intr_enable                                   /root/FreeBSD1201-64_K12.1_Clang8.0.1/x86_64-native-bsdapp-clang/a97f7ee35f494d71a9427a4273edff37/dpdk/x86_64-native-bsdapp-clang/lib/librte_pmd_sfc_efx.a(efx_intr.o)
                                                  /root/FreeBSD1201-64_K12.1_Clang8.0.1/x86_64-native-bsdapp-clang/a97f7ee35f494d71a9427a4273edff37/dpdk/x86_64-native-bsdapp-clang/lib/librte_pmd_sfc_efx.a(sfc_intr.o)
efx_intr_fatal                                    /root/FreeBSD1201-64_K12.1_Clang8.0.1/x86_64-native-bsdapp-clang/a97f7ee35f494d71a9427a4273edff37/dpdk/x86_64-native-bsdapp-clang/lib/librte_pmd_sfc_efx.a(efx_intr.o)
                                                  /root/FreeBSD1201-64_K12.1_Clang8.0.1/x86_64-native-bsdapp-clang/a97f7ee35f494d71a9427a4273edff37/dpdk/x86_64-native-bsdapp-clang/lib/librte_pmd_sfc_efx.a(sfc_intr.o)
efx_intr_status_line                              /root/FreeBSD1201-64_K12.1_Clang8.0.1/x86_64-native-bsdapp-clang/a97f7ee35f494d71a9427a4273edff37/dpdk/x86_64-native-bsdapp-clang/lib/librte_pmd_sfc_efx.a(efx_intr.o)
                                                  /root/FreeBSD1201-64_K12.1_Clang8.0.1/x86_64-native-bsdapp-clang/a97f7ee35f494d71a9427a4273edff37/dpdk/x86_64-native-bsdapp-clang/lib/librte_pmd_sfc_efx.a(sfc_intr.o)
--
                                                  /root/FreeBSD1201-64_K12.1_Clang8.0.1/x86_64-native-bsdapp-clang/a97f7ee35f494d71a9427a4273edff37/dpdk/x86_64-native-bsdapp-clang/lib/librte_pmd_sfc_efx.a(sfc_tx.o)
sfc_rx_qflush_done                                /root/FreeBSD1201-64_K12.1_Clang8.0.1/x86_64-native-bsdapp-clang/a97f7ee35f494d71a9427a4273edff37/dpdk/x86_64-native-bsdapp-clang/lib/librte_pmd_sfc_efx.a(sfc_rx.o)
                                                  /root/FreeBSD1201-64_K12.1_Clang8.0.1/x86_64-native-bsdapp-clang/a97f7ee35f494d71a9427a4273edff37/dpdk/x86_64-native-bsdapp-clang/lib/librte_pmd_sfc_efx.a(sfc_ev.o)
sfc_rx_qflush_failed                              /root/FreeBSD1201-64_K12.1_Clang8.0.1/x86_64-native-bsdapp-clang/a97f7ee35f494d71a9427a4273edff37/dpdk/x86_64-native-bsdapp-clang/lib/librte_pmd_sfc_efx.a(sfc_rx.o)
                                                  /root/FreeBSD1201-64_K12.1_Clang8.0.1/x86_64-native-bsdapp-clang/a97f7ee35f494d71a9427a4273edff37/dpdk/x86_64-native-bsdapp-clang/lib/librte_pmd_sfc_efx.a(sfc_ev.o)
sfc_rxq_info_by_dp_rxq                            /root/FreeBSD1201-64_K12.1_Clang8.0.1/x86_64-native-bsdapp-clang/a97f7ee35f494d71a9427a4273edff37/dpdk/x86_64-native-bsdapp-clang/lib/librte_pmd_sfc_efx.a(sfc_rx.o)
                                                  /root/FreeBSD1201-64_K12.1_Clang8.0.1/x86_64-native-bsdapp-clang/a97f7ee35f494d71a9427a4273edff37/dpdk/x86_64-native-bsdapp-clang/lib/librte_pmd_sfc_efx.a(sfc_ev.o)
--
                                                  /root/FreeBSD1201-64_K12.1_Clang8.0.1/x86_64-native-bsdapp-clang/a97f7ee35f494d71a9427a4273edff37/dpdk/x86_64-native-bsdapp-clang/lib/librte_pmd_sfc_efx.a(efx_intr.o)
ef10_intr_enable                                  /root/FreeBSD1201-64_K12.1_Clang8.0.1/x86_64-native-bsdapp-clang/a97f7ee35f494d71a9427a4273edff37/dpdk/x86_64-native-bsdapp-clang/lib/librte_pmd_sfc_efx.a(ef10_intr.o)
                                                  /root/FreeBSD1201-64_K12.1_Clang8.0.1/x86_64-native-bsdapp-clang/a97f7ee35f494d71a9427a4273edff37/dpdk/x86_64-native-bsdapp-clang/lib/librte_pmd_sfc_efx.a(efx_intr.o)
ef10_intr_fatal                                   /root/FreeBSD1201-64_K12.1_Clang8.0.1/x86_64-native-bsdapp-clang/a97f7ee35f494d71a9427a4273edff37/dpdk/x86_64-native-bsdapp-clang/lib/librte_pmd_sfc_efx.a(ef10_intr.o)
                                                  /root/FreeBSD1201-64_K12.1_Clang8.0.1/x86_64-native-bsdapp-clang/a97f7ee35f494d71a9427a4273edff37/dpdk/x86_64-native-bsdapp-clang/lib/librte_pmd_sfc_efx.a(efx_intr.o)
ef10_intr_fini                                    /root/FreeBSD1201-64_K12.1_Clang8.0.1/x86_64-native-bsdapp-clang/a97f7ee35f494d71a9427a4273edff37/dpdk/x86_64-native-bsdapp-clang/lib/librte_pmd_sfc_efx.a(ef10_intr.o)
                                                  /root/FreeBSD1201-64_K12.1_Clang8.0.1/x86_64-native-bsdapp-clang/a97f7ee35f494d71a9427a4273edff37/dpdk/x86_64-native-bsdapp-clang/lib/librte_pmd_sfc_efx.a(efx_intr.o)
--
                                                  /root/FreeBSD1201-64_K12.1_Clang8.0.1/x86_64-native-bsdapp-clang/a97f7ee35f494d71a9427a4273edff37/dpdk/x86_64-native-bsdapp-clang/lib/librte_pmd_sfc_efx.a(sfc_intr.o)
efx_intr_enable                                   /root/FreeBSD1201-64_K12.1_Clang8.0.1/x86_64-native-bsdapp-clang/a97f7ee35f494d71a9427a4273edff37/dpdk/x86_64-native-bsdapp-clang/lib/librte_pmd_sfc_efx.a(efx_intr.o)
                                                  /root/FreeBSD1201-64_K12.1_Clang8.0.1/x86_64-native-bsdapp-clang/a97f7ee35f494d71a9427a4273edff37/dpdk/x86_64-native-bsdapp-clang/lib/librte_pmd_sfc_efx.a(sfc_intr.o)
efx_intr_fatal                                    /root/FreeBSD1201-64_K12.1_Clang8.0.1/x86_64-native-bsdapp-clang/a97f7ee35f494d71a9427a4273edff37/dpdk/x86_64-native-bsdapp-clang/lib/librte_pmd_sfc_efx.a(efx_intr.o)
                                                  /root/FreeBSD1201-64_K12.1_Clang8.0.1/x86_64-native-bsdapp-clang/a97f7ee35f494d71a9427a4273edff37/dpdk/x86_64-native-bsdapp-clang/lib/librte_pmd_sfc_efx.a(sfc_intr.o)
efx_intr_status_line                              /root/FreeBSD1201-64_K12.1_Clang8.0.1/x86_64-native-bsdapp-clang/a97f7ee35f494d71a9427a4273edff37/dpdk/x86_64-native-bsdapp-clang/lib/librte_pmd_sfc_efx.a(efx_intr.o)
                                                  /root/FreeBSD1201-64_K12.1_Clang8.0.1/x86_64-native-bsdapp-clang/a97f7ee35f494d71a9427a4273edff37/dpdk/x86_64-native-bsdapp-clang/lib/librte_pmd_sfc_efx.a(sfc_intr.o)
--
                                                  /root/FreeBSD1201-64_K12.1_Clang8.0.1/x86_64-native-bsdapp-clang/a97f7ee35f494d71a9427a4273edff37/dpdk/x86_64-native-bsdapp-clang/lib/librte_pmd_sfc_efx.a(sfc_tx.o)
sfc_rx_qflush_done                                /root/FreeBSD1201-64_K12.1_Clang8.0.1/x86_64-native-bsdapp-clang/a97f7ee35f494d71a9427a4273edff37/dpdk/x86_64-native-bsdapp-clang/lib/librte_pmd_sfc_efx.a(sfc_rx.o)
                                                  /root/FreeBSD1201-64_K12.1_Clang8.0.1/x86_64-native-bsdapp-clang/a97f7ee35f494d71a9427a4273edff37/dpdk/x86_64-native-bsdapp-clang/lib/librte_pmd_sfc_efx.a(sfc_ev.o)
sfc_rx_qflush_failed                              /root/FreeBSD1201-64_K12.1_Clang8.0.1/x86_64-native-bsdapp-clang/a97f7ee35f494d71a9427a4273edff37/dpdk/x86_64-native-bsdapp-clang/lib/librte_pmd_sfc_efx.a(sfc_rx.o)
                                                  /root/FreeBSD1201-64_K12.1_Clang8.0.1/x86_64-native-bsdapp-clang/a97f7ee35f494d71a9427a4273edff37/dpdk/x86_64-native-bsdapp-clang/lib/librte_pmd_sfc_efx.a(sfc_ev.o)
sfc_rxq_info_by_dp_rxq                            /root/FreeBSD1201-64_K12.1_Clang8.0.1/x86_64-native-bsdapp-clang/a97f7ee35f494d71a9427a4273edff37/dpdk/x86_64-native-bsdapp-clang/lib/librte_pmd_sfc_efx.a(sfc_rx.o)
                                                  /root/FreeBSD1201-64_K12.1_Clang8.0.1/x86_64-native-bsdapp-clang/a97f7ee35f494d71a9427a4273edff37/dpdk/x86_64-native-bsdapp-clang/lib/librte_pmd_sfc_efx.a(sfc_ev.o)
--
                                                  /root/FreeBSD1201-64_K12.1_Clang8.0.1/x86_64-native-bsdapp-clang/a97f7ee35f494d71a9427a4273edff37/dpdk/x86_64-native-bsdapp-clang/lib/librte_pmd_sfc_efx.a(efx_intr.o)
ef10_intr_enable                                  /root/FreeBSD1201-64_K12.1_Clang8.0.1/x86_64-native-bsdapp-clang/a97f7ee35f494d71a9427a4273edff37/dpdk/x86_64-native-bsdapp-clang/lib/librte_pmd_sfc_efx.a(ef10_intr.o)
                                                  /root/FreeBSD1201-64_K12.1_Clang8.0.1/x86_64-native-bsdapp-clang/a97f7ee35f494d71a9427a4273edff37/dpdk/x86_64-native-bsdapp-clang/lib/librte_pmd_sfc_efx.a(efx_intr.o)
ef10_intr_fatal                                   /root/FreeBSD1201-64_K12.1_Clang8.0.1/x86_64-native-bsdapp-clang/a97f7ee35f494d71a9427a4273edff37/dpdk/x86_64-native-bsdapp-clang/lib/librte_pmd_sfc_efx.a(ef10_intr.o)
                                                  /root/FreeBSD1201-64_K12.1_Clang8.0.1/x86_64-native-bsdapp-clang/a97f7ee35f494d71a9427a4273edff37/dpdk/x86_64-native-bsdapp-clang/lib/librte_pmd_sfc_efx.a(efx_intr.o)
ef10_intr_fini                                    /root/FreeBSD1201-64_K12.1_Clang8.0.1/x86_64-native-bsdapp-clang/a97f7ee35f494d71a9427a4273edff37/dpdk/x86_64-native-bsdapp-clang/lib/librte_pmd_sfc_efx.a(ef10_intr.o)
                                                  /root/FreeBSD1201-64_K12.1_Clang8.0.1/x86_64-native-bsdapp-clang/a97f7ee35f494d71a9427a4273edff37/dpdk/x86_64-native-bsdapp-clang/lib/librte_pmd_sfc_efx.a(efx_intr.o)
--
                                                  /root/FreeBSD1201-64_K12.1_Clang8.0.1/x86_64-native-bsdapp-clang/a97f7ee35f494d71a9427a4273edff37/dpdk/x86_64-native-bsdapp-clang/lib/librte_pmd_sfc_efx.a(sfc_intr.o)
efx_intr_enable                                   /root/FreeBSD1201-64_K12.1_Clang8.0.1/x86_64-native-bsdapp-clang/a97f7ee35f494d71a9427a4273edff37/dpdk/x86_64-native-bsdapp-clang/lib/librte_pmd_sfc_efx.a(efx_intr.o)
                                                  /root/FreeBSD1201-64_K12.1_Clang8.0.1/x86_64-native-bsdapp-clang/a97f7ee35f494d71a9427a4273edff37/dpdk/x86_64-native-bsdapp-clang/lib/librte_pmd_sfc_efx.a(sfc_intr.o)
efx_intr_fatal                                    /root/FreeBSD1201-64_K12.1_Clang8.0.1/x86_64-native-bsdapp-clang/a97f7ee35f494d71a9427a4273edff37/dpdk/x86_64-native-bsdapp-clang/lib/librte_pmd_sfc_efx.a(efx_intr.o)
                                                  /root/FreeBSD1201-64_K12.1_Clang8.0.1/x86_64-native-bsdapp-clang/a97f7ee35f494d71a9427a4273edff37/dpdk/x86_64-native-bsdapp-clang/lib/librte_pmd_sfc_efx.a(sfc_intr.o)
efx_intr_status_line                              /root/FreeBSD1201-64_K12.1_Clang8.0.1/x86_64-native-bsdapp-clang/a97f7ee35f494d71a9427a4273edff37/dpdk/x86_64-native-bsdapp-clang/lib/librte_pmd_sfc_efx.a(efx_intr.o)
                                                  /root/FreeBSD1201-64_K12.1_Clang8.0.1/x86_64-native-bsdapp-clang/a97f7ee35f494d71a9427a4273edff37/dpdk/x86_64-native-bsdapp-clang/lib/librte_pmd_sfc_efx.a(sfc_intr.o)
--
                                                  /root/FreeBSD1201-64_K12.1_Clang8.0.1/x86_64-native-bsdapp-clang/a97f7ee35f494d71a9427a4273edff37/dpdk/x86_64-native-bsdapp-clang/lib/librte_pmd_sfc_efx.a(sfc_tx.o)
sfc_rx_qflush_done                                /root/FreeBSD1201-64_K12.1_Clang8.0.1/x86_64-native-bsdapp-clang/a97f7ee35f494d71a9427a4273edff37/dpdk/x86_64-native-bsdapp-clang/lib/librte_pmd_sfc_efx.a(sfc_rx.o)
                                                  /root/FreeBSD1201-64_K12.1_Clang8.0.1/x86_64-native-bsdapp-clang/a97f7ee35f494d71a9427a4273edff37/dpdk/x86_64-native-bsdapp-clang/lib/librte_pmd_sfc_efx.a(sfc_ev.o)
sfc_rx_qflush_failed                              /root/FreeBSD1201-64_K12.1_Clang8.0.1/x86_64-native-bsdapp-clang/a97f7ee35f494d71a9427a4273edff37/dpdk/x86_64-native-bsdapp-clang/lib/librte_pmd_sfc_efx.a(sfc_rx.o)
                                                  /root/FreeBSD1201-64_K12.1_Clang8.0.1/x86_64-native-bsdapp-clang/a97f7ee35f494d71a9427a4273edff37/dpdk/x86_64-native-bsdapp-clang/lib/librte_pmd_sfc_efx.a(sfc_ev.o)
sfc_rxq_info_by_dp_rxq                            /root/FreeBSD1201-64_K12.1_Clang8.0.1/x86_64-native-bsdapp-clang/a97f7ee35f494d71a9427a4273edff37/dpdk/x86_64-native-bsdapp-clang/lib/librte_pmd_sfc_efx.a(sfc_rx.o)
                                                  /root/FreeBSD1201-64_K12.1_Clang8.0.1/x86_64-native-bsdapp-clang/a97f7ee35f494d71a9427a4273edff37/dpdk/x86_64-native-bsdapp-clang/lib/librte_pmd_sfc_efx.a(sfc_ev.o)
--
                                                  /root/FreeBSD1201-64_K12.1_Clang8.0.1/x86_64-native-bsdapp-clang/a97f7ee35f494d71a9427a4273edff37/dpdk/x86_64-native-bsdapp-clang/lib/librte_pmd_sfc_efx.a(efx_intr.o)
ef10_intr_enable                                  /root/FreeBSD1201-64_K12.1_Clang8.0.1/x86_64-native-bsdapp-clang/a97f7ee35f494d71a9427a4273edff37/dpdk/x86_64-native-bsdapp-clang/lib/librte_pmd_sfc_efx.a(ef10_intr.o)
                                                  /root/FreeBSD1201-64_K12.1_Clang8.0.1/x86_64-native-bsdapp-clang/a97f7ee35f494d71a9427a4273edff37/dpdk/x86_64-native-bsdapp-clang/lib/librte_pmd_sfc_efx.a(efx_intr.o)
ef10_intr_fatal                                   /root/FreeBSD1201-64_K12.1_Clang8.0.1/x86_64-native-bsdapp-clang/a97f7ee35f494d71a9427a4273edff37/dpdk/x86_64-native-bsdapp-clang/lib/librte_pmd_sfc_efx.a(ef10_intr.o)
                                                  /root/FreeBSD1201-64_K12.1_Clang8.0.1/x86_64-native-bsdapp-clang/a97f7ee35f494d71a9427a4273edff37/dpdk/x86_64-native-bsdapp-clang/lib/librte_pmd_sfc_efx.a(efx_intr.o)
ef10_intr_fini                                    /root/FreeBSD1201-64_K12.1_Clang8.0.1/x86_64-native-bsdapp-clang/a97f7ee35f494d71a9427a4273edff37/dpdk/x86_64-native-bsdapp-clang/lib/librte_pmd_sfc_efx.a(ef10_intr.o)
                                                  /root/FreeBSD1201-64_K12.1_Clang8.0.1/x86_64-native-bsdapp-clang/a97f7ee35f494d71a9427a4273edff37/dpdk/x86_64-native-bsdapp-clang/lib/librte_pmd_sfc_efx.a(efx_intr.o)
--
                                                  /root/FreeBSD1201-64_K12.1_Clang8.0.1/x86_64-native-bsdapp-clang/a97f7ee35f494d71a9427a4273edff37/dpdk/x86_64-native-bsdapp-clang/lib/librte_pmd_sfc_efx.a(sfc_intr.o)
efx_intr_enable                                   /root/FreeBSD1201-64_K12.1_Clang8.0.1/x86_64-native-bsdapp-clang/a97f7ee35f494d71a9427a4273edff37/dpdk/x86_64-native-bsdapp-clang/lib/librte_pmd_sfc_efx.a(efx_intr.o)
                                                  /root/FreeBSD1201-64_K12.1_Clang8.0.1/x86_64-native-bsdapp-clang/a97f7ee35f494d71a9427a4273edff37/dpdk/x86_64-native-bsdapp-clang/lib/librte_pmd_sfc_efx.a(sfc_intr.o)
efx_intr_fatal                                    /root/FreeBSD1201-64_K12.1_Clang8.0.1/x86_64-native-bsdapp-clang/a97f7ee35f494d71a9427a4273edff37/dpdk/x86_64-native-bsdapp-clang/lib/librte_pmd_sfc_efx.a(efx_intr.o)
                                                  /root/FreeBSD1201-64_K12.1_Clang8.0.1/x86_64-native-bsdapp-clang/a97f7ee35f494d71a9427a4273edff37/dpdk/x86_64-native-bsdapp-clang/lib/librte_pmd_sfc_efx.a(sfc_intr.o)
efx_intr_status_line                              /root/FreeBSD1201-64_K12.1_Clang8.0.1/x86_64-native-bsdapp-clang/a97f7ee35f494d71a9427a4273edff37/dpdk/x86_64-native-bsdapp-clang/lib/librte_pmd_sfc_efx.a(efx_intr.o)
                                                  /root/FreeBSD1201-64_K12.1_Clang8.0.1/x86_64-native-bsdapp-clang/a97f7ee35f494d71a9427a4273edff37/dpdk/x86_64-native-bsdapp-clang/lib/librte_pmd_sfc_efx.a(sfc_intr.o)
--
                                                  /root/FreeBSD1201-64_K12.1_Clang8.0.1/x86_64-native-bsdapp-clang/a97f7ee35f494d71a9427a4273edff37/dpdk/x86_64-native-bsdapp-clang/lib/librte_pmd_sfc_efx.a(sfc_tx.o)
sfc_rx_qflush_done                                /root/FreeBSD1201-64_K12.1_Clang8.0.1/x86_64-native-bsdapp-clang/a97f7ee35f494d71a9427a4273edff37/dpdk/x86_64-native-bsdapp-clang/lib/librte_pmd_sfc_efx.a(sfc_rx.o)
                                                  /root/FreeBSD1201-64_K12.1_Clang8.0.1/x86_64-native-bsdapp-clang/a97f7ee35f494d71a9427a4273edff37/dpdk/x86_64-native-bsdapp-clang/lib/librte_pmd_sfc_efx.a(sfc_ev.o)
sfc_rx_qflush_failed                              /root/FreeBSD1201-64_K12.1_Clang8.0.1/x86_64-native-bsdapp-clang/a97f7ee35f494d71a9427a4273edff37/dpdk/x86_64-native-bsdapp-clang/lib/librte_pmd_sfc_efx.a(sfc_rx.o)
                                                  /root/FreeBSD1201-64_K12.1_Clang8.0.1/x86_64-native-bsdapp-clang/a97f7ee35f494d71a9427a4273edff37/dpdk/x86_64-native-bsdapp-clang/lib/librte_pmd_sfc_efx.a(sfc_ev.o)
sfc_rxq_info_by_dp_rxq                            /root/FreeBSD1201-64_K12.1_Clang8.0.1/x86_64-native-bsdapp-clang/a97f7ee35f494d71a9427a4273edff37/dpdk/x86_64-native-bsdapp-clang/lib/librte_pmd_sfc_efx.a(sfc_rx.o)
                                                  /root/FreeBSD1201-64_K12.1_Clang8.0.1/x86_64-native-bsdapp-clang/a97f7ee35f494d71a9427a4273edff37/dpdk/x86_64-native-bsdapp-clang/lib/librte_pmd_sfc_efx.a(sfc_ev.o)
--
                                                  /root/FreeBSD1201-64_K12.1_Clang8.0.1/x86_64-native-bsdapp-clang/a97f7ee35f494d71a9427a4273edff37/dpdk/x86_64-native-bsdapp-clang/lib/librte_pmd_sfc_efx.a(efx_intr.o)
ef10_intr_enable                                  /root/FreeBSD1201-64_K12.1_Clang8.0.1/x86_64-native-bsdapp-clang/a97f7ee35f494d71a9427a4273edff37/dpdk/x86_64-native-bsdapp-clang/lib/librte_pmd_sfc_efx.a(ef10_intr.o)
                                                  /root/FreeBSD1201-64_K12.1_Clang8.0.1/x86_64-native-bsdapp-clang/a97f7ee35f494d71a9427a4273edff37/dpdk/x86_64-native-bsdapp-clang/lib/librte_pmd_sfc_efx.a(efx_intr.o)
ef10_intr_fatal                                   /root/FreeBSD1201-64_K12.1_Clang8.0.1/x86_64-native-bsdapp-clang/a97f7ee35f494d71a9427a4273edff37/dpdk/x86_64-native-bsdapp-clang/lib/librte_pmd_sfc_efx.a(ef10_intr.o)
                                                  /root/FreeBSD1201-64_K12.1_Clang8.0.1/x86_64-native-bsdapp-clang/a97f7ee35f494d71a9427a4273edff37/dpdk/x86_64-native-bsdapp-clang/lib/librte_pmd_sfc_efx.a(efx_intr.o)
ef10_intr_fini                                    /root/FreeBSD1201-64_K12.1_Clang8.0.1/x86_64-native-bsdapp-clang/a97f7ee35f494d71a9427a4273edff37/dpdk/x86_64-native-bsdapp-clang/lib/librte_pmd_sfc_efx.a(ef10_intr.o)
                                                  /root/FreeBSD1201-64_K12.1_Clang8.0.1/x86_64-native-bsdapp-clang/a97f7ee35f494d71a9427a4273edff37/dpdk/x86_64-native-bsdapp-clang/lib/librte_pmd_sfc_efx.a(efx_intr.o)
--
                                                  /root/FreeBSD1201-64_K12.1_Clang8.0.1/x86_64-native-bsdapp-clang/a97f7ee35f494d71a9427a4273edff37/dpdk/x86_64-native-bsdapp-clang/lib/librte_pmd_sfc_efx.a(sfc_intr.o)
efx_intr_enable                                   /root/FreeBSD1201-64_K12.1_Clang8.0.1/x86_64-native-bsdapp-clang/a97f7ee35f494d71a9427a4273edff37/dpdk/x86_64-native-bsdapp-clang/lib/librte_pmd_sfc_efx.a(efx_intr.o)
                                                  /root/FreeBSD1201-64_K12.1_Clang8.0.1/x86_64-native-bsdapp-clang/a97f7ee35f494d71a9427a4273edff37/dpdk/x86_64-native-bsdapp-clang/lib/librte_pmd_sfc_efx.a(sfc_intr.o)
efx_intr_fatal                                    /root/FreeBSD1201-64_K12.1_Clang8.0.1/x86_64-native-bsdapp-clang/a97f7ee35f494d71a9427a4273edff37/dpdk/x86_64-native-bsdapp-clang/lib/librte_pmd_sfc_efx.a(efx_intr.o)
                                                  /root/FreeBSD1201-64_K12.1_Clang8.0.1/x86_64-native-bsdapp-clang/a97f7ee35f494d71a9427a4273edff37/dpdk/x86_64-native-bsdapp-clang/lib/librte_pmd_sfc_efx.a(sfc_intr.o)
efx_intr_status_line                              /root/FreeBSD1201-64_K12.1_Clang8.0.1/x86_64-native-bsdapp-clang/a97f7ee35f494d71a9427a4273edff37/dpdk/x86_64-native-bsdapp-clang/lib/librte_pmd_sfc_efx.a(efx_intr.o)
                                                  /root/FreeBSD1201-64_K12.1_Clang8.0.1/x86_64-native-bsdapp-clang/a97f7ee35f494d71a9427a4273edff37/dpdk/x86_64-native-bsdapp-clang/lib/librte_pmd_sfc_efx.a(sfc_intr.o)
--
                                                  /root/FreeBSD1201-64_K12.1_Clang8.0.1/x86_64-native-bsdapp-clang/a97f7ee35f494d71a9427a4273edff37/dpdk/x86_64-native-bsdapp-clang/lib/librte_pmd_sfc_efx.a(sfc_tx.o)
sfc_rx_qflush_done                                /root/FreeBSD1201-64_K12.1_Clang8.0.1/x86_64-native-bsdapp-clang/a97f7ee35f494d71a9427a4273edff37/dpdk/x86_64-native-bsdapp-clang/lib/librte_pmd_sfc_efx.a(sfc_rx.o)
                                                  /root/FreeBSD1201-64_K12.1_Clang8.0.1/x86_64-native-bsdapp-clang/a97f7ee35f494d71a9427a4273edff37/dpdk/x86_64-native-bsdapp-clang/lib/librte_pmd_sfc_efx.a(sfc_ev.o)
sfc_rx_qflush_failed                              /root/FreeBSD1201-64_K12.1_Clang8.0.1/x86_64-native-bsdapp-clang/a97f7ee35f494d71a9427a4273edff37/dpdk/x86_64-native-bsdapp-clang/lib/librte_pmd_sfc_efx.a(sfc_rx.o)
                                                  /root/FreeBSD1201-64_K12.1_Clang8.0.1/x86_64-native-bsdapp-clang/a97f7ee35f494d71a9427a4273edff37/dpdk/x86_64-native-bsdapp-clang/lib/librte_pmd_sfc_efx.a(sfc_ev.o)
sfc_rxq_info_by_dp_rxq                            /root/FreeBSD1201-64_K12.1_Clang8.0.1/x86_64-native-bsdapp-clang/a97f7ee35f494d71a9427a4273edff37/dpdk/x86_64-native-bsdapp-clang/lib/librte_pmd_sfc_efx.a(sfc_rx.o)
                                                  /root/FreeBSD1201-64_K12.1_Clang8.0.1/x86_64-native-bsdapp-clang/a97f7ee35f494d71a9427a4273edff37/dpdk/x86_64-native-bsdapp-clang/lib/librte_pmd_sfc_efx.a(sfc_ev.o)
--
                                                  /root/FreeBSD1201-64_K12.1_Clang8.0.1/x86_64-native-bsdapp-clang/a97f7ee35f494d71a9427a4273edff37/dpdk/x86_64-native-bsdapp-clang/lib/librte_pmd_sfc_efx.a(efx_intr.o)
ef10_intr_enable                                  /root/FreeBSD1201-64_K12.1_Clang8.0.1/x86_64-native-bsdapp-clang/a97f7ee35f494d71a9427a4273edff37/dpdk/x86_64-native-bsdapp-clang/lib/librte_pmd_sfc_efx.a(ef10_intr.o)
                                                  /root/FreeBSD1201-64_K12.1_Clang8.0.1/x86_64-native-bsdapp-clang/a97f7ee35f494d71a9427a4273edff37/dpdk/x86_64-native-bsdapp-clang/lib/librte_pmd_sfc_efx.a(efx_intr.o)
ef10_intr_fatal                                   /root/FreeBSD1201-64_K12.1_Clang8.0.1/x86_64-native-bsdapp-clang/a97f7ee35f494d71a9427a4273edff37/dpdk/x86_64-native-bsdapp-clang/lib/librte_pmd_sfc_efx.a(ef10_intr.o)
                                                  /root/FreeBSD1201-64_K12.1_Clang8.0.1/x86_64-native-bsdapp-clang/a97f7ee35f494d71a9427a4273edff37/dpdk/x86_64-native-bsdapp-clang/lib/librte_pmd_sfc_efx.a(efx_intr.o)
ef10_intr_fini                                    /root/FreeBSD1201-64_K12.1_Clang8.0.1/x86_64-native-bsdapp-clang/a97f7ee35f494d71a9427a4273edff37/dpdk/x86_64-native-bsdapp-clang/lib/librte_pmd_sfc_efx.a(ef10_intr.o)
                                                  /root/FreeBSD1201-64_K12.1_Clang8.0.1/x86_64-native-bsdapp-clang/a97f7ee35f494d71a9427a4273edff37/dpdk/x86_64-native-bsdapp-clang/lib/librte_pmd_sfc_efx.a(efx_intr.o)
--
                                                  /root/FreeBSD1201-64_K12.1_Clang8.0.1/x86_64-native-bsdapp-clang/a97f7ee35f494d71a9427a4273edff37/dpdk/x86_64-native-bsdapp-clang/lib/librte_pmd_sfc_efx.a(sfc_intr.o)
efx_intr_enable                                   /root/FreeBSD1201-64_K12.1_Clang8.0.1/x86_64-native-bsdapp-clang/a97f7ee35f494d71a9427a4273edff37/dpdk/x86_64-native-bsdapp-clang/lib/librte_pmd_sfc_efx.a(efx_intr.o)
                                                  /root/FreeBSD1201-64_K12.1_Clang8.0.1/x86_64-native-bsdapp-clang/a97f7ee35f494d71a9427a4273edff37/dpdk/x86_64-native-bsdapp-clang/lib/librte_pmd_sfc_efx.a(sfc_intr.o)
efx_intr_fatal                                    /root/FreeBSD1201-64_K12.1_Clang8.0.1/x86_64-native-bsdapp-clang/a97f7ee35f494d71a9427a4273edff37/dpdk/x86_64-native-bsdapp-clang/lib/librte_pmd_sfc_efx.a(efx_intr.o)
                                                  /root/FreeBSD1201-64_K12.1_Clang8.0.1/x86_64-native-bsdapp-clang/a97f7ee35f494d71a9427a4273edff37/dpdk/x86_64-native-bsdapp-clang/lib/librte_pmd_sfc_efx.a(sfc_intr.o)
efx_intr_status_line                              /root/FreeBSD1201-64_K12.1_Clang8.0.1/x86_64-native-bsdapp-clang/a97f7ee35f494d71a9427a4273edff37/dpdk/x86_64-native-bsdapp-clang/lib/librte_pmd_sfc_efx.a(efx_intr.o)
                                                  /root/FreeBSD1201-64_K12.1_Clang8.0.1/x86_64-native-bsdapp-clang/a97f7ee35f494d71a9427a4273edff37/dpdk/x86_64-native-bsdapp-clang/lib/librte_pmd_sfc_efx.a(sfc_intr.o)
--
                                                  /root/FreeBSD1201-64_K12.1_Clang8.0.1/x86_64-native-bsdapp-clang/a97f7ee35f494d71a9427a4273edff37/dpdk/x86_64-native-bsdapp-clang/lib/librte_pmd_sfc_efx.a(sfc_tx.o)
sfc_rx_qflush_done                                /root/FreeBSD1201-64_K12.1_Clang8.0.1/x86_64-native-bsdapp-clang/a97f7ee35f494d71a9427a4273edff37/dpdk/x86_64-native-bsdapp-clang/lib/librte_pmd_sfc_efx.a(sfc_rx.o)
                                                  /root/FreeBSD1201-64_K12.1_Clang8.0.1/x86_64-native-bsdapp-clang/a97f7ee35f494d71a9427a4273edff37/dpdk/x86_64-native-bsdapp-clang/lib/librte_pmd_sfc_efx.a(sfc_ev.o)
sfc_rx_qflush_failed                              /root/FreeBSD1201-64_K12.1_Clang8.0.1/x86_64-native-bsdapp-clang/a97f7ee35f494d71a9427a4273edff37/dpdk/x86_64-native-bsdapp-clang/lib/librte_pmd_sfc_efx.a(sfc_rx.o)
                                                  /root/FreeBSD1201-64_K12.1_Clang8.0.1/x86_64-native-bsdapp-clang/a97f7ee35f494d71a9427a4273edff37/dpdk/x86_64-native-bsdapp-clang/lib/librte_pmd_sfc_efx.a(sfc_ev.o)
sfc_rxq_info_by_dp_rxq                            /root/FreeBSD1201-64_K12.1_Clang8.0.1/x86_64-native-bsdapp-clang/a97f7ee35f494d71a9427a4273edff37/dpdk/x86_64-native-bsdapp-clang/lib/librte_pmd_sfc_efx.a(sfc_rx.o)
                                                  /root/FreeBSD1201-64_K12.1_Clang8.0.1/x86_64-native-bsdapp-clang/a97f7ee35f494d71a9427a4273edff37/dpdk/x86_64-native-bsdapp-clang/lib/librte_pmd_sfc_efx.a(sfc_ev.o)
--
                                                  /root/FreeBSD1201-64_K12.1_Clang8.0.1/x86_64-native-bsdapp-clang/a97f7ee35f494d71a9427a4273edff37/dpdk/x86_64-native-bsdapp-clang/lib/librte_pmd_sfc_efx.a(efx_intr.o)
ef10_intr_enable                                  /root/FreeBSD1201-64_K12.1_Clang8.0.1/x86_64-native-bsdapp-clang/a97f7ee35f494d71a9427a4273edff37/dpdk/x86_64-native-bsdapp-clang/lib/librte_pmd_sfc_efx.a(ef10_intr.o)
                                                  /root/FreeBSD1201-64_K12.1_Clang8.0.1/x86_64-native-bsdapp-clang/a97f7ee35f494d71a9427a4273edff37/dpdk/x86_64-native-bsdapp-clang/lib/librte_pmd_sfc_efx.a(efx_intr.o)
ef10_intr_fatal                                   /root/FreeBSD1201-64_K12.1_Clang8.0.1/x86_64-native-bsdapp-clang/a97f7ee35f494d71a9427a4273edff37/dpdk/x86_64-native-bsdapp-clang/lib/librte_pmd_sfc_efx.a(ef10_intr.o)
                                                  /root/FreeBSD1201-64_K12.1_Clang8.0.1/x86_64-native-bsdapp-clang/a97f7ee35f494d71a9427a4273edff37/dpdk/x86_64-native-bsdapp-clang/lib/librte_pmd_sfc_efx.a(efx_intr.o)
ef10_intr_fini                                    /root/FreeBSD1201-64_K12.1_Clang8.0.1/x86_64-native-bsdapp-clang/a97f7ee35f494d71a9427a4273edff37/dpdk/x86_64-native-bsdapp-clang/lib/librte_pmd_sfc_efx.a(ef10_intr.o)
                                                  /root/FreeBSD1201-64_K12.1_Clang8.0.1/x86_64-native-bsdapp-clang/a97f7ee35f494d71a9427a4273edff37/dpdk/x86_64-native-bsdapp-clang/lib/librte_pmd_sfc_efx.a(efx_intr.o)
--
  CC test_red.o
  CC test_sched.o
  CC test_common.o
/root/FreeBSD1201-64_K12.1_Clang8.0.1/x86_64-native-bsdapp-clang/a97f7ee35f494d71a9427a4273edff37/dpdk/app/test/test_sched.c:41:4: error: field designator 'tb_rate' does not refer to any field in type 'struct rte_sched_subport_params'
                .tb_rate = 1250000000,
                 ^
/root/FreeBSD1201-64_K12.1_Clang8.0.1/x86_64-native-bsdapp-clang/a97f7ee35f494d71a9427a4273edff37/dpdk/app/test/test_sched.c:42:4: error: field designator 'tb_size' does not refer to any field in type 'struct rte_sched_subport_params'
                .tb_size = 1000000,
                 ^
/root/FreeBSD1201-64_K12.1_Clang8.0.1/x86_64-native-bsdapp-clang/a97f7ee35f494d71a9427a4273edff37/dpdk/app/test/test_sched.c:44:4: error: field designator 'tc_rate' does not refer to any field in type 'struct rte_sched_subport_params'
                .tc_rate = {1250000000, 1250000000, 1250000000, 1250000000,
                 ^
/root/FreeBSD1201-64_K12.1_Clang8.0.1/x86_64-native-bsdapp-clang/a97f7ee35f494d71a9427a4273edff37/dpdk/app/test/test_sched.c:47:4: error: field designator 'tc_period' does not refer to any field in type 'struct rte_sched_subport_params'
                .tc_period = 10,
                 ^
4 errors generated.
  CC test_meter.o
  CC test_distributor.o
  CC test_distributor_perf.o
gmake[5]: *** [/root/FreeBSD1201-64_K12.1_Clang8.0.1/x86_64-native-bsdapp-clang/a97f7ee35f494d71a9427a4273edff37/dpdk/mk/internal/rte.compile-pre.mk:116: test_sched.o] Error 1
gmake[5]: *** Waiting for unfinished jobs....
gmake[4]: *** [/root/FreeBSD1201-64_K12.1_Clang8.0.1/x86_64-native-bsdapp-clang/a97f7ee35f494d71a9427a4273edff37/dpdk/mk/rte.subdir.mk:35: test] Error 2
gmake[3]: *** [/root/FreeBSD1201-64_K12.1_Clang8.0.1/x86_64-native-bsdapp-clang/a97f7ee35f494d71a9427a4273edff37/dpdk/mk/rte.sdkbuild.mk:53: app] Error 2
gmake[2]: *** [/root/FreeBSD1201-64_K12.1_Clang8.0.1/x86_64-native-bsdapp-clang/a97f7ee35f494d71a9427a4273edff37/dpdk/mk/rte.sdkroot.mk:115: all] Error 2
gmake[1]: *** [/root/FreeBSD1201-64_K12.1_Clang8.0.1/x86_64-native-bsdapp-clang/a97f7ee35f494d71a9427a4273edff37/dpdk/mk/rte.sdkinstall.mk:61: pre_install] Error 2
gmake: *** [/root/FreeBSD1201-64_K12.1_Clang8.0.1/x86_64-native-bsdapp-clang/a97f7ee35f494d71a9427a4273edff37/dpdk/mk/rte.sdkroot.mk:92: install] Error 2


*Makefile Build Failed #11:
OS: FreeBSD1201-64
Target: x86_64-native-bsdapp-gcc+shared
== Build drivers/common
awk -f /usr/src/sys/tools/makeobjops.awk /usr/src/sys/dev/pci/pci_if.m -h
Warning: Object directory not changed from original /root/FreeBSD1201-64_K12.1_GCC7.3.0/x86_64-native-bsdapp-gcc+shared/a97f7ee35f494d71a9427a4273edff37/dpdk/x86_64-native-bsdapp-gcc/build/kernel/freebsd/contigmem
cc  -Winline -Wall -Werror -include /root/FreeBSD1201-64_K12.1_GCC7.3.0/x86_64-native-bsdapp-gcc+shared/a97f7ee35f494d71a9427a4273edff37/dpdk/x86_64-native-bsdapp-gcc/include/rte_config.h  -Werror -D_KERNEL -DKLD_MODULE -nostdinc  -I/root/FreeBSD1201-64_K12.1_GCC7.3.0/x86_64-native-bsdapp-gcc+shared/a97f7ee35f494d71a9427a4273edff37/dpdk/kernel/freebsd/contigmem -I/root/FreeBSD1201-64_K12.1_GCC7.3.0/x86_64-native-bsdapp-gcc+shared/a97f7ee35f494d71a9427a4273edff37/dpdk/x86_64-native-bsdapp-gcc/include -I. -I/usr/src/sys -I/usr/src/sys/contrib/ck/include -fno-common  -fno-omit-frame-pointer -mno-omit-leaf-frame-pointer -fdebug-prefix-map=./machine=/usr/src/sys/amd64/include -fdebug-prefix-map=./x86=/usr/src/sys/x86/include   -MD  -MF.depend.contigmem.o -MTcontigmem.o -mcmodel=kernel -mno-red-zone -mno-mmx -mno-sse -msoft-float  -fno-asynchronous-unwind-tables -ffreestanding -fwrapv -fstack-protector -Wall -Wredundant-decls -Wnested-externs -Wstrict-prototypes -Wmissing-prototypes -Wpointer-arith -Wcast-qual -Wundef -Wno-pointer-sign -D__printf__=__freebsd_kprintf__ -Wmissing-include-dirs -fdiagnostics-show-option -Wno-unknown-pragmas -Wno-error-tautological-compare -Wno-error-empty-body -Wno-error-parentheses-equality -Wno-error-unused-function -Wno-error-pointer-sign -Wno-error-shift-negative-value -Wno-address-of-packed-member  -mno-aes -mno-avx  -std=iso9899:1999 -c contigmem.c -o contigmem.o
Warning: Object directory not changed from original /root/FreeBSD1201-64_K12.1_GCC7.3.0/x86_64-native-bsdapp-gcc+shared/a97f7ee35f494d71a9427a4273edff37/dpdk/x86_64-native-bsdapp-gcc/build/kernel/freebsd/nic_uio
cc  -Winline -Wall -Werror -include /root/FreeBSD1201-64_K12.1_GCC7.3.0/x86_64-native-bsdapp-gcc+shared/a97f7ee35f494d71a9427a4273edff37/dpdk/x86_64-native-bsdapp-gcc/include/rte_config.h  -Werror -D_KERNEL -DKLD_MODULE -nostdinc  -I/root/FreeBSD1201-64_K12.1_GCC7.3.0/x86_64-native-bsdapp-gcc+shared/a97f7ee35f494d71a9427a4273edff37/dpdk/kernel/freebsd/nic_uio -I/root/FreeBSD1201-64_K12.1_GCC7.3.0/x86_64-native-bsdapp-gcc+shared/a97f7ee35f494d71a9427a4273edff37/dpdk/x86_64-native-bsdapp-gcc/include -I. -I/usr/src/sys -I/usr/src/sys/contrib/ck/include -fno-common  -fno-omit-frame-pointer -mno-omit-leaf-frame-pointer -fdebug-prefix-map=./machine=/usr/src/sys/amd64/include -fdebug-prefix-map=./x86=/usr/src/sys/x86/include   -MD  -MF.depend.nic_uio.o -MTnic_uio.o -mcmodel=kernel -mno-red-zone -mno-mmx -mno-sse -msoft-float  -fno-asynchronous-unwind-tables -ffreestanding -fwrapv -fstack-protector -Wall -Wredundant-decls -Wnested-externs -Wstrict-prototypes -Wmissing-prototypes -Wpointer-arith -Wcast-qual -Wundef -Wno-pointer-sign -D__printf__=__freebsd_kprintf__ -Wmissing-include-dirs -fdiagnostics-show-option -Wno-unknown-pragmas -Wno-error-tautological-compare -Wno-error-empty-body -Wno-error-parentheses-equality -Wno-error-unused-function -Wno-error-pointer-sign -Wno-error-shift-negative-value -Wno-address-of-packed-member  -mno-aes -mno-avx  -std=iso9899:1999 -c nic_uio.c -o nic_uio.o
ld -m elf_x86_64_fbsd -L/root/FreeBSD1201-64_K12.1_GCC7.3.0/x86_64-native-bsdapp-gcc+shared/a97f7ee35f494d71a9427a4273edff37/dpdk/x86_64-native-bsdapp-gcc/lib -d -warn-common --build-id=sha1 -r -d -o contigmem.ko contigmem.o
:> export_syms
ld -m elf_x86_64_fbsd -L/root/FreeBSD1201-64_K12.1_GCC7.3.0/x86_64-native-bsdapp-gcc+shared/a97f7ee35f494d71a9427a4273edff37/dpdk/x86_64-native-bsdapp-gcc/lib -d -warn-common --build-id=sha1 -r -d -o nic_uio.ko nic_uio.o
--
  CC test_distributor.o
  CC test_distributor_perf.o
  CC test_reorder.o
/root/FreeBSD1201-64_K12.1_GCC7.3.0/x86_64-native-bsdapp-gcc+shared/a97f7ee35f494d71a9427a4273edff37/dpdk/app/test/test_sched.c:41:4: error: 'struct rte_sched_subport_params' has no member named 'tb_rate'
   41 |   .tb_rate = 1250000000,
      |    ^~~~~~~
/root/FreeBSD1201-64_K12.1_GCC7.3.0/x86_64-native-bsdapp-gcc+shared/a97f7ee35f494d71a9427a4273edff37/dpdk/app/test/test_sched.c:42:4: error: 'struct rte_sched_subport_params' has no member named 'tb_size'; did you mean 'qsize'?
   42 |   .tb_size = 1000000,
      |    ^~~~~~~
      |    qsize
/root/FreeBSD1201-64_K12.1_GCC7.3.0/x86_64-native-bsdapp-gcc+shared/a97f7ee35f494d71a9427a4273edff37/dpdk/app/test/test_sched.c:42:14: warning: unsigned conversion from 'int' to 'short unsigned int' changes value from '1000000' to '16960' [-Woverflow]
   42 |   .tb_size = 1000000,
      |              ^~~~~~~
/root/FreeBSD1201-64_K12.1_GCC7.3.0/x86_64-native-bsdapp-gcc+shared/a97f7ee35f494d71a9427a4273edff37/dpdk/app/test/test_sched.c:44:4: error: 'struct rte_sched_subport_params' has no member named 'tc_rate'
   44 |   .tc_rate = {1250000000, 1250000000, 1250000000, 1250000000,
      |    ^~~~~~~
/root/FreeBSD1201-64_K12.1_GCC7.3.0/x86_64-native-bsdapp-gcc+shared/a97f7ee35f494d71a9427a4273edff37/dpdk/app/test/test_sched.c:44:3: warning: braces around scalar initializer
--
......
   42 |   .tb_size = 1000000,
      |              {      }
/root/FreeBSD1201-64_K12.1_GCC7.3.0/x86_64-native-bsdapp-gcc+shared/a97f7ee35f494d71a9427a4273edff37/dpdk/app/test/test_sched.c:47:4: error: 'struct rte_sched_subport_params' has no member named 'tc_period'
   47 |   .tc_period = 10,
      |    ^~~~~~~~~
/root/FreeBSD1201-64_K12.1_GCC7.3.0/x86_64-native-bsdapp-gcc+shared/a97f7ee35f494d71a9427a4273edff37/dpdk/app/test/test_sched.c:48:34: warning: initialized field overwritten [-Woverride-init]
--
......
   42 |   .tb_size = 1000000,
      |              {      }
gmake[5]: *** [/root/FreeBSD1201-64_K12.1_GCC7.3.0/x86_64-native-bsdapp-gcc+shared/a97f7ee35f494d71a9427a4273edff37/dpdk/mk/internal/rte.compile-pre.mk:116: test_sched.o] Error 1
gmake[5]: *** Waiting for unfinished jobs....
gmake[4]: *** [/root/FreeBSD1201-64_K12.1_GCC7.3.0/x86_64-native-bsdapp-gcc+shared/a97f7ee35f494d71a9427a4273edff37/dpdk/mk/rte.subdir.mk:35: test] Error 2
gmake[3]: *** [/root/FreeBSD1201-64_K12.1_GCC7.3.0/x86_64-native-bsdapp-gcc+shared/a97f7ee35f494d71a9427a4273edff37/dpdk/mk/rte.sdkbuild.mk:53: app] Error 2
gmake[2]: *** [/root/FreeBSD1201-64_K12.1_GCC7.3.0/x86_64-native-bsdapp-gcc+shared/a97f7ee35f494d71a9427a4273edff37/dpdk/mk/rte.sdkroot.mk:115: all] Error 2
gmake[1]: *** [/root/FreeBSD1201-64_K12.1_GCC7.3.0/x86_64-native-bsdapp-gcc+shared/a97f7ee35f494d71a9427a4273edff37/dpdk/mk/rte.sdkinstall.mk:61: pre_install] Error 2
gmake: *** [/root/FreeBSD1201-64_K12.1_GCC7.3.0/x86_64-native-bsdapp-gcc+shared/a97f7ee35f494d71a9427a4273edff37/dpdk/mk/rte.sdkroot.mk:92: install] Error 2


*Makefile Build Failed #12:
OS: FreeBSD1201-64
Target: x86_64-native-bsdapp-gcc+debug
awk -f /usr/src/sys/tools/makeobjops.awk /usr/src/sys/kern/bus_if.m -h
awk -f /usr/src/sys/tools/makeobjops.awk /usr/src/sys/dev/pci/pci_if.m -h
Warning: Object directory not changed from original /root/FreeBSD1201-64_K12.1_GCC7.3.0/x86_64-native-bsdapp-gcc+debug/a97f7ee35f494d71a9427a4273edff37/dpdk/x86_64-native-bsdapp-gcc/build/kernel/freebsd/contigmem
cc  -Winline -Wall -Werror -include /root/FreeBSD1201-64_K12.1_GCC7.3.0/x86_64-native-bsdapp-gcc+debug/a97f7ee35f494d71a9427a4273edff37/dpdk/x86_64-native-bsdapp-gcc/include/rte_config.h  -Werror -D_KERNEL -DKLD_MODULE -nostdinc  -I/root/FreeBSD1201-64_K12.1_GCC7.3.0/x86_64-native-bsdapp-gcc+debug/a97f7ee35f494d71a9427a4273edff37/dpdk/kernel/freebsd/contigmem -I/root/FreeBSD1201-64_K12.1_GCC7.3.0/x86_64-native-bsdapp-gcc+debug/a97f7ee35f494d71a9427a4273edff37/dpdk/x86_64-native-bsdapp-gcc/include -I. -I/usr/src/sys -I/usr/src/sys/contrib/ck/include -fno-common  -fno-omit-frame-pointer -mno-omit-leaf-frame-pointer -fdebug-prefix-map=./machine=/usr/src/sys/amd64/include -fdebug-prefix-map=./x86=/usr/src/sys/x86/include   -MD  -MF.depend.contigmem.o -MTcontigmem.o -mcmodel=kernel -mno-red-zone -mno-mmx -mno-sse -msoft-float  -fno-asynchronous-unwind-tables -ffreestanding -fwrapv -fstack-protector -Wall -Wredundant-decls -Wnested-externs -Wstrict-prototypes -Wmissing-prototypes -Wpointer-arith -Wcast-qual -Wundef -Wno-pointer-sign -D__printf__=__freebsd_kprintf__ -Wmissing-include-dirs -fdiagnostics-show-option -Wno-unknown-pragmas -Wno-error-tautological-compare -Wno-error-empty-body -Wno-error-parentheses-equality -Wno-error-unused-function -Wno-error-pointer-sign -Wno-error-shift-negative-value -Wno-address-of-packed-member  -mno-aes -mno-avx  -std=iso9899:1999 -c contigmem.c -o contigmem.o
Warning: Object directory not changed from original /root/FreeBSD1201-64_K12.1_GCC7.3.0/x86_64-native-bsdapp-gcc+debug/a97f7ee35f494d71a9427a4273edff37/dpdk/x86_64-native-bsdapp-gcc/build/kernel/freebsd/nic_uio
cc  -Winline -Wall -Werror -include /root/FreeBSD1201-64_K12.1_GCC7.3.0/x86_64-native-bsdapp-gcc+debug/a97f7ee35f494d71a9427a4273edff37/dpdk/x86_64-native-bsdapp-gcc/include/rte_config.h  -Werror -D_KERNEL -DKLD_MODULE -nostdinc  -I/root/FreeBSD1201-64_K12.1_GCC7.3.0/x86_64-native-bsdapp-gcc+debug/a97f7ee35f494d71a9427a4273edff37/dpdk/kernel/freebsd/nic_uio -I/root/FreeBSD1201-64_K12.1_GCC7.3.0/x86_64-native-bsdapp-gcc+debug/a97f7ee35f494d71a9427a4273edff37/dpdk/x86_64-native-bsdapp-gcc/include -I. -I/usr/src/sys -I/usr/src/sys/contrib/ck/include -fno-common  -fno-omit-frame-pointer -mno-omit-leaf-frame-pointer -fdebug-prefix-map=./machine=/usr/src/sys/amd64/include -fdebug-prefix-map=./x86=/usr/src/sys/x86/include   -MD  -MF.depend.nic_uio.o -MTnic_uio.o -mcmodel=kernel -mno-red-zone -mno-mmx -mno-sse -msoft-float  -fno-asynchronous-unwind-tables -ffreestanding -fwrapv -fstack-protector -Wall -Wredundant-decls -Wnested-externs -Wstrict-prototypes -Wmissing-prototypes -Wpointer-arith -Wcast-qual -Wundef -Wno-pointer-sign -D__printf__=__freebsd_kprintf__ -Wmissing-include-dirs -fdiagnostics-show-option -Wno-unknown-pragmas -Wno-error-tautological-compare -Wno-error-empty-body -Wno-error-parentheses-equality -Wno-error-unused-function -Wno-error-pointer-sign -Wno-error-shift-negative-value -Wno-address-of-packed-member  -mno-aes -mno-avx  -std=iso9899:1999 -c nic_uio.c -o nic_uio.o
ld -m elf_x86_64_fbsd -L/root/FreeBSD1201-64_K12.1_GCC7.3.0/x86_64-native-bsdapp-gcc+debug/a97f7ee35f494d71a9427a4273edff37/dpdk/x86_64-native-bsdapp-gcc/lib -d -warn-common --build-id=sha1 -r -d -o contigmem.ko contigmem.o
ld -m elf_x86_64_fbsd -L/root/FreeBSD1201-64_K12.1_GCC7.3.0/x86_64-native-bsdapp-gcc+debug/a97f7ee35f494d71a9427a4273edff37/dpdk/x86_64-native-bsdapp-gcc/lib -d -warn-common --build-id=sha1 -r -d -o nic_uio.ko nic_uio.o
:> export_syms
--
  CC test_distributor_perf.o
  CC test_reorder.o
  CC virtual_pmd.o
/root/FreeBSD1201-64_K12.1_GCC7.3.0/x86_64-native-bsdapp-gcc+debug/a97f7ee35f494d71a9427a4273edff37/dpdk/app/test/test_sched.c:41:4: error: 'struct rte_sched_subport_params' has no member named 'tb_rate'
   41 |   .tb_rate = 1250000000,
      |    ^~~~~~~
/root/FreeBSD1201-64_K12.1_GCC7.3.0/x86_64-native-bsdapp-gcc+debug/a97f7ee35f494d71a9427a4273edff37/dpdk/app/test/test_sched.c:42:4: error: 'struct rte_sched_subport_params' has no member named 'tb_size'; did you mean 'qsize'?
   42 |   .tb_size = 1000000,
      |    ^~~~~~~
      |    qsize
/root/FreeBSD1201-64_K12.1_GCC7.3.0/x86_64-native-bsdapp-gcc+debug/a97f7ee35f494d71a9427a4273edff37/dpdk/app/test/test_sched.c:42:14: warning: unsigned conversion from 'int' to 'short unsigned int' changes value from '1000000' to '16960' [-Woverflow]
   42 |   .tb_size = 1000000,
      |              ^~~~~~~
/root/FreeBSD1201-64_K12.1_GCC7.3.0/x86_64-native-bsdapp-gcc+debug/a97f7ee35f494d71a9427a4273edff37/dpdk/app/test/test_sched.c:44:4: error: 'struct rte_sched_subport_params' has no member named 'tc_rate'
   44 |   .tc_rate = {1250000000, 1250000000, 1250000000, 1250000000,
      |    ^~~~~~~
/root/FreeBSD1201-64_K12.1_GCC7.3.0/x86_64-native-bsdapp-gcc+debug/a97f7ee35f494d71a9427a4273edff37/dpdk/app/test/test_sched.c:44:3: warning: braces around scalar initializer
--
......
   42 |   .tb_size = 1000000,
      |              {      }
/root/FreeBSD1201-64_K12.1_GCC7.3.0/x86_64-native-bsdapp-gcc+debug/a97f7ee35f494d71a9427a4273edff37/dpdk/app/test/test_sched.c:47:4: error: 'struct rte_sched_subport_params' has no member named 'tc_period'
   47 |   .tc_period = 10,
      |    ^~~~~~~~~
/root/FreeBSD1201-64_K12.1_GCC7.3.0/x86_64-native-bsdapp-gcc+debug/a97f7ee35f494d71a9427a4273edff37/dpdk/app/test/test_sched.c:48:34: warning: initialized field overwritten [-Woverride-init]
--
......
   42 |   .tb_size = 1000000,
      |              {      }
gmake[5]: *** [/root/FreeBSD1201-64_K12.1_GCC7.3.0/x86_64-native-bsdapp-gcc+debug/a97f7ee35f494d71a9427a4273edff37/dpdk/mk/internal/rte.compile-pre.mk:116: test_sched.o] Error 1
gmake[5]: *** Waiting for unfinished jobs....
gmake[4]: *** [/root/FreeBSD1201-64_K12.1_GCC7.3.0/x86_64-native-bsdapp-gcc+debug/a97f7ee35f494d71a9427a4273edff37/dpdk/mk/rte.subdir.mk:35: test] Error 2
gmake[3]: *** [/root/FreeBSD1201-64_K12.1_GCC7.3.0/x86_64-native-bsdapp-gcc+debug/a97f7ee35f494d71a9427a4273edff37/dpdk/mk/rte.sdkbuild.mk:53: app] Error 2
gmake[2]: *** [/root/FreeBSD1201-64_K12.1_GCC7.3.0/x86_64-native-bsdapp-gcc+debug/a97f7ee35f494d71a9427a4273edff37/dpdk/mk/rte.sdkroot.mk:115: all] Error 2
gmake[1]: *** [/root/FreeBSD1201-64_K12.1_GCC7.3.0/x86_64-native-bsdapp-gcc+debug/a97f7ee35f494d71a9427a4273edff37/dpdk/mk/rte.sdkinstall.mk:61: pre_install] Error 2
gmake: *** [/root/FreeBSD1201-64_K12.1_GCC7.3.0/x86_64-native-bsdapp-gcc+debug/a97f7ee35f494d71a9427a4273edff37/dpdk/mk/rte.sdkroot.mk:92: install] Error 2


*Makefile Build Failed #13:
OS: RHEL82-64
Target: x86_64-native-linuxapp-gcc
  CC rte_eth_softnic_tm.o
  CC qede_rxtx.o
/root/RHEL82-64_K4.18.0_GCC8.3.1/x86_64-native-linuxapp-gcc/a97f7ee35f494d71a9427a4273edff37/dpdk/drivers/net/softnic/rte_eth_softnic_tm.c: In function ‘update_subport_tc_rate’:
/root/RHEL82-64_K4.18.0_GCC8.3.1/x86_64-native-linuxapp-gcc/a97f7ee35f494d71a9427a4273edff37/dpdk/drivers/net/softnic/rte_eth_softnic_tm.c:1068:16: error: ‘struct rte_sched_subport_params’ has no member named ‘tc_rate’
  subport_params.tc_rate[tc_id] = sp_new->params.peak.rate;
                ^
/root/RHEL82-64_K4.18.0_GCC8.3.1/x86_64-native-linuxapp-gcc/a97f7ee35f494d71a9427a4273edff37/dpdk/drivers/net/softnic/rte_eth_softnic_tm.c:1052:11: warning: variable ‘tc_id’ set but not used [-Wunused-but-set-variable]
  uint32_t tc_id = tm_node_tc_id(dev, nt);
           ^~~~~
/root/RHEL82-64_K4.18.0_GCC8.3.1/x86_64-native-linuxapp-gcc/a97f7ee35f494d71a9427a4273edff37/dpdk/drivers/net/softnic/rte_eth_softnic_tm.c: In function ‘hierarchy_blueprints_create’:
/root/RHEL82-64_K4.18.0_GCC8.3.1/x86_64-native-linuxapp-gcc/a97f7ee35f494d71a9427a4273edff37/dpdk/drivers/net/softnic/rte_eth_softnic_tm.c:2555:6: error: ‘struct rte_sched_subport_params’ has no member named ‘tb_rate’
     .tb_rate = n->shaper_profile->params.peak.rate,
      ^~~~~~~
/root/RHEL82-64_K4.18.0_GCC8.3.1/x86_64-native-linuxapp-gcc/a97f7ee35f494d71a9427a4273edff37/dpdk/drivers/net/softnic/rte_eth_softnic_tm.c:2556:6: error: ‘struct rte_sched_subport_params’ has no member named ‘tb_size’; did you mean ‘qsize’?
     .tb_size = n->shaper_profile->params.peak.size,
      ^~~~~~~
      qsize
/root/RHEL82-64_K4.18.0_GCC8.3.1/x86_64-native-linuxapp-gcc/a97f7ee35f494d71a9427a4273edff37/dpdk/drivers/net/softnic/rte_eth_softnic_tm.c:2558:6: error: ‘struct rte_sched_subport_params’ has no member named ‘tc_rate’
     .tc_rate = {tc_rate[0],
      ^~~~~~~
/root/RHEL82-64_K4.18.0_GCC8.3.1/x86_64-native-linuxapp-gcc/a97f7ee35f494d71a9427a4273edff37/dpdk/drivers/net/softnic/rte_eth_softnic_tm.c:2558:5: warning: braces around scalar initializer
--
/root/RHEL82-64_K4.18.0_GCC8.3.1/x86_64-native-linuxapp-gcc/a97f7ee35f494d71a9427a4273edff37/dpdk/drivers/net/softnic/rte_eth_softnic_tm.c:2556:16:
     .tb_size = n->shaper_profile->params.peak.size,
                {                                  }
/root/RHEL82-64_K4.18.0_GCC8.3.1/x86_64-native-linuxapp-gcc/a97f7ee35f494d71a9427a4273edff37/dpdk/drivers/net/softnic/rte_eth_softnic_tm.c:2572:6: error: ‘struct rte_sched_subport_params’ has no member named ‘tc_period’
     .tc_period = SUBPORT_TC_PERIOD,
      ^~~~~~~~~
/root/RHEL82-64_K4.18.0_GCC8.3.1/x86_64-native-linuxapp-gcc/a97f7ee35f494d71a9427a4273edff37/dpdk/drivers/net/softnic/rte_eth_softnic_tm.c:2574:6: warning: initialized field overwritten [-Woverride-init]
--
     .tb_size = n->shaper_profile->params.peak.size,
                {                                  }
/root/RHEL82-64_K4.18.0_GCC8.3.1/x86_64-native-linuxapp-gcc/a97f7ee35f494d71a9427a4273edff37/dpdk/drivers/net/softnic/rte_eth_softnic_tm.c: In function ‘update_subport_rate’:
/root/RHEL82-64_K4.18.0_GCC8.3.1/x86_64-native-linuxapp-gcc/a97f7ee35f494d71a9427a4273edff37/dpdk/drivers/net/softnic/rte_eth_softnic_tm.c:2838:16: error: ‘struct rte_sched_subport_params’ has no member named ‘tb_rate’
  subport_params.tb_rate = sp->params.peak.rate;
                ^
/root/RHEL82-64_K4.18.0_GCC8.3.1/x86_64-native-linuxapp-gcc/a97f7ee35f494d71a9427a4273edff37/dpdk/drivers/net/softnic/rte_eth_softnic_tm.c:2839:17: error: ‘struct rte_sched_subport_params’ has no member named ‘tb_size’; did you mean ‘qsize’?
  subport_params.tb_size = sp->params.peak.size;
                 ^~~~~~~
                 qsize
/root/RHEL82-64_K4.18.0_GCC8.3.1/x86_64-native-linuxapp-gcc/a97f7ee35f494d71a9427a4273edff37/dpdk/drivers/net/softnic/rte_eth_softnic_tm.c: At top level:
cc1: warning: unrecognized command line option ‘-Wno-address-of-packed-member’
make[6]: *** [/root/RHEL82-64_K4.18.0_GCC8.3.1/x86_64-native-linuxapp-gcc/a97f7ee35f494d71a9427a4273edff37/dpdk/mk/internal/rte.compile-pre.mk:114: rte_eth_softnic_tm.o] Error 1
make[5]: *** [/root/RHEL82-64_K4.18.0_GCC8.3.1/x86_64-native-linuxapp-gcc/a97f7ee35f494d71a9427a4273edff37/dpdk/mk/rte.subdir.mk:35: softnic] Error 2
make[5]: *** Waiting for unfinished jobs....
  CC qede_filter.o
  CC sfc_ef10_tx.o
--
  CC medford2_nic.o
  AR librte_pmd_sfc_efx.a
  INSTALL-LIB librte_pmd_sfc_efx.a
make[4]: *** [/root/RHEL82-64_K4.18.0_GCC8.3.1/x86_64-native-linuxapp-gcc/a97f7ee35f494d71a9427a4273edff37/dpdk/mk/rte.subdir.mk:35: net] Error 2
make[3]: *** [/root/RHEL82-64_K4.18.0_GCC8.3.1/x86_64-native-linuxapp-gcc/a97f7ee35f494d71a9427a4273edff37/dpdk/mk/rte.sdkbuild.mk:51: drivers] Error 2
make[2]: *** [/root/RHEL82-64_K4.18.0_GCC8.3.1/x86_64-native-linuxapp-gcc/a97f7ee35f494d71a9427a4273edff37/dpdk/mk/rte.sdkroot.mk:115: all] Error 2
make[1]: *** [/root/RHEL82-64_K4.18.0_GCC8.3.1/x86_64-native-linuxapp-gcc/a97f7ee35f494d71a9427a4273edff37/dpdk/mk/rte.sdkinstall.mk:61: pre_install] Error 2
make: *** [/root/RHEL82-64_K4.18.0_GCC8.3.1/x86_64-native-linuxapp-gcc/a97f7ee35f494d71a9427a4273edff37/dpdk/mk/rte.sdkroot.mk:92: install] Error 2


*Makefile Build Failed #14:
OS: SUSE15-64
Target: x86_64-native-linuxapp-clang
  CC tf_ulp/ulp_def_rules.o
  CC rte_eth_softnic_tm.o
  CC efx_filter.o
/root/SUSE15-64_K4.12.14_Clang5.0.1/x86_64-native-linuxapp-clang/a97f7ee35f494d71a9427a4273edff37/dpdk/drivers/net/softnic/rte_eth_softnic_tm.c:1068:17: error: no member named 'tc_rate' in 'struct rte_sched_subport_params'
        subport_params.tc_rate[tc_id] = sp_new->params.peak.rate;
        ~~~~~~~~~~~~~~ ^
/root/SUSE15-64_K4.12.14_Clang5.0.1/x86_64-native-linuxapp-clang/a97f7ee35f494d71a9427a4273edff37/dpdk/drivers/net/softnic/rte_eth_softnic_tm.c:2555:6: error: field designator 'tb_rate' does not refer to any field in type 'struct rte_sched_subport_params'
                                .tb_rate = n->shaper_profile->params.peak.rate,
                                 ^
/root/SUSE15-64_K4.12.14_Clang5.0.1/x86_64-native-linuxapp-clang/a97f7ee35f494d71a9427a4273edff37/dpdk/drivers/net/softnic/rte_eth_softnic_tm.c:2556:6: error: field designator 'tb_size' does not refer to any field in type 'struct rte_sched_subport_params'
                                .tb_size = n->shaper_profile->params.peak.size,
                                 ^
/root/SUSE15-64_K4.12.14_Clang5.0.1/x86_64-native-linuxapp-clang/a97f7ee35f494d71a9427a4273edff37/dpdk/drivers/net/softnic/rte_eth_softnic_tm.c:2558:6: error: field designator 'tc_rate' does not refer to any field in type 'struct rte_sched_subport_params'
                                .tc_rate = {tc_rate[0],
                                 ^
/root/SUSE15-64_K4.12.14_Clang5.0.1/x86_64-native-linuxapp-clang/a97f7ee35f494d71a9427a4273edff37/dpdk/drivers/net/softnic/rte_eth_softnic_tm.c:2572:6: error: field designator 'tc_period' does not refer to any field in type 'struct rte_sched_subport_params'
                                .tc_period = SUBPORT_TC_PERIOD,
                                 ^
/root/SUSE15-64_K4.12.14_Clang5.0.1/x86_64-native-linuxapp-clang/a97f7ee35f494d71a9427a4273edff37/dpdk/drivers/net/softnic/rte_eth_softnic_tm.c:2838:17: error: no member named 'tb_rate' in 'struct rte_sched_subport_params'
        subport_params.tb_rate = sp->params.peak.rate;
        ~~~~~~~~~~~~~~ ^
/root/SUSE15-64_K4.12.14_Clang5.0.1/x86_64-native-linuxapp-clang/a97f7ee35f494d71a9427a4273edff37/dpdk/drivers/net/softnic/rte_eth_softnic_tm.c:2839:17: error: no member named 'tb_size' in 'struct rte_sched_subport_params'
        subport_params.tb_size = sp->params.peak.size;
        ~~~~~~~~~~~~~~ ^
7 errors generated.
make[6]: *** [/root/SUSE15-64_K4.12.14_Clang5.0.1/x86_64-native-linuxapp-clang/a97f7ee35f494d71a9427a4273edff37/dpdk/mk/internal/rte.compile-pre.mk:114: rte_eth_softnic_tm.o] Error 1
make[6]: *** Waiting for unfinished jobs....
  CC qede_rxtx.o
  CC virtio_user/vhost_kernel_tap.o
--
== Build drivers/net/vhost
  SYMLINK-FILE include/rte_eth_vhost.h
  CC rte_eth_vhost.o
make[5]: *** [/root/SUSE15-64_K4.12.14_Clang5.0.1/x86_64-native-linuxapp-clang/a97f7ee35f494d71a9427a4273edff37/dpdk/mk/rte.subdir.mk:37: softnic] Error 2
make[5]: *** Waiting for unfinished jobs....
  CC virtio_user/virtio_user_dev.o
  CC qede_filter.o
--
  CC medford2_nic.o
  AR librte_pmd_sfc_efx.a
  INSTALL-LIB librte_pmd_sfc_efx.a
make[4]: *** [/root/SUSE15-64_K4.12.14_Clang5.0.1/x86_64-native-linuxapp-clang/a97f7ee35f494d71a9427a4273edff37/dpdk/mk/rte.subdir.mk:35: net] Error 2
make[3]: *** [/root/SUSE15-64_K4.12.14_Clang5.0.1/x86_64-native-linuxapp-clang/a97f7ee35f494d71a9427a4273edff37/dpdk/mk/rte.sdkbuild.mk:51: drivers] Error 2
make[2]: *** [/root/SUSE15-64_K4.12.14_Clang5.0.1/x86_64-native-linuxapp-clang/a97f7ee35f494d71a9427a4273edff37/dpdk/mk/rte.sdkroot.mk:115: all] Error 2
make[1]: *** [/root/SUSE15-64_K4.12.14_Clang5.0.1/x86_64-native-linuxapp-clang/a97f7ee35f494d71a9427a4273edff37/dpdk/mk/rte.sdkinstall.mk:61: pre_install] Error 2
make: *** [/root/SUSE15-64_K4.12.14_Clang5.0.1/x86_64-native-linuxapp-clang/a97f7ee35f494d71a9427a4273edff37/dpdk/mk/rte.sdkroot.mk:92: install] Error 2


*Makefile Build Failed #15:
OS: SUSE15-64
Target: x86_64-native-linuxapp-gcc
  CC virtio_user/virtio_user_dev.o
  LD rte_eth_vhost.o
/root/SUSE15-64_K4.12.14_GCC7.3.1/x86_64-native-linuxapp-gcc/a97f7ee35f494d71a9427a4273edff37/dpdk/drivers/net/softnic/rte_eth_softnic_tm.c: In function ‘update_subport_tc_rate’:
/root/SUSE15-64_K4.12.14_GCC7.3.1/x86_64-native-linuxapp-gcc/a97f7ee35f494d71a9427a4273edff37/dpdk/drivers/net/softnic/rte_eth_softnic_tm.c:1068:16: error: ‘struct rte_sched_subport_params’ has no member named ‘tc_rate’
  subport_params.tc_rate[tc_id] = sp_new->params.peak.rate;
                ^
/root/SUSE15-64_K4.12.14_GCC7.3.1/x86_64-native-linuxapp-gcc/a97f7ee35f494d71a9427a4273edff37/dpdk/drivers/net/softnic/rte_eth_softnic_tm.c:1052:11: warning: variable ‘tc_id’ set but not used [-Wunused-but-set-variable]
  uint32_t tc_id = tm_node_tc_id(dev, nt);
           ^~~~~
/root/SUSE15-64_K4.12.14_GCC7.3.1/x86_64-native-linuxapp-gcc/a97f7ee35f494d71a9427a4273edff37/dpdk/drivers/net/softnic/rte_eth_softnic_tm.c: In function ‘hierarchy_blueprints_create’:
/root/SUSE15-64_K4.12.14_GCC7.3.1/x86_64-native-linuxapp-gcc/a97f7ee35f494d71a9427a4273edff37/dpdk/drivers/net/softnic/rte_eth_softnic_tm.c:2555:6: error: ‘struct rte_sched_subport_params’ has no member named ‘tb_rate’
     .tb_rate = n->shaper_profile->params.peak.rate,
      ^~~~~~~
/root/SUSE15-64_K4.12.14_GCC7.3.1/x86_64-native-linuxapp-gcc/a97f7ee35f494d71a9427a4273edff37/dpdk/drivers/net/softnic/rte_eth_softnic_tm.c:2556:6: error: ‘struct rte_sched_subport_params’ has no member named ‘tb_size’; did you mean ‘qsize’?
     .tb_size = n->shaper_profile->params.peak.size,
      ^~~~~~~
      qsize
/root/SUSE15-64_K4.12.14_GCC7.3.1/x86_64-native-linuxapp-gcc/a97f7ee35f494d71a9427a4273edff37/dpdk/drivers/net/softnic/rte_eth_softnic_tm.c:2558:6: error: ‘struct rte_sched_subport_params’ has no member named ‘tc_rate’
     .tc_rate = {tc_rate[0],
      ^~~~~~~
/root/SUSE15-64_K4.12.14_GCC7.3.1/x86_64-native-linuxapp-gcc/a97f7ee35f494d71a9427a4273edff37/dpdk/drivers/net/softnic/rte_eth_softnic_tm.c:2558:5: warning: braces around scalar initializer
--
/root/SUSE15-64_K4.12.14_GCC7.3.1/x86_64-native-linuxapp-gcc/a97f7ee35f494d71a9427a4273edff37/dpdk/drivers/net/softnic/rte_eth_softnic_tm.c:2556:16:
     .tb_size = n->shaper_profile->params.peak.size,
                {                                  }
/root/SUSE15-64_K4.12.14_GCC7.3.1/x86_64-native-linuxapp-gcc/a97f7ee35f494d71a9427a4273edff37/dpdk/drivers/net/softnic/rte_eth_softnic_tm.c:2572:6: error: ‘struct rte_sched_subport_params’ has no member named ‘tc_period’
     .tc_period = SUBPORT_TC_PERIOD,
      ^~~~~~~~~
/root/SUSE15-64_K4.12.14_GCC7.3.1/x86_64-native-linuxapp-gcc/a97f7ee35f494d71a9427a4273edff37/dpdk/drivers/net/softnic/rte_eth_softnic_tm.c:2574:6: warning: initialized field overwritten [-Woverride-init]
--
     .tb_size = n->shaper_profile->params.peak.size,
                {                                  }
/root/SUSE15-64_K4.12.14_GCC7.3.1/x86_64-native-linuxapp-gcc/a97f7ee35f494d71a9427a4273edff37/dpdk/drivers/net/softnic/rte_eth_softnic_tm.c: In function ‘update_subport_rate’:
/root/SUSE15-64_K4.12.14_GCC7.3.1/x86_64-native-linuxapp-gcc/a97f7ee35f494d71a9427a4273edff37/dpdk/drivers/net/softnic/rte_eth_softnic_tm.c:2838:16: error: ‘struct rte_sched_subport_params’ has no member named ‘tb_rate’
  subport_params.tb_rate = sp->params.peak.rate;
                ^
/root/SUSE15-64_K4.12.14_GCC7.3.1/x86_64-native-linuxapp-gcc/a97f7ee35f494d71a9427a4273edff37/dpdk/drivers/net/softnic/rte_eth_softnic_tm.c:2839:17: error: ‘struct rte_sched_subport_params’ has no member named ‘tb_size’; did you mean ‘qsize’?
  subport_params.tb_size = sp->params.peak.size;
                 ^~~~~~~
                 qsize
/root/SUSE15-64_K4.12.14_GCC7.3.1/x86_64-native-linuxapp-gcc/a97f7ee35f494d71a9427a4273edff37/dpdk/drivers/net/softnic/rte_eth_softnic_tm.c: At top level:
cc1: warning: unrecognized command line option ‘-Wno-address-of-packed-member’
make[6]: *** [/root/SUSE15-64_K4.12.14_GCC7.3.1/x86_64-native-linuxapp-gcc/a97f7ee35f494d71a9427a4273edff37/dpdk/mk/internal/rte.compile-pre.mk:114: rte_eth_softnic_tm.o] Error 1
make[6]: *** Waiting for unfinished jobs....
  CC virtio_user_ethdev.o
  CC otx2_ptp.o
--
  AR librte_pmd_dpaa_sec.a
  INSTALL-LIB librte_pmd_dpaa_sec.a
== Build drivers/crypto/caam_jr
make[5]: *** [/root/SUSE15-64_K4.12.14_GCC7.3.1/x86_64-native-linuxapp-gcc/a97f7ee35f494d71a9427a4273edff37/dpdk/mk/rte.subdir.mk:35: softnic] Error 2
make[5]: *** Waiting for unfinished jobs....
  CC otx2_link.o
  CC efx_crc32.o
--
  INSTALL-LIB librte_pmd_nitrox.a
  AR librte_pmd_qede.a
  INSTALL-LIB librte_pmd_qede.a
make[4]: *** [/root/SUSE15-64_K4.12.14_GCC7.3.1/x86_64-native-linuxapp-gcc/a97f7ee35f494d71a9427a4273edff37/dpdk/mk/rte.subdir.mk:35: net] Error 2
make[3]: *** [/root/SUSE15-64_K4.12.14_GCC7.3.1/x86_64-native-linuxapp-gcc/a97f7ee35f494d71a9427a4273edff37/dpdk/mk/rte.sdkbuild.mk:51: drivers] Error 2
make[2]: *** [/root/SUSE15-64_K4.12.14_GCC7.3.1/x86_64-native-linuxapp-gcc/a97f7ee35f494d71a9427a4273edff37/dpdk/mk/rte.sdkroot.mk:115: all] Error 2
make[1]: *** [/root/SUSE15-64_K4.12.14_GCC7.3.1/x86_64-native-linuxapp-gcc/a97f7ee35f494d71a9427a4273edff37/dpdk/mk/rte.sdkinstall.mk:61: pre_install] Error 2
make: *** [/root/SUSE15-64_K4.12.14_GCC7.3.1/x86_64-native-linuxapp-gcc/a97f7ee35f494d71a9427a4273edff37/dpdk/mk/rte.sdkroot.mk:92: install] Error 2


*Makefile Build Failed #16:
OS: UB1804-64
Target: x86_64-native-linuxapp-gcc
  CC ecore_init_ops.o
  CC virtio_rxtx_simple_sse.o
/root/UB1804-64_K4.15.0_GCC7.3.0/x86_64-native-linuxapp-gcc/a97f7ee35f494d71a9427a4273edff37/dpdk/drivers/net/softnic/rte_eth_softnic_tm.c: In function ‘update_subport_tc_rate’:
/root/UB1804-64_K4.15.0_GCC7.3.0/x86_64-native-linuxapp-gcc/a97f7ee35f494d71a9427a4273edff37/dpdk/drivers/net/softnic/rte_eth_softnic_tm.c:1068:16: error: ‘struct rte_sched_subport_params’ has no member named ‘tc_rate’
  subport_params.tc_rate[tc_id] = sp_new->params.peak.rate;
                ^
/root/UB1804-64_K4.15.0_GCC7.3.0/x86_64-native-linuxapp-gcc/a97f7ee35f494d71a9427a4273edff37/dpdk/drivers/net/softnic/rte_eth_softnic_tm.c:1052:11: warning: variable ‘tc_id’ set but not used [-Wunused-but-set-variable]
  uint32_t tc_id = tm_node_tc_id(dev, nt);
           ^~~~~
/root/UB1804-64_K4.15.0_GCC7.3.0/x86_64-native-linuxapp-gcc/a97f7ee35f494d71a9427a4273edff37/dpdk/drivers/net/softnic/rte_eth_softnic_tm.c: In function ‘hierarchy_blueprints_create’:
/root/UB1804-64_K4.15.0_GCC7.3.0/x86_64-native-linuxapp-gcc/a97f7ee35f494d71a9427a4273edff37/dpdk/drivers/net/softnic/rte_eth_softnic_tm.c:2555:6: error: ‘struct rte_sched_subport_params’ has no member named ‘tb_rate’
     .tb_rate = n->shaper_profile->params.peak.rate,
      ^~~~~~~
/root/UB1804-64_K4.15.0_GCC7.3.0/x86_64-native-linuxapp-gcc/a97f7ee35f494d71a9427a4273edff37/dpdk/drivers/net/softnic/rte_eth_softnic_tm.c:2556:6: error: ‘struct rte_sched_subport_params’ has no member named ‘tb_size’; did you mean ‘qsize’?
     .tb_size = n->shaper_profile->params.peak.size,
      ^~~~~~~
      qsize
/root/UB1804-64_K4.15.0_GCC7.3.0/x86_64-native-linuxapp-gcc/a97f7ee35f494d71a9427a4273edff37/dpdk/drivers/net/softnic/rte_eth_softnic_tm.c:2558:6: error: ‘struct rte_sched_subport_params’ has no member named ‘tc_rate’
     .tc_rate = {tc_rate[0],
      ^~~~~~~
/root/UB1804-64_K4.15.0_GCC7.3.0/x86_64-native-linuxapp-gcc/a97f7ee35f494d71a9427a4273edff37/dpdk/drivers/net/softnic/rte_eth_softnic_tm.c:2558:5: warning: braces around scalar initializer
--
/root/UB1804-64_K4.15.0_GCC7.3.0/x86_64-native-linuxapp-gcc/a97f7ee35f494d71a9427a4273edff37/dpdk/drivers/net/softnic/rte_eth_softnic_tm.c:2556:16:
     .tb_size = n->shaper_profile->params.peak.size,
                {                                  }
/root/UB1804-64_K4.15.0_GCC7.3.0/x86_64-native-linuxapp-gcc/a97f7ee35f494d71a9427a4273edff37/dpdk/drivers/net/softnic/rte_eth_softnic_tm.c:2572:6: error: ‘struct rte_sched_subport_params’ has no member named ‘tc_period’
     .tc_period = SUBPORT_TC_PERIOD,
      ^~~~~~~~~
/root/UB1804-64_K4.15.0_GCC7.3.0/x86_64-native-linuxapp-gcc/a97f7ee35f494d71a9427a4273edff37/dpdk/drivers/net/softnic/rte_eth_softnic_tm.c:2574:6: warning: initialized field overwritten [-Woverride-init]
--
     .tb_size = n->shaper_profile->params.peak.size,
                {                                  }
/root/UB1804-64_K4.15.0_GCC7.3.0/x86_64-native-linuxapp-gcc/a97f7ee35f494d71a9427a4273edff37/dpdk/drivers/net/softnic/rte_eth_softnic_tm.c: In function ‘update_subport_rate’:
/root/UB1804-64_K4.15.0_GCC7.3.0/x86_64-native-linuxapp-gcc/a97f7ee35f494d71a9427a4273edff37/dpdk/drivers/net/softnic/rte_eth_softnic_tm.c:2838:16: error: ‘struct rte_sched_subport_params’ has no member named ‘tb_rate’
  subport_params.tb_rate = sp->params.peak.rate;
                ^
/root/UB1804-64_K4.15.0_GCC7.3.0/x86_64-native-linuxapp-gcc/a97f7ee35f494d71a9427a4273edff37/dpdk/drivers/net/softnic/rte_eth_softnic_tm.c:2839:17: error: ‘struct rte_sched_subport_params’ has no member named ‘tb_size’; did you mean ‘qsize’?
  subport_params.tb_size = sp->params.peak.size;
                 ^~~~~~~
                 qsize
/root/UB1804-64_K4.15.0_GCC7.3.0/x86_64-native-linuxapp-gcc/a97f7ee35f494d71a9427a4273edff37/dpdk/drivers/net/softnic/rte_eth_softnic_tm.c: At top level:
cc1: warning: unrecognized command line option ‘-Wno-address-of-packed-member’
/root/UB1804-64_K4.15.0_GCC7.3.0/x86_64-native-linuxapp-gcc/a97f7ee35f494d71a9427a4273edff37/dpdk/mk/internal/rte.compile-pre.mk:114: recipe for target 'rte_eth_softnic_tm.o' failed
make[6]: *** [rte_eth_softnic_tm.o] Error 1
/root/UB1804-64_K4.15.0_GCC7.3.0/x86_64-native-linuxapp-gcc/a97f7ee35f494d71a9427a4273edff37/dpdk/mk/rte.subdir.mk:35: recipe for target 'softnic' failed
make[5]: *** [softnic] Error 2
make[5]: *** Waiting for unfinished jobs....
  CC otx2_rss.o
  CC otx2_tm.o
--
  INSTALL-LIB librte_pmd_qede.a
  AR librte_pmd_sfc_efx.a
  INSTALL-LIB librte_pmd_sfc_efx.a
/root/UB1804-64_K4.15.0_GCC7.3.0/x86_64-native-linuxapp-gcc/a97f7ee35f494d71a9427a4273edff37/dpdk/mk/rte.subdir.mk:35: recipe for target 'net' failed
make[4]: *** [net] Error 2
/root/UB1804-64_K4.15.0_GCC7.3.0/x86_64-native-linuxapp-gcc/a97f7ee35f494d71a9427a4273edff37/dpdk/mk/rte.sdkbuild.mk:51: recipe for target 'drivers' failed
make[3]: *** [drivers] Error 2
/root/UB1804-64_K4.15.0_GCC7.3.0/x86_64-native-linuxapp-gcc/a97f7ee35f494d71a9427a4273edff37/dpdk/mk/rte.sdkroot.mk:113: recipe for target 'all' failed
make[2]: *** [all] Error 2
/root/UB1804-64_K4.15.0_GCC7.3.0/x86_64-native-linuxapp-gcc/a97f7ee35f494d71a9427a4273edff37/dpdk/mk/rte.sdkinstall.mk:60: recipe for target 'pre_install' failed
make[1]: *** [pre_install] Error 2
/root/UB1804-64_K4.15.0_GCC7.3.0/x86_64-native-linuxapp-gcc/a97f7ee35f494d71a9427a4273edff37/dpdk/mk/rte.sdkroot.mk:92: recipe for target 'install' failed
make: *** [install] Error 2


*Makefile Build Failed #17:
OS: UB2004-32
Target: i686-native-linuxapp-gcc
  CC bnxt_vnic.o
  CC i40e_tm.o
/root/UB2004-32_K4.15.0_GCC9.3.0/i686-native-linuxapp-gcc/a97f7ee35f494d71a9427a4273edff37/dpdk/drivers/net/softnic/rte_eth_softnic_tm.c: In function ‘update_subport_tc_rate’:
/root/UB2004-32_K4.15.0_GCC9.3.0/i686-native-linuxapp-gcc/a97f7ee35f494d71a9427a4273edff37/dpdk/drivers/net/softnic/rte_eth_softnic_tm.c:1068:16: error: ‘struct rte_sched_subport_params’ has no member named ‘tc_rate’
 1068 |  subport_params.tc_rate[tc_id] = sp_new->params.peak.rate;
      |                ^
/root/UB2004-32_K4.15.0_GCC9.3.0/i686-native-linuxapp-gcc/a97f7ee35f494d71a9427a4273edff37/dpdk/drivers/net/softnic/rte_eth_softnic_tm.c:1052:11: warning: variable ‘tc_id’ set but not used [-Wunused-but-set-variable]
 1052 |  uint32_t tc_id = tm_node_tc_id(dev, nt);
      |           ^~~~~
/root/UB2004-32_K4.15.0_GCC9.3.0/i686-native-linuxapp-gcc/a97f7ee35f494d71a9427a4273edff37/dpdk/drivers/net/softnic/rte_eth_softnic_tm.c: In function ‘hierarchy_blueprints_create’:
/root/UB2004-32_K4.15.0_GCC9.3.0/i686-native-linuxapp-gcc/a97f7ee35f494d71a9427a4273edff37/dpdk/drivers/net/softnic/rte_eth_softnic_tm.c:2555:6: error: ‘struct rte_sched_subport_params’ has no member named ‘tb_rate’
 2555 |     .tb_rate = n->shaper_profile->params.peak.rate,
      |      ^~~~~~~
/root/UB2004-32_K4.15.0_GCC9.3.0/i686-native-linuxapp-gcc/a97f7ee35f494d71a9427a4273edff37/dpdk/drivers/net/softnic/rte_eth_softnic_tm.c:2556:6: error: ‘struct rte_sched_subport_params’ has no member named ‘tb_size’; did you mean ‘qsize’?
 2556 |     .tb_size = n->shaper_profile->params.peak.size,
      |      ^~~~~~~
      |      qsize
/root/UB2004-32_K4.15.0_GCC9.3.0/i686-native-linuxapp-gcc/a97f7ee35f494d71a9427a4273edff37/dpdk/drivers/net/softnic/rte_eth_softnic_tm.c:2558:6: error: ‘struct rte_sched_subport_params’ has no member named ‘tc_rate’
 2558 |     .tc_rate = {tc_rate[0],
      |      ^~~~~~~
/root/UB2004-32_K4.15.0_GCC9.3.0/i686-native-linuxapp-gcc/a97f7ee35f494d71a9427a4273edff37/dpdk/drivers/net/softnic/rte_eth_softnic_tm.c:2558:5: warning: braces around scalar initializer
--
 2555 |     .tb_rate = n->shaper_profile->params.peak.rate,
 2556 |     .tb_size = n->shaper_profile->params.peak.size,
      |                {                                  }
/root/UB2004-32_K4.15.0_GCC9.3.0/i686-native-linuxapp-gcc/a97f7ee35f494d71a9427a4273edff37/dpdk/drivers/net/softnic/rte_eth_softnic_tm.c:2572:6: error: ‘struct rte_sched_subport_params’ has no member named ‘tc_period’
 2572 |     .tc_period = SUBPORT_TC_PERIOD,
      |      ^~~~~~~~~
/root/UB2004-32_K4.15.0_GCC9.3.0/i686-native-linuxapp-gcc/a97f7ee35f494d71a9427a4273edff37/dpdk/drivers/net/softnic/rte_eth_softnic_tm.c:2574:6: warning: initialized field overwritten [-Woverride-init]
--
 2556 |     .tb_size = n->shaper_profile->params.peak.size,
      |                {                                  }
/root/UB2004-32_K4.15.0_GCC9.3.0/i686-native-linuxapp-gcc/a97f7ee35f494d71a9427a4273edff37/dpdk/drivers/net/softnic/rte_eth_softnic_tm.c: In function ‘update_subport_rate’:
/root/UB2004-32_K4.15.0_GCC9.3.0/i686-native-linuxapp-gcc/a97f7ee35f494d71a9427a4273edff37/dpdk/drivers/net/softnic/rte_eth_softnic_tm.c:2838:16: error: ‘struct rte_sched_subport_params’ has no member named ‘tb_rate’
 2838 |  subport_params.tb_rate = sp->params.peak.rate;
      |                ^
/root/UB2004-32_K4.15.0_GCC9.3.0/i686-native-linuxapp-gcc/a97f7ee35f494d71a9427a4273edff37/dpdk/drivers/net/softnic/rte_eth_softnic_tm.c:2839:17: error: ‘struct rte_sched_subport_params’ has no member named ‘tb_size’; did you mean ‘qsize’?
 2839 |  subport_params.tb_size = sp->params.peak.size;
      |                 ^~~~~~~
      |                 qsize
make[6]: *** [/root/UB2004-32_K4.15.0_GCC9.3.0/i686-native-linuxapp-gcc/a97f7ee35f494d71a9427a4273edff37/dpdk/mk/internal/rte.compile-pre.mk:114: rte_eth_softnic_tm.o] Error 1
make[5]: *** [/root/UB2004-32_K4.15.0_GCC9.3.0/i686-native-linuxapp-gcc/a97f7ee35f494d71a9427a4273edff37/dpdk/mk/rte.subdir.mk:35: softnic] Error 2
make[5]: *** Waiting for unfinished jobs....
  CC i40e_vf_representor.o
  PMDINFO virtio_user_ethdev.o.pmd.c
--
  INSTALL-LIB librte_pmd_octeontx2.a
  AR librte_pmd_qede.a
  INSTALL-LIB librte_pmd_qede.a
make[4]: *** [/root/UB2004-32_K4.15.0_GCC9.3.0/i686-native-linuxapp-gcc/a97f7ee35f494d71a9427a4273edff37/dpdk/mk/rte.subdir.mk:35: net] Error 2
make[3]: *** [/root/UB2004-32_K4.15.0_GCC9.3.0/i686-native-linuxapp-gcc/a97f7ee35f494d71a9427a4273edff37/dpdk/mk/rte.sdkbuild.mk:53: drivers] Error 2
make[2]: *** [/root/UB2004-32_K4.15.0_GCC9.3.0/i686-native-linuxapp-gcc/a97f7ee35f494d71a9427a4273edff37/dpdk/mk/rte.sdkroot.mk:115: all] Error 2
make[1]: *** [/root/UB2004-32_K4.15.0_GCC9.3.0/i686-native-linuxapp-gcc/a97f7ee35f494d71a9427a4273edff37/dpdk/mk/rte.sdkinstall.mk:61: pre_install] Error 2
make: *** [/root/UB2004-32_K4.15.0_GCC9.3.0/i686-native-linuxapp-gcc/a97f7ee35f494d71a9427a4273edff37/dpdk/mk/rte.sdkroot.mk:92: install] Error 2


*Makefile Build Failed #18:
OS: UB2004-64
Target: x86_64-native-linuxapp-clang
  CC bnxt_txr.o
  CC rte_eth_softnic_tap.o
  CC virtio_rxtx_simple_sse.o
/root/UB2004-64_K5.4.0_Clang10.0.0/x86_64-native-linuxapp-clang/a97f7ee35f494d71a9427a4273edff37/dpdk/drivers/net/softnic/rte_eth_softnic_tm.c:1068:17: error: no member named 'tc_rate' in 'struct rte_sched_subport_params'
        subport_params.tc_rate[tc_id] = sp_new->params.peak.rate;
        ~~~~~~~~~~~~~~ ^
/root/UB2004-64_K5.4.0_Clang10.0.0/x86_64-native-linuxapp-clang/a97f7ee35f494d71a9427a4273edff37/dpdk/drivers/net/softnic/rte_eth_softnic_tm.c:2555:6: error: field designator 'tb_rate' does not refer to any field in type 'struct rte_sched_subport_params'
                                .tb_rate = n->shaper_profile->params.peak.rate,
                                 ^
/root/UB2004-64_K5.4.0_Clang10.0.0/x86_64-native-linuxapp-clang/a97f7ee35f494d71a9427a4273edff37/dpdk/drivers/net/softnic/rte_eth_softnic_tm.c:2556:6: error: field designator 'tb_size' does not refer to any field in type 'struct rte_sched_subport_params'
                                .tb_size = n->shaper_profile->params.peak.size,
                                 ^
/root/UB2004-64_K5.4.0_Clang10.0.0/x86_64-native-linuxapp-clang/a97f7ee35f494d71a9427a4273edff37/dpdk/drivers/net/softnic/rte_eth_softnic_tm.c:2558:6: error: field designator 'tc_rate' does not refer to any field in type 'struct rte_sched_subport_params'
                                .tc_rate = {tc_rate[0],
                                 ^
/root/UB2004-64_K5.4.0_Clang10.0.0/x86_64-native-linuxapp-clang/a97f7ee35f494d71a9427a4273edff37/dpdk/drivers/net/softnic/rte_eth_softnic_tm.c:2572:6: error: field designator 'tc_period' does not refer to any field in type 'struct rte_sched_subport_params'
                                .tc_period = SUBPORT_TC_PERIOD,
                                 ^
/root/UB2004-64_K5.4.0_Clang10.0.0/x86_64-native-linuxapp-clang/a97f7ee35f494d71a9427a4273edff37/dpdk/drivers/net/softnic/rte_eth_softnic_tm.c:2838:17: error: no member named 'tb_rate' in 'struct rte_sched_subport_params'
        subport_params.tb_rate = sp->params.peak.rate;
        ~~~~~~~~~~~~~~ ^
/root/UB2004-64_K5.4.0_Clang10.0.0/x86_64-native-linuxapp-clang/a97f7ee35f494d71a9427a4273edff37/dpdk/drivers/net/softnic/rte_eth_softnic_tm.c:2839:17: error: no member named 'tb_size' in 'struct rte_sched_subport_params'
        subport_params.tb_size = sp->params.peak.size;
        ~~~~~~~~~~~~~~ ^
7 errors generated.
make[6]: *** [/root/UB2004-64_K5.4.0_Clang10.0.0/x86_64-native-linuxapp-clang/a97f7ee35f494d71a9427a4273edff37/dpdk/mk/internal/rte.compile-pre.mk:116: rte_eth_softnic_tm.o] Error 1
make[6]: *** Waiting for unfinished jobs....
  CC bnxt_vnic.o
  CC ixgbe_ipsec.o
  CC sfc_flow.o
  CC ice_switch_filter.o
make[5]: *** [/root/UB2004-64_K5.4.0_Clang10.0.0/x86_64-native-linuxapp-clang/a97f7ee35f494d71a9427a4273edff37/dpdk/mk/rte.subdir.mk:35: softnic] Error 2
make[5]: *** Waiting for unfinished jobs....
  CC ice_fdir_filter.o
  CC virtio_rxtx_packed_avx.o
--
  CC medford2_nic.o
  AR librte_pmd_sfc_efx.a
  INSTALL-LIB librte_pmd_sfc_efx.a
make[4]: *** [/root/UB2004-64_K5.4.0_Clang10.0.0/x86_64-native-linuxapp-clang/a97f7ee35f494d71a9427a4273edff37/dpdk/mk/rte.subdir.mk:35: net] Error 2
make[3]: *** [/root/UB2004-64_K5.4.0_Clang10.0.0/x86_64-native-linuxapp-clang/a97f7ee35f494d71a9427a4273edff37/dpdk/mk/rte.sdkbuild.mk:51: drivers] Error 2
make[2]: *** [/root/UB2004-64_K5.4.0_Clang10.0.0/x86_64-native-linuxapp-clang/a97f7ee35f494d71a9427a4273edff37/dpdk/mk/rte.sdkroot.mk:115: all] Error 2
make[1]: *** [/root/UB2004-64_K5.4.0_Clang10.0.0/x86_64-native-linuxapp-clang/a97f7ee35f494d71a9427a4273edff37/dpdk/mk/rte.sdkinstall.mk:61: pre_install] Error 2
make: *** [/root/UB2004-64_K5.4.0_Clang10.0.0/x86_64-native-linuxapp-clang/a97f7ee35f494d71a9427a4273edff37/dpdk/mk/rte.sdkroot.mk:92: install] Error 2


*Makefile Build Failed #19:
OS: UB2004-64
Target: x86_64-native-linuxapp-gcc
  CC efx_filter.o
  CC efx_hash.o
/root/UB2004-64_K5.4.0_GCC9.3.0/x86_64-native-linuxapp-gcc/a97f7ee35f494d71a9427a4273edff37/dpdk/drivers/net/softnic/rte_eth_softnic_tm.c: In function ‘update_subport_tc_rate’:
/root/UB2004-64_K5.4.0_GCC9.3.0/x86_64-native-linuxapp-gcc/a97f7ee35f494d71a9427a4273edff37/dpdk/drivers/net/softnic/rte_eth_softnic_tm.c:1068:16: error: ‘struct rte_sched_subport_params’ has no member named ‘tc_rate’
 1068 |  subport_params.tc_rate[tc_id] = sp_new->params.peak.rate;
      |                ^
/root/UB2004-64_K5.4.0_GCC9.3.0/x86_64-native-linuxapp-gcc/a97f7ee35f494d71a9427a4273edff37/dpdk/drivers/net/softnic/rte_eth_softnic_tm.c:1052:11: warning: variable ‘tc_id’ set but not used [-Wunused-but-set-variable]
 1052 |  uint32_t tc_id = tm_node_tc_id(dev, nt);
      |           ^~~~~
/root/UB2004-64_K5.4.0_GCC9.3.0/x86_64-native-linuxapp-gcc/a97f7ee35f494d71a9427a4273edff37/dpdk/drivers/net/softnic/rte_eth_softnic_tm.c: In function ‘hierarchy_blueprints_create’:
/root/UB2004-64_K5.4.0_GCC9.3.0/x86_64-native-linuxapp-gcc/a97f7ee35f494d71a9427a4273edff37/dpdk/drivers/net/softnic/rte_eth_softnic_tm.c:2555:6: error: ‘struct rte_sched_subport_params’ has no member named ‘tb_rate’
 2555 |     .tb_rate = n->shaper_profile->params.peak.rate,
      |      ^~~~~~~
/root/UB2004-64_K5.4.0_GCC9.3.0/x86_64-native-linuxapp-gcc/a97f7ee35f494d71a9427a4273edff37/dpdk/drivers/net/softnic/rte_eth_softnic_tm.c:2556:6: error: ‘struct rte_sched_subport_params’ has no member named ‘tb_size’; did you mean ‘qsize’?
 2556 |     .tb_size = n->shaper_profile->params.peak.size,
      |      ^~~~~~~
      |      qsize
/root/UB2004-64_K5.4.0_GCC9.3.0/x86_64-native-linuxapp-gcc/a97f7ee35f494d71a9427a4273edff37/dpdk/drivers/net/softnic/rte_eth_softnic_tm.c:2558:6: error: ‘struct rte_sched_subport_params’ has no member named ‘tc_rate’
 2558 |     .tc_rate = {tc_rate[0],
      |      ^~~~~~~
/root/UB2004-64_K5.4.0_GCC9.3.0/x86_64-native-linuxapp-gcc/a97f7ee35f494d71a9427a4273edff37/dpdk/drivers/net/softnic/rte_eth_softnic_tm.c:2558:5: warning: braces around scalar initializer
--
 2555 |     .tb_rate = n->shaper_profile->params.peak.rate,
 2556 |     .tb_size = n->shaper_profile->params.peak.size,
      |                {                                  }
/root/UB2004-64_K5.4.0_GCC9.3.0/x86_64-native-linuxapp-gcc/a97f7ee35f494d71a9427a4273edff37/dpdk/drivers/net/softnic/rte_eth_softnic_tm.c:2572:6: error: ‘struct rte_sched_subport_params’ has no member named ‘tc_period’
 2572 |     .tc_period = SUBPORT_TC_PERIOD,
      |      ^~~~~~~~~
/root/UB2004-64_K5.4.0_GCC9.3.0/x86_64-native-linuxapp-gcc/a97f7ee35f494d71a9427a4273edff37/dpdk/drivers/net/softnic/rte_eth_softnic_tm.c:2574:6: warning: initialized field overwritten [-Woverride-init]
--
 2556 |     .tb_size = n->shaper_profile->params.peak.size,
      |                {                                  }
/root/UB2004-64_K5.4.0_GCC9.3.0/x86_64-native-linuxapp-gcc/a97f7ee35f494d71a9427a4273edff37/dpdk/drivers/net/softnic/rte_eth_softnic_tm.c: In function ‘update_subport_rate’:
/root/UB2004-64_K5.4.0_GCC9.3.0/x86_64-native-linuxapp-gcc/a97f7ee35f494d71a9427a4273edff37/dpdk/drivers/net/softnic/rte_eth_softnic_tm.c:2838:16: error: ‘struct rte_sched_subport_params’ has no member named ‘tb_rate’
 2838 |  subport_params.tb_rate = sp->params.peak.rate;
      |                ^
/root/UB2004-64_K5.4.0_GCC9.3.0/x86_64-native-linuxapp-gcc/a97f7ee35f494d71a9427a4273edff37/dpdk/drivers/net/softnic/rte_eth_softnic_tm.c:2839:17: error: ‘struct rte_sched_subport_params’ has no member named ‘tb_size’; did you mean ‘qsize’?
 2839 |  subport_params.tb_size = sp->params.peak.size;
      |                 ^~~~~~~
      |                 qsize
make[6]: *** [/root/UB2004-64_K5.4.0_GCC9.3.0/x86_64-native-linuxapp-gcc/a97f7ee35f494d71a9427a4273edff37/dpdk/mk/internal/rte.compile-pre.mk:114: rte_eth_softnic_tm.o] Error 1
make[5]: *** [/root/UB2004-64_K5.4.0_GCC9.3.0/x86_64-native-linuxapp-gcc/a97f7ee35f494d71a9427a4273edff37/dpdk/mk/rte.subdir.mk:35: softnic] Error 2
make[5]: *** Waiting for unfinished jobs....
  CC efx_lic.o
  CC ecore_dcbx.o
--
  LD otx2_ethdev.o
  AR librte_pmd_octeontx2.a
  INSTALL-LIB librte_pmd_octeontx2.a
make[4]: *** [/root/UB2004-64_K5.4.0_GCC9.3.0/x86_64-native-linuxapp-gcc/a97f7ee35f494d71a9427a4273edff37/dpdk/mk/rte.subdir.mk:35: net] Error 2
make[3]: *** [/root/UB2004-64_K5.4.0_GCC9.3.0/x86_64-native-linuxapp-gcc/a97f7ee35f494d71a9427a4273edff37/dpdk/mk/rte.sdkbuild.mk:51: drivers] Error 2
make[2]: *** [/root/UB2004-64_K5.4.0_GCC9.3.0/x86_64-native-linuxapp-gcc/a97f7ee35f494d71a9427a4273edff37/dpdk/mk/rte.sdkroot.mk:115: all] Error 2
make[1]: *** [/root/UB2004-64_K5.4.0_GCC9.3.0/x86_64-native-linuxapp-gcc/a97f7ee35f494d71a9427a4273edff37/dpdk/mk/rte.sdkinstall.mk:61: pre_install] Error 2
make: *** [/root/UB2004-64_K5.4.0_GCC9.3.0/x86_64-native-linuxapp-gcc/a97f7ee35f494d71a9427a4273edff37/dpdk/mk/rte.sdkroot.mk:92: install] Error 2


*Makefile Build Failed #20:
OS: UB2004-64
Target: x86_64-native-linuxapp-icc
  INSTALL-LIB librte_pmd_vmxnet3_uio.a
  CC bnxt_reps.o
  CC rte_eth_softnic_tap.o
/root/UB2004-64_K5.4.0_ICC19.1.0/x86_64-native-linuxapp-icc/a97f7ee35f494d71a9427a4273edff37/dpdk/drivers/net/softnic/rte_eth_softnic_tm.c(1068): error: struct "rte_sched_subport_params" has no field "tc_rate"
  	subport_params.tc_rate[tc_id] = sp_new->params.peak.rate;
  	               ^

/root/UB2004-64_K5.4.0_ICC19.1.0/x86_64-native-linuxapp-icc/a97f7ee35f494d71a9427a4273edff37/dpdk/drivers/net/softnic/rte_eth_softnic_tm.c(2555): error: struct "rte_sched_subport_params" has no field "tb_rate"
  				.tb_rate = n->shaper_profile->params.peak.rate,
  				 ^

/root/UB2004-64_K5.4.0_ICC19.1.0/x86_64-native-linuxapp-icc/a97f7ee35f494d71a9427a4273edff37/dpdk/drivers/net/softnic/rte_eth_softnic_tm.c(2838): error: struct "rte_sched_subport_params" has no field "tb_rate"
  	subport_params.tb_rate = sp->params.peak.rate;
  	               ^

/root/UB2004-64_K5.4.0_ICC19.1.0/x86_64-native-linuxapp-icc/a97f7ee35f494d71a9427a4273edff37/dpdk/drivers/net/softnic/rte_eth_softnic_tm.c(2839): error: struct "rte_sched_subport_params" has no field "tb_size"
  	subport_params.tb_size = sp->params.peak.size;
  	               ^

compilation aborted for /root/UB2004-64_K5.4.0_ICC19.1.0/x86_64-native-linuxapp-icc/a97f7ee35f494d71a9427a4273edff37/dpdk/drivers/net/softnic/rte_eth_softnic_tm.c (code 2)
make[6]: *** [/root/UB2004-64_K5.4.0_ICC19.1.0/x86_64-native-linuxapp-icc/a97f7ee35f494d71a9427a4273edff37/dpdk/mk/internal/rte.compile-pre.mk:116: rte_eth_softnic_tm.o] Error 2
make[6]: *** Waiting for unfinished jobs....
  CC rte_pmd_bnxt.o
  PMDINFO nicvf_ethdev.o.pmd.c
  CC nicvf_ethdev.o.pmd.o
  CC ecore_spq.o
make[5]: *** [/root/UB2004-64_K5.4.0_ICC19.1.0/x86_64-native-linuxapp-icc/a97f7ee35f494d71a9427a4273edff37/dpdk/mk/rte.subdir.mk:35: softnic] Error 2
make[5]: *** Waiting for unfinished jobs....
  CC tap_netlink.o
  LD nicvf_ethdev.o
--
  INSTALL-LIB librte_pmd_qede.a
  AR librte_pmd_octeontx2.a
  INSTALL-LIB librte_pmd_octeontx2.a
make[4]: *** [/root/UB2004-64_K5.4.0_ICC19.1.0/x86_64-native-linuxapp-icc/a97f7ee35f494d71a9427a4273edff37/dpdk/mk/rte.subdir.mk:35: net] Error 2
make[3]: *** [/root/UB2004-64_K5.4.0_ICC19.1.0/x86_64-native-linuxapp-icc/a97f7ee35f494d71a9427a4273edff37/dpdk/mk/rte.sdkbuild.mk:51: drivers] Error 2
make[2]: *** [/root/UB2004-64_K5.4.0_ICC19.1.0/x86_64-native-linuxapp-icc/a97f7ee35f494d71a9427a4273edff37/dpdk/mk/rte.sdkroot.mk:115: all] Error 2
make[1]: *** [/root/UB2004-64_K5.4.0_ICC19.1.0/x86_64-native-linuxapp-icc/a97f7ee35f494d71a9427a4273edff37/dpdk/mk/rte.sdkinstall.mk:61: pre_install] Error 2
make: *** [/root/UB2004-64_K5.4.0_ICC19.1.0/x86_64-native-linuxapp-icc/a97f7ee35f494d71a9427a4273edff37/dpdk/mk/rte.sdkroot.mk:92: install] Error 2
DPDK STV team


More information about the test-report mailing list