[dpdk-test-report] |FAILURE| pw(77133) [v5, 2/2] gro: add VXLAN UDP GRO support

sys_stv at intel.com sys_stv at intel.com
Mon Sep 14 08:18:03 CEST 2020


Test-Label: Intel-compilation
Test-Status: FAILURE
http://dpdk.org/patch/77133

_Compilation issues_

Submitter: yang_y_yi <yang_y_yi at 163.com>
Date: 2020-09-10 09:29:14
Reply_mail: 20200910092914.120452-3-yang_y_yi at 163.com

DPDK git baseline: Repo:dpdk, CommitID: 25efc61539603dbe634cd1a5b84c956c55893e41


Build Summary: 22 Builds Done, 1 Successful, 21 Failures, 0 Blocked

+----------------+------------+--------------+------------+------------+-----------+----------+
| os             | gcc-static | clang-static | icc-static | gcc-shared | gcc-debug | document |
+----------------+------------+--------------+------------+------------+-----------+----------+
| CENTOS82-64    | FAIL       | FAIL         | FAIL       | FAIL       | FAIL      |          |
| RHEL82-64      | FAIL       |              |            |            |           |          |
| UB1804-64      | FAIL       |              |            |            |           |          |
| FC32-64        | FAIL       | FAIL         |            |            |           |          |
| CENTOS77-64    | FAIL       |              |            |            |           |          |
| UB2004-64      | FAIL       | FAIL         | FAIL       |            |           | FAIL     |
| WIN10-64       |            | pass         |            |            |           |          |
| UB2004-32      | FAIL       |              |            |            |           |          |
| FreeBSD1201-64 | FAIL       | FAIL         |            | FAIL       | FAIL      |          |
| SUSE15-64      | FAIL       | FAIL         |            |            |           |          |
+----------------+------------+--------------+------------+------------+-----------+----------+
Test environment and configuration as below:
** Meson build **



OS: CENTOS82-64
	Kernel Version: 4.18.0-193.el8.x86_64
	CPU info: Intel(R) Xeon(R) Platinum 8280M CPU @ 2.70GHz
	GCC Version: gcc (GCC) 8.3.1 20191121 (Red Hat 8.3.1-5)
	Clang Version: 9.0.1 (Red Hat 9.0.1-2.module_el8.2.0+309+0c7b6b03)
	x86_64-gcc-static
	x86_64-clang-static
	x86_64-icc-static
	x86_64-gcc-shared
	x86_64-gcc-debug


OS: RHEL82-64
	Kernel Version: 4.18.0-193.el8.x86_64
	CPU info: Intel(R) Xeon(R) Platinum 8280M CPU @ 2.70GHz
	GCC Version: gcc (GCC) 8.3.1 20191121 (Red Hat 8.3.1-5)
	Clang Version: 8.0.1 (Red Hat 8.0.1-1.module_el8.1.0+215+a01033fb)
	x86_64-gcc-static


OS: UB1804-64
	Kernel Version: 5.3.0-59-generic
	CPU info: Intel(R) Xeon(R) Platinum 8180 CPU @ 2.50GHz
	GCC Version: gcc (Ubuntu 8.4.0-1ubuntu1~18.04) 8.4.0
	Clang Version: 6.0.0-1ubuntu2 (tags/RELEASE_600/final)
	x86_64-gcc-static


OS: FC32-64
	Kernel Version: 5.6.0-0.rc7.git0.2.fc32.x86_64
	CPU info: Intel(R) Xeon(R) Platinum 8280M CPU @ 2.70GHz
	GCC Version: gcc (GCC) 10.0.1 20200311 (Red Hat 10.0.1-0.9)
	Clang Version: 10.0.0 (Fedora 10.0.0-0.3.rc4.fc32)
	x86_64-gcc-static
	x86_64-clang-static


OS: CENTOS77-64
	Kernel Version: 3.10.0-1062.9.1.el7.x86_64
	CPU info: Intel(R) Xeon(R) Platinum 8280M CPU @ 2.70GHz
	GCC Version: gcc (GCC) 4.8.5 20150623 (Red Hat 4.8.5-39)
	Clang Version: 3.4.2 (tags/RELEASE_34/dot2-final)
	x86_64-gcc-static


OS: UB2004-64
	Kernel Version: 5.4.0-26-generic
	CPU info: Intel(R) Xeon(R) Platinum 8180 CPU @ 2.50GHz
	GCC Version: gcc (Ubuntu 10-20200416-0ubuntu1) 10.0.1 20200416 (experimental) [master revision 3c3f12e2a76:dcee354ce56:44b326839d864fc10c459916abcc97f35a9ac3de]
	Clang Version: 10.0.0-4ubuntu1
	x86_64-clang-static
	x86_64-gcc-static
	x86_64-icc-static
	x86_64-gcc-doc


OS: WIN10-64
	Kernel Version: N/A
	CPU info: N/A
	GCC Version: N/A
	Clang Version: Clang 8.0.0
	x86_64-windows-clang


OS: UB2004-32
	Kernel Version: 5.4.0-26-generic
	CPU info: Intel(R) Xeon(R) Platinum 8180 CPU @ 2.50GHz
	GCC Version: gcc (Ubuntu 9.3.0-10ubuntu2) 9.3.0
	Clang Version: 10.0.0-4ubuntu1
	i686-gcc-static


OS: FreeBSD1201-64
	Kernel Version: 12.1-RELEASE
	CPU info: Intel(R) Xeon(R) CPU E5-2699 v3 @ 2.30GHz (2294.74-MHz K8-class CPU)
	GCC Version: gcc (FreeBSD Ports Collection) 9.2.0
	Clang Version: 8.0.1 (tags/RELEASE_801/final 366581) (based on LLVM 8.0.1)
	x86_64-gcc-static
	x86_64-clang-static
	x86_64-gcc-shared
	x86_64-gcc-debug


OS: SUSE15-64
	Kernel Version: 4.12.14-lp150.11-default
	CPU info: Intel(R) Xeon(R) CPU E5-2699 v4 @ 2.20GHz
	GCC Version: gcc (SUSE Linux) 7.3.1 20180323 [gcc-7-branch revision 258812]
	Clang Version: 5.0.1 (tags/RELEASE_501/final 312548)
	x86_64-clang-static
	x86_64-gcc-static



*Build Failed #1:
OS: CENTOS77-64
Target: x86_64-gcc-static
FAILED: lib/76b5a35@@rte_gro at sta/librte_gro_gro_vxlan_udp4.c.o 
gcc -Ilib/76b5a35@@rte_gro at sta -Ilib -I../lib -Ilib/librte_gro -I../lib/librte_gro -I. -I../ -Iconfig -I../config -Ilib/librte_eal/include -I../lib/librte_eal/include -Ilib/librte_eal/linux/include -I../lib/librte_eal/linux/include -Ilib/librte_eal/x86/include -I../lib/librte_eal/x86/include -Ilib/librte_eal/common -I../lib/librte_eal/common -Ilib/librte_eal -I../lib/librte_eal -Ilib/librte_kvargs -I../lib/librte_kvargs -Ilib/librte_telemetry/../librte_metrics -I../lib/librte_telemetry/../librte_metrics -Ilib/librte_telemetry -I../lib/librte_telemetry -Ilib/librte_ethdev -I../lib/librte_ethdev -Ilib/librte_net -I../lib/librte_net -Ilib/librte_mbuf -I../lib/librte_mbuf -Ilib/librte_mempool -I../lib/librte_mempool -Ilib/librte_ring -I../lib/librte_ring -Ilib/librte_meter -I../lib/librte_meter -pipe -D_FILE_OFFSET_BITS=64 -Wall -Winvalid-pch -Werror -O3 -include rte_config.h -Wextra -Wcast-qual -Wdeprecated -Wformat-nonliteral -Wformat-security -Wmissing-declarations -Wmissing-prototypes -Wnested-externs -Wold-style-definition -Wpointer-arith -Wsign-compare -Wstrict-prototypes -Wundef -Wwrite-strings -Wno-missing-field-initializers -D_GNU_SOURCE -fPIC -march=native -DALLOW_EXPERIMENTAL_API -DALLOW_INTERNAL_API -MD -MQ 'lib/76b5a35@@rte_gro at sta/librte_gro_gro_vxlan_udp4.c.o' -MF 'lib/76b5a35@@rte_gro at sta/librte_gro_gro_vxlan_udp4.c.o.d' -o 'lib/76b5a35@@rte_gro at sta/librte_gro_gro_vxlan_udp4.c.o' -c ../lib/librte_gro/gro_vxlan_udp4.c
../lib/librte_gro/gro_vxlan_udp4.c: In function ‘udp_check_vxlan_neighbor’:
../lib/librte_gro/gro_vxlan_udp4.c:216:2: error: implicit declaration of function ‘udp_check_neighbor’ [-Werror=implicit-function-declaration]
  cmp = udp_check_neighbor(&item->inner_item, frag_offset, ip_dl,
  ^
../lib/librte_gro/gro_vxlan_udp4.c:216:2: error: nested extern declaration of ‘udp_check_neighbor’ [-Werror=nested-externs]
cc1: all warnings being treated as errors
[249/2547] Compiling C object 'lib/76b5a35@@rte_gro at sta/librte_gro_gro_vxlan_tcp4.c.o'.
[250/2547] Compiling C object 'lib/76b5a35@@rte_gso at sta/librte_gso_gso_udp4.c.o'.
[251/2547] Compiling C object 'lib/76b5a35@@rte_gso at sta/librte_gso_gso_tcp4.c.o'.
[252/2547] Generating efd.sym_chk with a meson_exe.py custom command.
[253/2547] Compiling C object 'lib/76b5a35@@rte_gso at sta/librte_gso_gso_tunnel_tcp4.c.o'.
[254/2547] Generating cryptodev.sym_chk with a meson_exe.py custom command.
[255/2547] Generating eal.sym_chk with a meson_exe.py custom command.
[256/2547] Compiling C object 'lib/76b5a35@@rte_eventdev at sta/librte_eventdev_rte_event_crypto_adapter.c.o'.
[257/2547] Compiling C object 'lib/76b5a35@@rte_gso at sta/librte_gso_gso_common.c.o'.
ninja: build stopped: subcommand failed




*Build Failed #2:
OS: CENTOS82-64
Target: x86_64-gcc-static
FAILED: lib/76b5a35@@rte_gro at sta/librte_gro_gro_vxlan_udp4.c.o 
gcc -Ilib/76b5a35@@rte_gro at sta -Ilib -I../lib -Ilib/librte_gro -I../lib/librte_gro -I. -I../ -Iconfig -I../config -Ilib/librte_eal/include -I../lib/librte_eal/include -Ilib/librte_eal/linux/include -I../lib/librte_eal/linux/include -Ilib/librte_eal/x86/include -I../lib/librte_eal/x86/include -Ilib/librte_eal/common -I../lib/librte_eal/common -Ilib/librte_eal -I../lib/librte_eal -Ilib/librte_kvargs -I../lib/librte_kvargs -Ilib/librte_telemetry/../librte_metrics -I../lib/librte_telemetry/../librte_metrics -Ilib/librte_telemetry -I../lib/librte_telemetry -Ilib/librte_ethdev -I../lib/librte_ethdev -Ilib/librte_net -I../lib/librte_net -Ilib/librte_mbuf -I../lib/librte_mbuf -Ilib/librte_mempool -I../lib/librte_mempool -Ilib/librte_ring -I../lib/librte_ring -Ilib/librte_meter -I../lib/librte_meter -fdiagnostics-color=always -pipe -D_FILE_OFFSET_BITS=64 -Wall -Winvalid-pch -Werror -O3 -include rte_config.h -Wextra -Wcast-qual -Wdeprecated -Wformat-nonliteral -Wformat-security -Wmissing-declarations -Wmissing-prototypes -Wnested-externs -Wold-style-definition -Wpointer-arith -Wsign-compare -Wstrict-prototypes -Wundef -Wwrite-strings -Wno-packed-not-aligned -Wno-missing-field-initializers -D_GNU_SOURCE -fPIC -march=native -mno-avx512f -DALLOW_EXPERIMENTAL_API -DALLOW_INTERNAL_API -Wno-format-truncation -MD -MQ 'lib/76b5a35@@rte_gro at sta/librte_gro_gro_vxlan_udp4.c.o' -MF 'lib/76b5a35@@rte_gro at sta/librte_gro_gro_vxlan_udp4.c.o.d' -o 'lib/76b5a35@@rte_gro at sta/librte_gro_gro_vxlan_udp4.c.o' -c ../lib/librte_gro/gro_vxlan_udp4.c
../lib/librte_gro/gro_vxlan_udp4.c: In function ‘udp_check_vxlan_neighbor’:
../lib/librte_gro/gro_vxlan_udp4.c:216:8: error: implicit declaration of function ‘udp_check_neighbor’; did you mean ‘udp4_check_neighbor’? [-Werror=implicit-function-declaration]
  cmp = udp_check_neighbor(&item->inner_item, frag_offset, ip_dl,
        ^~~~~~~~~~~~~~~~~~
        udp4_check_neighbor
../lib/librte_gro/gro_vxlan_udp4.c:216:8: error: nested extern declaration of ‘udp_check_neighbor’ [-Werror=nested-externs]
cc1: all warnings being treated as errors
[240/2580] Generating symbol file 'lib/76b5a35@@rte_ring at sha/librte_ring.so.21.0.symbols'.
[241/2580] Generating symbol file 'lib/76b5a35@@rte_meter at sha/librte_meter.so.21.0.symbols'.
[242/2580] Generating cryptodev.sym_chk with a meson_exe.py custom command.
[243/2580] Compiling C object 'lib/76b5a35@@rte_efd at sta/librte_efd_rte_efd.c.o'.
[244/2580] Generating symbol file 'lib/76b5a35@@rte_metrics at sha/librte_metrics.so.21.0.symbols'.
[245/2580] Generating symbol file 'lib/76b5a35@@rte_pci at sha/librte_pci.so.21.0.symbols'.
[246/2580] Compiling C object 'lib/76b5a35@@rte_eventdev at sta/librte_eventdev_rte_eventdev.c.o'.
[247/2580] Generating symbol file 'lib/76b5a35@@rte_timer at sha/librte_timer.so.21.0.symbols'.
[248/2580] Generating symbol file 'lib/76b5a35@@rte_acl at sha/librte_acl.so.21.0.symbols'.
ninja: build stopped: subcommand failed




*Build Failed #3:
OS: CENTOS82-64
Target: x86_64-clang-static
FAILED: lib/76b5a35@@rte_gro at sta/librte_gro_gro_vxlan_udp4.c.o 
clang -Ilib/76b5a35@@rte_gro at sta -Ilib -I../lib -Ilib/librte_gro -I../lib/librte_gro -I. -I../ -Iconfig -I../config -Ilib/librte_eal/include -I../lib/librte_eal/include -Ilib/librte_eal/linux/include -I../lib/librte_eal/linux/include -Ilib/librte_eal/x86/include -I../lib/librte_eal/x86/include -Ilib/librte_eal/common -I../lib/librte_eal/common -Ilib/librte_eal -I../lib/librte_eal -Ilib/librte_kvargs -I../lib/librte_kvargs -Ilib/librte_telemetry/../librte_metrics -I../lib/librte_telemetry/../librte_metrics -Ilib/librte_telemetry -I../lib/librte_telemetry -Ilib/librte_ethdev -I../lib/librte_ethdev -Ilib/librte_net -I../lib/librte_net -Ilib/librte_mbuf -I../lib/librte_mbuf -Ilib/librte_mempool -I../lib/librte_mempool -Ilib/librte_ring -I../lib/librte_ring -Ilib/librte_meter -I../lib/librte_meter -Xclang -fcolor-diagnostics -pipe -D_FILE_OFFSET_BITS=64 -Wall -Winvalid-pch -Werror -O3 -include rte_config.h -Wextra -Wcast-qual -Wdeprecated -Wformat-nonliteral -Wformat-security -Wmissing-declarations -Wmissing-prototypes -Wnested-externs -Wold-style-definition -Wpointer-arith -Wsign-compare -Wstrict-prototypes -Wundef -Wwrite-strings -Wno-address-of-packed-member -Wno-missing-field-initializers -D_GNU_SOURCE -fPIC -march=native -mno-avx512f -DALLOW_EXPERIMENTAL_API -DALLOW_INTERNAL_API -MD -MQ 'lib/76b5a35@@rte_gro at sta/librte_gro_gro_vxlan_udp4.c.o' -MF 'lib/76b5a35@@rte_gro at sta/librte_gro_gro_vxlan_udp4.c.o.d' -o 'lib/76b5a35@@rte_gro at sta/librte_gro_gro_vxlan_udp4.c.o' -c ../lib/librte_gro/gro_vxlan_udp4.c
../lib/librte_gro/gro_vxlan_udp4.c:216:8: error: implicit declaration of function 'udp_check_neighbor' is invalid in C99 [-Werror,-Wimplicit-function-declaration]
        cmp = udp_check_neighbor(&item->inner_item, frag_offset, ip_dl,
              ^
../lib/librte_gro/gro_vxlan_udp4.c:216:8: note: did you mean 'udp4_check_neighbor'?
../lib/librte_gro/gro_udp4.h:250:1: note: 'udp4_check_neighbor' declared here
udp4_check_neighbor(struct gro_udp4_item *item,
^
1 error generated.
[266/2580] Compiling C object 'lib/76b5a35@@rte_efd at sta/librte_efd_rte_efd.c.o'.
[267/2580] Generating symbol file 'lib/76b5a35@@rte_compressdev at sha/librte_compressdev.so.21.0.symbols'.
[268/2580] Generating symbol file 'lib/76b5a35@@rte_cryptodev at sha/librte_cryptodev.so.21.0.symbols'.
[269/2580] Generating distributor.sym_chk with a meson_exe.py custom command.
[270/2580] Compiling C object 'lib/76b5a35@@rte_eventdev at sta/librte_eventdev_rte_eventdev.c.o'.
[271/2580] Compiling C object 'lib/76b5a35@@rte_eventdev at sta/librte_eventdev_rte_event_timer_adapter.c.o'.
[272/2580] Compiling C object 'lib/76b5a35@@rte_eventdev at sta/librte_eventdev_rte_event_crypto_adapter.c.o'.
[273/2580] Compiling C object 'lib/76b5a35@@rte_eventdev at sta/librte_eventdev_rte_event_eth_tx_adapter.c.o'.
[274/2580] Compiling C object 'lib/76b5a35@@rte_eventdev at sta/librte_eventdev_rte_event_eth_rx_adapter.c.o'.
ninja: build stopped: subcommand failed




*Build Failed #4:
OS: CENTOS82-64
Target: x86_64-icc-static
FAILED: lib/76b5a35@@rte_gro at sta/librte_gro_gro_vxlan_udp4.c.o 
icc -Ilib/76b5a35@@rte_gro at sta -Ilib -I../lib -Ilib/librte_gro -I../lib/librte_gro -I. -I../ -Iconfig -I../config -Ilib/librte_eal/include -I../lib/librte_eal/include -Ilib/librte_eal/linux/include -I../lib/librte_eal/linux/include -Ilib/librte_eal/x86/include -I../lib/librte_eal/x86/include -Ilib/librte_eal/common -I../lib/librte_eal/common -Ilib/librte_eal -I../lib/librte_eal -Ilib/librte_kvargs -I../lib/librte_kvargs -Ilib/librte_telemetry/../librte_metrics -I../lib/librte_telemetry/../librte_metrics -Ilib/librte_telemetry -I../lib/librte_telemetry -Ilib/librte_ethdev -I../lib/librte_ethdev -Ilib/librte_net -I../lib/librte_net -Ilib/librte_mbuf -I../lib/librte_mbuf -Ilib/librte_mempool -I../lib/librte_mempool -Ilib/librte_ring -I../lib/librte_ring -Ilib/librte_meter -I../lib/librte_meter -pipe -D_FILE_OFFSET_BITS=64 -Wall -w3 -diag-disable:remark -Werror -O3 -include rte_config.h -Wextra -Wcast-qual -Wdeprecated -Wformat-security -Wmissing-declarations -Wmissing-prototypes -Wold-style-definition -Wpointer-arith -Wsign-compare -Wstrict-prototypes -Wundef -Wwrite-strings -Wno-missing-field-initializers -diag-disable=188 -diag-disable=2203 -diag-disable=2279 -diag-disable=2557 -diag-disable=3179 -diag-disable=3656 -D_GNU_SOURCE -fPIC -march=native -mno-avx512f -DALLOW_EXPERIMENTAL_API -DALLOW_INTERNAL_API -MD -MQ 'lib/76b5a35@@rte_gro at sta/librte_gro_gro_vxlan_udp4.c.o' -MF 'lib/76b5a35@@rte_gro at sta/librte_gro_gro_vxlan_udp4.c.o.d' -o 'lib/76b5a35@@rte_gro at sta/librte_gro_gro_vxlan_udp4.c.o' -c ../lib/librte_gro/gro_vxlan_udp4.c
../lib/librte_gro/gro_vxlan_udp4.c(216): error #266: function "udp_check_neighbor" declared implicitly
  	cmp = udp_check_neighbor(&item->inner_item, frag_offset, ip_dl,
  	      ^

compilation aborted for ../lib/librte_gro/gro_vxlan_udp4.c (code 2)
[249/2580] Compiling C object 'lib/76b5a35@@rte_bpf at sta/librte_bpf_bpf_exec.c.o'.
[250/2580] Compiling C object 'lib/76b5a35@@rte_eventdev at sta/librte_eventdev_rte_event_ring.c.o'.
[251/2580] Generating symbol file 'lib/76b5a35@@rte_mbuf at sha/librte_mbuf.so.21.0.symbols'.
[252/2580] Generating distributor.sym_chk with a meson_exe.py custom command.
[253/2580] Compiling C object 'lib/76b5a35@@rte_eventdev at sta/librte_eventdev_eventdev_trace_points.c.o'.
[254/2580] Compiling C object 'lib/76b5a35@@rte_eventdev at sta/librte_eventdev_rte_eventdev.c.o'.
[255/2580] Compiling C object 'lib/76b5a35@@rte_efd at sta/librte_efd_rte_efd.c.o'.
[256/2580] Compiling C object 'lib/76b5a35@@rte_eventdev at sta/librte_eventdev_rte_event_eth_rx_adapter.c.o'.
[257/2580] Compiling C object 'lib/76b5a35@@rte_ethdev at sta/librte_ethdev_rte_flow.c.o'.
ninja: build stopped: subcommand failed




*Build Failed #5:
OS: CENTOS82-64
Target: x86_64-gcc-shared
FAILED: lib/76b5a35@@rte_gro at sta/librte_gro_gro_vxlan_udp4.c.o 
gcc -Ilib/76b5a35@@rte_gro at sta -Ilib -I../lib -Ilib/librte_gro -I../lib/librte_gro -I. -I../ -Iconfig -I../config -Ilib/librte_eal/include -I../lib/librte_eal/include -Ilib/librte_eal/linux/include -I../lib/librte_eal/linux/include -Ilib/librte_eal/x86/include -I../lib/librte_eal/x86/include -Ilib/librte_eal/common -I../lib/librte_eal/common -Ilib/librte_eal -I../lib/librte_eal -Ilib/librte_kvargs -I../lib/librte_kvargs -Ilib/librte_telemetry/../librte_metrics -I../lib/librte_telemetry/../librte_metrics -Ilib/librte_telemetry -I../lib/librte_telemetry -Ilib/librte_ethdev -I../lib/librte_ethdev -Ilib/librte_net -I../lib/librte_net -Ilib/librte_mbuf -I../lib/librte_mbuf -Ilib/librte_mempool -I../lib/librte_mempool -Ilib/librte_ring -I../lib/librte_ring -Ilib/librte_meter -I../lib/librte_meter -fdiagnostics-color=always -pipe -D_FILE_OFFSET_BITS=64 -Wall -Winvalid-pch -Werror -O3 -include rte_config.h -Wextra -Wcast-qual -Wdeprecated -Wformat-nonliteral -Wformat-security -Wmissing-declarations -Wmissing-prototypes -Wnested-externs -Wold-style-definition -Wpointer-arith -Wsign-compare -Wstrict-prototypes -Wundef -Wwrite-strings -Wno-packed-not-aligned -Wno-missing-field-initializers -D_GNU_SOURCE -fPIC -march=native -mno-avx512f -DALLOW_EXPERIMENTAL_API -DALLOW_INTERNAL_API -Wno-format-truncation -MD -MQ 'lib/76b5a35@@rte_gro at sta/librte_gro_gro_vxlan_udp4.c.o' -MF 'lib/76b5a35@@rte_gro at sta/librte_gro_gro_vxlan_udp4.c.o.d' -o 'lib/76b5a35@@rte_gro at sta/librte_gro_gro_vxlan_udp4.c.o' -c ../lib/librte_gro/gro_vxlan_udp4.c
../lib/librte_gro/gro_vxlan_udp4.c: In function ‘udp_check_vxlan_neighbor’:
../lib/librte_gro/gro_vxlan_udp4.c:216:8: error: implicit declaration of function ‘udp_check_neighbor’; did you mean ‘udp4_check_neighbor’? [-Werror=implicit-function-declaration]
  cmp = udp_check_neighbor(&item->inner_item, frag_offset, ip_dl,
        ^~~~~~~~~~~~~~~~~~
        udp4_check_neighbor
../lib/librte_gro/gro_vxlan_udp4.c:216:8: error: nested extern declaration of ‘udp_check_neighbor’ [-Werror=nested-externs]
cc1: all warnings being treated as errors
[262/2609] Linking target lib/librte_net.so.21.0.
[263/2609] Linking target lib/librte_bbdev.so.21.0.
[264/2609] Compiling C object 'lib/76b5a35@@rte_eventdev at sta/librte_eventdev_rte_eventdev.c.o'.
[265/2609] Compiling C object 'lib/76b5a35@@rte_eventdev at sta/librte_eventdev_rte_event_timer_adapter.c.o'.
[266/2609] Compiling C object 'lib/76b5a35@@rte_eventdev at sta/librte_eventdev_rte_event_eth_rx_adapter.c.o'.
ninja: build stopped: subcommand failed




*Build Failed #6:
OS: CENTOS82-64
Target: x86_64-gcc-debug
FAILED: lib/76b5a35@@rte_gro at sta/librte_gro_gro_vxlan_udp4.c.o 
gcc -Ilib/76b5a35@@rte_gro at sta -Ilib -I../lib -Ilib/librte_gro -I../lib/librte_gro -I. -I../ -Iconfig -I../config -Ilib/librte_eal/include -I../lib/librte_eal/include -Ilib/librte_eal/linux/include -I../lib/librte_eal/linux/include -Ilib/librte_eal/x86/include -I../lib/librte_eal/x86/include -Ilib/librte_eal/common -I../lib/librte_eal/common -Ilib/librte_eal -I../lib/librte_eal -Ilib/librte_kvargs -I../lib/librte_kvargs -Ilib/librte_telemetry/../librte_metrics -I../lib/librte_telemetry/../librte_metrics -Ilib/librte_telemetry -I../lib/librte_telemetry -Ilib/librte_ethdev -I../lib/librte_ethdev -Ilib/librte_net -I../lib/librte_net -Ilib/librte_mbuf -I../lib/librte_mbuf -Ilib/librte_mempool -I../lib/librte_mempool -Ilib/librte_ring -I../lib/librte_ring -Ilib/librte_meter -I../lib/librte_meter -fdiagnostics-color=always -pipe -D_FILE_OFFSET_BITS=64 -Wall -Winvalid-pch -Werror -O2 -g -include rte_config.h -Wextra -Wcast-qual -Wdeprecated -Wformat-nonliteral -Wformat-security -Wmissing-declarations -Wmissing-prototypes -Wnested-externs -Wold-style-definition -Wpointer-arith -Wsign-compare -Wstrict-prototypes -Wundef -Wwrite-strings -Wno-packed-not-aligned -Wno-missing-field-initializers -D_GNU_SOURCE -fPIC -march=native -mno-avx512f -DALLOW_EXPERIMENTAL_API -DALLOW_INTERNAL_API -Wno-format-truncation -MD -MQ 'lib/76b5a35@@rte_gro at sta/librte_gro_gro_vxlan_udp4.c.o' -MF 'lib/76b5a35@@rte_gro at sta/librte_gro_gro_vxlan_udp4.c.o.d' -o 'lib/76b5a35@@rte_gro at sta/librte_gro_gro_vxlan_udp4.c.o' -c ../lib/librte_gro/gro_vxlan_udp4.c
../lib/librte_gro/gro_vxlan_udp4.c: In function ‘udp_check_vxlan_neighbor’:
../lib/librte_gro/gro_vxlan_udp4.c:216:8: error: implicit declaration of function ‘udp_check_neighbor’; did you mean ‘udp4_check_neighbor’? [-Werror=implicit-function-declaration]
  cmp = udp_check_neighbor(&item->inner_item, frag_offset, ip_dl,
        ^~~~~~~~~~~~~~~~~~
        udp4_check_neighbor
../lib/librte_gro/gro_vxlan_udp4.c:216:8: error: nested extern declaration of ‘udp_check_neighbor’ [-Werror=nested-externs]
cc1: all warnings being treated as errors
[271/2580] Linking target lib/librte_distributor.so.21.0.
[272/2580] Compiling C object 'lib/76b5a35@@rte_eventdev at sta/librte_eventdev_rte_eventdev.c.o'.
[273/2580] Generating symbol file 'lib/76b5a35@@rte_cryptodev at sha/librte_cryptodev.so.21.0.symbols'.
[274/2580] Generating efd.sym_chk with a meson_exe.py custom command.
[275/2580] Compiling C object 'lib/76b5a35@@rte_eventdev at sta/librte_eventdev_rte_event_eth_rx_adapter.c.o'.
ninja: build stopped: subcommand failed




*Build Failed #7:
OS: FC32-64
Target: x86_64-gcc-static
FAILED: lib/76b5a35@@rte_gro at sta/librte_gro_gro_vxlan_udp4.c.o 
gcc -Ilib/76b5a35@@rte_gro at sta -Ilib -I../lib -Ilib/librte_gro -I../lib/librte_gro -I. -I../ -Iconfig -I../config -Ilib/librte_eal/include -I../lib/librte_eal/include -Ilib/librte_eal/linux/include -I../lib/librte_eal/linux/include -Ilib/librte_eal/x86/include -I../lib/librte_eal/x86/include -Ilib/librte_eal/common -I../lib/librte_eal/common -Ilib/librte_eal -I../lib/librte_eal -Ilib/librte_kvargs -I../lib/librte_kvargs -Ilib/librte_telemetry/../librte_metrics -I../lib/librte_telemetry/../librte_metrics -Ilib/librte_telemetry -I../lib/librte_telemetry -Ilib/librte_ethdev -I../lib/librte_ethdev -Ilib/librte_net -I../lib/librte_net -Ilib/librte_mbuf -I../lib/librte_mbuf -Ilib/librte_mempool -I../lib/librte_mempool -Ilib/librte_ring -I../lib/librte_ring -Ilib/librte_meter -I../lib/librte_meter -fdiagnostics-color=always -pipe -D_FILE_OFFSET_BITS=64 -Wall -Winvalid-pch -Werror -O3 -include rte_config.h -Wextra -Wcast-qual -Wdeprecated -Wformat-nonliteral -Wformat-security -Wmissing-declarations -Wmissing-prototypes -Wnested-externs -Wold-style-definition -Wpointer-arith -Wsign-compare -Wstrict-prototypes -Wundef -Wwrite-strings -Wno-address-of-packed-member -Wno-packed-not-aligned -Wno-missing-field-initializers -Wno-zero-length-bounds -D_GNU_SOURCE -fPIC -march=native -DALLOW_EXPERIMENTAL_API -DALLOW_INTERNAL_API -Wno-format-truncation -MD -MQ 'lib/76b5a35@@rte_gro at sta/librte_gro_gro_vxlan_udp4.c.o' -MF 'lib/76b5a35@@rte_gro at sta/librte_gro_gro_vxlan_udp4.c.o.d' -o 'lib/76b5a35@@rte_gro at sta/librte_gro_gro_vxlan_udp4.c.o' -c ../lib/librte_gro/gro_vxlan_udp4.c
../lib/librte_gro/gro_vxlan_udp4.c: In function ‘udp_check_vxlan_neighbor’:
../lib/librte_gro/gro_vxlan_udp4.c:216:8: error: implicit declaration of function ‘udp_check_neighbor’; did you mean ‘udp4_check_neighbor’? [-Werror=implicit-function-declaration]
  216 |  cmp = udp_check_neighbor(&item->inner_item, frag_offset, ip_dl,
      |        ^~~~~~~~~~~~~~~~~~
      |        udp4_check_neighbor
../lib/librte_gro/gro_vxlan_udp4.c:216:8: error: nested extern declaration of ‘udp_check_neighbor’ [-Werror=nested-externs]
cc1: all warnings being treated as errors
[236/2581] Generating distributor.sym_chk with a meson_exe.py custom command.
[237/2581] Generating eal.sym_chk with a meson_exe.py custom command.
[238/2581] Compiling C object 'lib/76b5a35@@rte_eventdev at sta/librte_eventdev_rte_eventdev.c.o'.
[239/2581] Compiling C object 'lib/76b5a35@@rte_gro at sta/librte_gro_gro_tcp4.c.o'.
[240/2581] Compiling C object 'lib/76b5a35@@rte_efd at sta/librte_efd_rte_efd.c.o'.
[241/2581] Generating cryptodev.sym_chk with a meson_exe.py custom command.
[242/2581] Compiling C object 'lib/76b5a35@@rte_gro at sta/librte_gro_gro_vxlan_tcp4.c.o'.
[243/2581] Compiling C object 'lib/76b5a35@@rte_eventdev at sta/librte_eventdev_rte_event_timer_adapter.c.o'.
[244/2581] Compiling C object 'lib/76b5a35@@rte_eventdev at sta/librte_eventdev_rte_event_eth_tx_adapter.c.o'.
[245/2581] Compiling C object 'lib/76b5a35@@rte_eventdev at sta/librte_eventdev_rte_event_crypto_adapter.c.o'.
[246/2581] Compiling C object 'lib/76b5a35@@rte_eventdev at sta/librte_eventdev_rte_event_eth_rx_adapter.c.o'.
ninja: build stopped: subcommand failed




*Build Failed #8:
OS: FC32-64
Target: x86_64-clang-static
FAILED: lib/76b5a35@@rte_gro at sta/librte_gro_gro_vxlan_udp4.c.o 
clang -Ilib/76b5a35@@rte_gro at sta -Ilib -I../lib -Ilib/librte_gro -I../lib/librte_gro -I. -I../ -Iconfig -I../config -Ilib/librte_eal/include -I../lib/librte_eal/include -Ilib/librte_eal/linux/include -I../lib/librte_eal/linux/include -Ilib/librte_eal/x86/include -I../lib/librte_eal/x86/include -Ilib/librte_eal/common -I../lib/librte_eal/common -Ilib/librte_eal -I../lib/librte_eal -Ilib/librte_kvargs -I../lib/librte_kvargs -Ilib/librte_telemetry/../librte_metrics -I../lib/librte_telemetry/../librte_metrics -Ilib/librte_telemetry -I../lib/librte_telemetry -Ilib/librte_ethdev -I../lib/librte_ethdev -Ilib/librte_net -I../lib/librte_net -Ilib/librte_mbuf -I../lib/librte_mbuf -Ilib/librte_mempool -I../lib/librte_mempool -Ilib/librte_ring -I../lib/librte_ring -Ilib/librte_meter -I../lib/librte_meter -Xclang -fcolor-diagnostics -pipe -D_FILE_OFFSET_BITS=64 -Wall -Winvalid-pch -Werror -O3 -include rte_config.h -Wextra -Wcast-qual -Wdeprecated -Wformat-nonliteral -Wformat-security -Wmissing-declarations -Wmissing-prototypes -Wnested-externs -Wold-style-definition -Wpointer-arith -Wsign-compare -Wstrict-prototypes -Wundef -Wwrite-strings -Wno-address-of-packed-member -Wno-missing-field-initializers -D_GNU_SOURCE -fPIC -march=native -DALLOW_EXPERIMENTAL_API -DALLOW_INTERNAL_API -MD -MQ 'lib/76b5a35@@rte_gro at sta/librte_gro_gro_vxlan_udp4.c.o' -MF 'lib/76b5a35@@rte_gro at sta/librte_gro_gro_vxlan_udp4.c.o.d' -o 'lib/76b5a35@@rte_gro at sta/librte_gro_gro_vxlan_udp4.c.o' -c ../lib/librte_gro/gro_vxlan_udp4.c
../lib/librte_gro/gro_vxlan_udp4.c:216:8: error: implicit declaration of function 'udp_check_neighbor' is invalid in C99 [-Werror,-Wimplicit-function-declaration]
        cmp = udp_check_neighbor(&item->inner_item, frag_offset, ip_dl,
              ^
../lib/librte_gro/gro_vxlan_udp4.c:216:8: note: did you mean 'udp4_check_neighbor'?
../lib/librte_gro/gro_udp4.h:250:1: note: 'udp4_check_neighbor' declared here
udp4_check_neighbor(struct gro_udp4_item *item,
^
1 error generated.
[273/2581] Generating symbol file 'lib/76b5a35@@rte_cryptodev at sha/librte_cryptodev.so.21.0.symbols'.
[274/2581] Compiling C object 'lib/76b5a35@@rte_efd at sta/librte_efd_rte_efd.c.o'.
[275/2581] Compiling C object 'lib/76b5a35@@rte_eventdev at sta/librte_eventdev_rte_eventdev.c.o'.
[276/2581] Compiling C object 'lib/76b5a35@@rte_gro at sta/librte_gro_gro_vxlan_tcp4.c.o'.
[277/2581] Compiling C object 'lib/76b5a35@@rte_eventdev at sta/librte_eventdev_rte_event_eth_tx_adapter.c.o'.
[278/2581] Compiling C object 'lib/76b5a35@@rte_gro at sta/librte_gro_gro_tcp4.c.o'.
[279/2581] Compiling C object 'lib/76b5a35@@rte_eventdev at sta/librte_eventdev_rte_event_timer_adapter.c.o'.
[280/2581] Compiling C object 'lib/76b5a35@@rte_eventdev at sta/librte_eventdev_rte_event_crypto_adapter.c.o'.
[281/2581] Compiling C object 'lib/76b5a35@@rte_eventdev at sta/librte_eventdev_rte_event_eth_rx_adapter.c.o'.
ninja: build stopped: subcommand failed




*Build Failed #9:
OS: FreeBSD1201-64
Target: x86_64-gcc-static
FAILED: lib/librte_gro.a.p/librte_gro_gro_vxlan_udp4.c.o 
gcc -Ilib/librte_gro.a.p -Ilib -I../lib -Ilib/librte_gro -I../lib/librte_gro -I. -I.. -Iconfig -I../config -Ilib/librte_eal/include -I../lib/librte_eal/include -Ilib/librte_eal/freebsd/include -I../lib/librte_eal/freebsd/include -Ilib/librte_eal/x86/include -I../lib/librte_eal/x86/include -Ilib/librte_eal/common -I../lib/librte_eal/common -Ilib/librte_eal -I../lib/librte_eal -Ilib/librte_kvargs -I../lib/librte_kvargs -Ilib/librte_metrics -I../lib/librte_metrics -Ilib/librte_telemetry -I../lib/librte_telemetry -Ilib/librte_ethdev -I../lib/librte_ethdev -Ilib/librte_net -I../lib/librte_net -Ilib/librte_mbuf -I../lib/librte_mbuf -Ilib/librte_mempool -I../lib/librte_mempool -Ilib/librte_ring -I../lib/librte_ring -Ilib/librte_meter -I../lib/librte_meter -fdiagnostics-color=always -pipe -D_FILE_OFFSET_BITS=64 -Wall -Winvalid-pch -Werror -O3 -include rte_config.h -Wextra -Wcast-qual -Wdeprecated -Wformat-nonliteral -Wformat-security -Wmissing-declarations -Wmissing-prototypes -Wnested-externs -Wold-style-definition -Wpointer-arith -Wsign-compare -Wstrict-prototypes -Wundef -Wwrite-strings -Wno-address-of-packed-member -Wno-packed-not-aligned -Wno-missing-field-initializers -D_GNU_SOURCE -D__BSD_VISIBLE -fPIC -march=native -mno-avx512f -DALLOW_EXPERIMENTAL_API -DALLOW_INTERNAL_API -Wno-format-truncation -MD -MQ lib/librte_gro.a.p/librte_gro_gro_vxlan_udp4.c.o -MF lib/librte_gro.a.p/librte_gro_gro_vxlan_udp4.c.o.d -o lib/librte_gro.a.p/librte_gro_gro_vxlan_udp4.c.o -c ../lib/librte_gro/gro_vxlan_udp4.c
../lib/librte_gro/gro_vxlan_udp4.c: In function 'udp_check_vxlan_neighbor':
../lib/librte_gro/gro_vxlan_udp4.c:216:8: error: implicit declaration of function 'udp_check_neighbor'; did you mean 'udp4_check_neighbor'? [-Werror=implicit-function-declaration]
  216 |  cmp = udp_check_neighbor(&item->inner_item, frag_offset, ip_dl,
      |        ^~~~~~~~~~~~~~~~~~
      |        udp4_check_neighbor
../lib/librte_gro/gro_vxlan_udp4.c:216:8: error: nested extern declaration of 'udp_check_neighbor' [-Werror=nested-externs]
cc1: all warnings being treated as errors
[281/1923] Compiling C object lib/librte_gso.a.p/librte_gso_gso_common.c.o
[282/1923] Generating eventdev.sym_chk with a meson_exe.py custom command
[283/1923] Compiling C object lib/librte_gso.a.p/librte_gso_gso_tunnel_tcp4.c.o
[284/1923] Compiling C object lib/librte_gso.a.p/librte_gso_gso_udp4.c.o
[285/1923] Compiling C object lib/librte_gso.a.p/librte_gso_gso_tcp4.c.o
ninja: build stopped: subcommand failed




*Build Failed #10:
OS: FreeBSD1201-64
Target: x86_64-clang-static
FAILED: lib/librte_gro.a.p/librte_gro_gro_vxlan_udp4.c.o 
clang -Ilib/librte_gro.a.p -Ilib -I../lib -Ilib/librte_gro -I../lib/librte_gro -I. -I.. -Iconfig -I../config -Ilib/librte_eal/include -I../lib/librte_eal/include -Ilib/librte_eal/freebsd/include -I../lib/librte_eal/freebsd/include -Ilib/librte_eal/x86/include -I../lib/librte_eal/x86/include -Ilib/librte_eal/common -I../lib/librte_eal/common -Ilib/librte_eal -I../lib/librte_eal -Ilib/librte_kvargs -I../lib/librte_kvargs -Ilib/librte_metrics -I../lib/librte_metrics -Ilib/librte_telemetry -I../lib/librte_telemetry -Ilib/librte_ethdev -I../lib/librte_ethdev -Ilib/librte_net -I../lib/librte_net -Ilib/librte_mbuf -I../lib/librte_mbuf -Ilib/librte_mempool -I../lib/librte_mempool -Ilib/librte_ring -I../lib/librte_ring -Ilib/librte_meter -I../lib/librte_meter -Xclang -fcolor-diagnostics -pipe -D_FILE_OFFSET_BITS=64 -Wall -Winvalid-pch -Werror -O3 -include rte_config.h -Wextra -Wcast-qual -Wdeprecated -Wformat-nonliteral -Wformat-security -Wmissing-declarations -Wmissing-prototypes -Wnested-externs -Wold-style-definition -Wpointer-arith -Wsign-compare -Wstrict-prototypes -Wundef -Wwrite-strings -Wno-address-of-packed-member -Wno-missing-field-initializers -D_GNU_SOURCE -D__BSD_VISIBLE -fPIC -march=native -mno-avx512f -DALLOW_EXPERIMENTAL_API -DALLOW_INTERNAL_API -MD -MQ lib/librte_gro.a.p/librte_gro_gro_vxlan_udp4.c.o -MF lib/librte_gro.a.p/librte_gro_gro_vxlan_udp4.c.o.d -o lib/librte_gro.a.p/librte_gro_gro_vxlan_udp4.c.o -c ../lib/librte_gro/gro_vxlan_udp4.c
../lib/librte_gro/gro_vxlan_udp4.c:216:8: error: implicit declaration of function 'udp_check_neighbor' is invalid in C99 [-Werror,-Wimplicit-function-declaration]
        cmp = udp_check_neighbor(&item->inner_item, frag_offset, ip_dl,
              ^
../lib/librte_gro/gro_vxlan_udp4.c:216:8: note: did you mean 'udp4_check_neighbor'?
../lib/librte_gro/gro_udp4.h:250:1: note: 'udp4_check_neighbor' declared here
udp4_check_neighbor(struct gro_udp4_item *item,
^
../lib/librte_gro/gro_vxlan_udp4.c:216:8: error: this function declaration is not a prototype [-Werror,-Wstrict-prototypes]
        cmp = udp_check_neighbor(&item->inner_item, frag_offset, ip_dl,
              ^
2 errors generated.
[283/1923] Generating rte_gso_def with a custom command
[284/1923] Compiling C object lib/librte_gso.a.p/librte_gso_gso_udp4.c.o
[285/1923] Generating eventdev.sym_chk with a meson_exe.py custom command
[286/1923] Compiling C object lib/librte_gso.a.p/librte_gso_gso_tunnel_tcp4.c.o
[287/1923] Compiling C object lib/librte_gso.a.p/librte_gso_rte_gso.c.o
ninja: build stopped: subcommand failed




*Build Failed #11:
OS: FreeBSD1201-64
Target: x86_64-gcc-shared
FAILED: lib/librte_gro.a.p/librte_gro_gro_vxlan_udp4.c.o 
gcc -Ilib/librte_gro.a.p -Ilib -I../lib -Ilib/librte_gro -I../lib/librte_gro -I. -I.. -Iconfig -I../config -Ilib/librte_eal/include -I../lib/librte_eal/include -Ilib/librte_eal/freebsd/include -I../lib/librte_eal/freebsd/include -Ilib/librte_eal/x86/include -I../lib/librte_eal/x86/include -Ilib/librte_eal/common -I../lib/librte_eal/common -Ilib/librte_eal -I../lib/librte_eal -Ilib/librte_kvargs -I../lib/librte_kvargs -Ilib/librte_metrics -I../lib/librte_metrics -Ilib/librte_telemetry -I../lib/librte_telemetry -Ilib/librte_ethdev -I../lib/librte_ethdev -Ilib/librte_net -I../lib/librte_net -Ilib/librte_mbuf -I../lib/librte_mbuf -Ilib/librte_mempool -I../lib/librte_mempool -Ilib/librte_ring -I../lib/librte_ring -Ilib/librte_meter -I../lib/librte_meter -fdiagnostics-color=always -pipe -D_FILE_OFFSET_BITS=64 -Wall -Winvalid-pch -Werror -O3 -include rte_config.h -Wextra -Wcast-qual -Wdeprecated -Wformat-nonliteral -Wformat-security -Wmissing-declarations -Wmissing-prototypes -Wnested-externs -Wold-style-definition -Wpointer-arith -Wsign-compare -Wstrict-prototypes -Wundef -Wwrite-strings -Wno-address-of-packed-member -Wno-packed-not-aligned -Wno-missing-field-initializers -D_GNU_SOURCE -D__BSD_VISIBLE -fPIC -march=native -mno-avx512f -DALLOW_EXPERIMENTAL_API -DALLOW_INTERNAL_API -Wno-format-truncation -MD -MQ lib/librte_gro.a.p/librte_gro_gro_vxlan_udp4.c.o -MF lib/librte_gro.a.p/librte_gro_gro_vxlan_udp4.c.o.d -o lib/librte_gro.a.p/librte_gro_gro_vxlan_udp4.c.o -c ../lib/librte_gro/gro_vxlan_udp4.c
../lib/librte_gro/gro_vxlan_udp4.c: In function 'udp_check_vxlan_neighbor':
../lib/librte_gro/gro_vxlan_udp4.c:216:8: error: implicit declaration of function 'udp_check_neighbor'; did you mean 'udp4_check_neighbor'? [-Werror=implicit-function-declaration]
  216 |  cmp = udp_check_neighbor(&item->inner_item, frag_offset, ip_dl,
      |        ^~~~~~~~~~~~~~~~~~
      |        udp4_check_neighbor
../lib/librte_gro/gro_vxlan_udp4.c:216:8: error: nested extern declaration of 'udp_check_neighbor' [-Werror=nested-externs]
cc1: all warnings being treated as errors
[288/1952] Compiling C object lib/librte_gso.a.p/librte_gso_gso_common.c.o
[289/1952] Generating symbol file lib/librte_eventdev.so.21.0.p/librte_eventdev.so.21.0.symbols
[290/1952] Compiling C object lib/librte_gso.a.p/librte_gso_gso_tcp4.c.o
[291/1952] Compiling C object lib/librte_gso.a.p/librte_gso_gso_tunnel_tcp4.c.o
[292/1952] Compiling C object lib/librte_gso.a.p/librte_gso_gso_udp4.c.o
ninja: build stopped: subcommand failed




*Build Failed #12:
OS: FreeBSD1201-64
Target: x86_64-gcc-debug
FAILED: lib/librte_gro.a.p/librte_gro_gro_vxlan_udp4.c.o 
gcc -Ilib/librte_gro.a.p -Ilib -I../lib -Ilib/librte_gro -I../lib/librte_gro -I. -I.. -Iconfig -I../config -Ilib/librte_eal/include -I../lib/librte_eal/include -Ilib/librte_eal/freebsd/include -I../lib/librte_eal/freebsd/include -Ilib/librte_eal/x86/include -I../lib/librte_eal/x86/include -Ilib/librte_eal/common -I../lib/librte_eal/common -Ilib/librte_eal -I../lib/librte_eal -Ilib/librte_kvargs -I../lib/librte_kvargs -Ilib/librte_metrics -I../lib/librte_metrics -Ilib/librte_telemetry -I../lib/librte_telemetry -Ilib/librte_ethdev -I../lib/librte_ethdev -Ilib/librte_net -I../lib/librte_net -Ilib/librte_mbuf -I../lib/librte_mbuf -Ilib/librte_mempool -I../lib/librte_mempool -Ilib/librte_ring -I../lib/librte_ring -Ilib/librte_meter -I../lib/librte_meter -fdiagnostics-color=always -pipe -D_FILE_OFFSET_BITS=64 -Wall -Winvalid-pch -Werror -O2 -g -include rte_config.h -Wextra -Wcast-qual -Wdeprecated -Wformat-nonliteral -Wformat-security -Wmissing-declarations -Wmissing-prototypes -Wnested-externs -Wold-style-definition -Wpointer-arith -Wsign-compare -Wstrict-prototypes -Wundef -Wwrite-strings -Wno-address-of-packed-member -Wno-packed-not-aligned -Wno-missing-field-initializers -D_GNU_SOURCE -D__BSD_VISIBLE -fPIC -march=native -mno-avx512f -DALLOW_EXPERIMENTAL_API -DALLOW_INTERNAL_API -Wno-format-truncation -MD -MQ lib/librte_gro.a.p/librte_gro_gro_vxlan_udp4.c.o -MF lib/librte_gro.a.p/librte_gro_gro_vxlan_udp4.c.o.d -o lib/librte_gro.a.p/librte_gro_gro_vxlan_udp4.c.o -c ../lib/librte_gro/gro_vxlan_udp4.c
../lib/librte_gro/gro_vxlan_udp4.c: In function 'udp_check_vxlan_neighbor':
../lib/librte_gro/gro_vxlan_udp4.c:216:8: error: implicit declaration of function 'udp_check_neighbor'; did you mean 'udp4_check_neighbor'? [-Werror=implicit-function-declaration]
  216 |  cmp = udp_check_neighbor(&item->inner_item, frag_offset, ip_dl,
      |        ^~~~~~~~~~~~~~~~~~
      |        udp4_check_neighbor
../lib/librte_gro/gro_vxlan_udp4.c:216:8: error: nested extern declaration of 'udp_check_neighbor' [-Werror=nested-externs]
cc1: all warnings being treated as errors
[280/1923] Compiling C object lib/librte_gso.a.p/librte_gso_gso_udp4.c.o
[281/1923] Compiling C object lib/librte_gro.a.p/librte_gro_gro_udp4.c.o
[282/1923] Compiling C object lib/librte_gso.a.p/librte_gso_gso_tcp4.c.o
[283/1923] Generating eventdev.sym_chk with a meson_exe.py custom command
[284/1923] Compiling C object lib/librte_gso.a.p/librte_gso_gso_common.c.o
ninja: build stopped: subcommand failed




*Build Failed #13:
OS: RHEL82-64
Target: x86_64-gcc-static
FAILED: lib/76b5a35@@rte_gro at sta/librte_gro_gro_vxlan_udp4.c.o 
gcc -Ilib/76b5a35@@rte_gro at sta -Ilib -I../lib -Ilib/librte_gro -I../lib/librte_gro -I. -I../ -Iconfig -I../config -Ilib/librte_eal/include -I../lib/librte_eal/include -Ilib/librte_eal/linux/include -I../lib/librte_eal/linux/include -Ilib/librte_eal/x86/include -I../lib/librte_eal/x86/include -Ilib/librte_eal/common -I../lib/librte_eal/common -Ilib/librte_eal -I../lib/librte_eal -Ilib/librte_kvargs -I../lib/librte_kvargs -Ilib/librte_telemetry/../librte_metrics -I../lib/librte_telemetry/../librte_metrics -Ilib/librte_telemetry -I../lib/librte_telemetry -Ilib/librte_ethdev -I../lib/librte_ethdev -Ilib/librte_net -I../lib/librte_net -Ilib/librte_mbuf -I../lib/librte_mbuf -Ilib/librte_mempool -I../lib/librte_mempool -Ilib/librte_ring -I../lib/librte_ring -Ilib/librte_meter -I../lib/librte_meter -fdiagnostics-color=always -pipe -D_FILE_OFFSET_BITS=64 -Wall -Winvalid-pch -Werror -O3 -include rte_config.h -Wextra -Wcast-qual -Wdeprecated -Wformat-nonliteral -Wformat-security -Wmissing-declarations -Wmissing-prototypes -Wnested-externs -Wold-style-definition -Wpointer-arith -Wsign-compare -Wstrict-prototypes -Wundef -Wwrite-strings -Wno-packed-not-aligned -Wno-missing-field-initializers -D_GNU_SOURCE -fPIC -march=native -mno-avx512f -DALLOW_EXPERIMENTAL_API -DALLOW_INTERNAL_API -Wno-format-truncation -MD -MQ 'lib/76b5a35@@rte_gro at sta/librte_gro_gro_vxlan_udp4.c.o' -MF 'lib/76b5a35@@rte_gro at sta/librte_gro_gro_vxlan_udp4.c.o.d' -o 'lib/76b5a35@@rte_gro at sta/librte_gro_gro_vxlan_udp4.c.o' -c ../lib/librte_gro/gro_vxlan_udp4.c
../lib/librte_gro/gro_vxlan_udp4.c: In function ‘udp_check_vxlan_neighbor’:
../lib/librte_gro/gro_vxlan_udp4.c:216:8: error: implicit declaration of function ‘udp_check_neighbor’; did you mean ‘udp4_check_neighbor’? [-Werror=implicit-function-declaration]
  cmp = udp_check_neighbor(&item->inner_item, frag_offset, ip_dl,
        ^~~~~~~~~~~~~~~~~~
        udp4_check_neighbor
../lib/librte_gro/gro_vxlan_udp4.c:216:8: error: nested extern declaration of ‘udp_check_neighbor’ [-Werror=nested-externs]
cc1: all warnings being treated as errors
[254/2580] Generating distributor.sym_chk with a meson_exe.py custom command.
[255/2580] Linking target lib/librte_hash.so.21.0.
[256/2580] Compiling C object 'lib/76b5a35@@rte_eventdev at sta/librte_eventdev_rte_event_timer_adapter.c.o'.
[257/2580] Generating symbol file 'lib/76b5a35@@rte_mbuf at sha/librte_mbuf.so.21.0.symbols'.
[258/2580] Compiling C object 'lib/76b5a35@@rte_eventdev at sta/librte_eventdev_rte_eventdev.c.o'.
[259/2580] Compiling C object 'lib/76b5a35@@rte_efd at sta/librte_efd_rte_efd.c.o'.
[260/2580] Compiling C object 'lib/76b5a35@@rte_eventdev at sta/librte_eventdev_rte_event_crypto_adapter.c.o'.
[261/2580] Compiling C object 'lib/76b5a35@@rte_eventdev at sta/librte_eventdev_rte_event_eth_tx_adapter.c.o'.
[262/2580] Compiling C object 'lib/76b5a35@@rte_eventdev at sta/librte_eventdev_rte_event_eth_rx_adapter.c.o'.
ninja: build stopped: subcommand failed




*Build Failed #14:
OS: SUSE15-64
Target: x86_64-clang-static
FAILED: lib/librte_gro.a.p/librte_gro_gro_vxlan_udp4.c.o 
clang -Ilib/librte_gro.a.p -Ilib -I../lib -Ilib/librte_gro -I../lib/librte_gro -I. -I.. -Iconfig -I../config -Ilib/librte_eal/include -I../lib/librte_eal/include -Ilib/librte_eal/linux/include -I../lib/librte_eal/linux/include -Ilib/librte_eal/x86/include -I../lib/librte_eal/x86/include -Ilib/librte_eal/common -I../lib/librte_eal/common -Ilib/librte_eal -I../lib/librte_eal -Ilib/librte_kvargs -I../lib/librte_kvargs -Ilib/librte_metrics -I../lib/librte_metrics -Ilib/librte_telemetry -I../lib/librte_telemetry -Ilib/librte_ethdev -I../lib/librte_ethdev -Ilib/librte_net -I../lib/librte_net -Ilib/librte_mbuf -I../lib/librte_mbuf -Ilib/librte_mempool -I../lib/librte_mempool -Ilib/librte_ring -I../lib/librte_ring -Ilib/librte_meter -I../lib/librte_meter -Xclang -fcolor-diagnostics -pipe -D_FILE_OFFSET_BITS=64 -Wall -Winvalid-pch -Werror -O3 -include rte_config.h -Wextra -Wcast-qual -Wdeprecated -Wformat-nonliteral -Wformat-security -Wmissing-declarations -Wmissing-prototypes -Wnested-externs -Wold-style-definition -Wpointer-arith -Wsign-compare -Wstrict-prototypes -Wundef -Wwrite-strings -Wno-address-of-packed-member -Wno-missing-field-initializers -D_GNU_SOURCE -fPIC -march=native -DALLOW_EXPERIMENTAL_API -DALLOW_INTERNAL_API -MD -MQ lib/librte_gro.a.p/librte_gro_gro_vxlan_udp4.c.o -MF lib/librte_gro.a.p/librte_gro_gro_vxlan_udp4.c.o.d -o lib/librte_gro.a.p/librte_gro_gro_vxlan_udp4.c.o -c ../lib/librte_gro/gro_vxlan_udp4.c
../lib/librte_gro/gro_vxlan_udp4.c:216:8: error: implicit declaration of function 'udp_check_neighbor' is invalid in C99 [-Werror,-Wimplicit-function-declaration]
        cmp = udp_check_neighbor(&item->inner_item, frag_offset, ip_dl,
              ^
../lib/librte_gro/gro_vxlan_udp4.c:216:8: note: did you mean 'udp4_check_neighbor'?
../lib/librte_gro/gro_udp4.h:250:1: note: 'udp4_check_neighbor' declared here
udp4_check_neighbor(struct gro_udp4_item *item,
^
../lib/librte_gro/gro_vxlan_udp4.c:216:8: error: this function declaration is not a prototype [-Werror,-Wstrict-prototypes]
        cmp = udp_check_neighbor(&item->inner_item, frag_offset, ip_dl,
              ^
2 errors generated.
[258/2549] Compiling C object lib/librte_efd.a.p/librte_efd_rte_efd.c.o
[259/2549] Compiling C object lib/librte_eventdev.a.p/librte_eventdev_rte_event_crypto_adapter.c.o
[260/2549] Generating symbol file lib/librte_mbuf.so.21.0.p/librte_mbuf.so.21.0.symbols
[261/2549] Compiling C object lib/librte_gro.a.p/librte_gro_gro_tcp4.c.o
[262/2549] Compiling C object lib/librte_eventdev.a.p/librte_eventdev_rte_eventdev.c.o
[263/2549] Compiling C object lib/librte_eventdev.a.p/librte_eventdev_rte_event_timer_adapter.c.o
[264/2549] Compiling C object lib/librte_gro.a.p/librte_gro_gro_vxlan_tcp4.c.o
[265/2549] Compiling C object lib/librte_eventdev.a.p/librte_eventdev_rte_event_eth_tx_adapter.c.o
[266/2549] Compiling C object lib/librte_eventdev.a.p/librte_eventdev_rte_event_eth_rx_adapter.c.o
ninja: build stopped: subcommand failed




*Build Failed #15:
OS: SUSE15-64
Target: x86_64-gcc-static
FAILED: lib/76b5a35@@rte_gro at sta/librte_gro_gro_vxlan_udp4.c.o 
gcc -Ilib/76b5a35@@rte_gro at sta -Ilib -I../lib -Ilib/librte_gro -I../lib/librte_gro -I. -I.. -Iconfig -I../config -Ilib/librte_eal/include -I../lib/librte_eal/include -Ilib/librte_eal/linux/include -I../lib/librte_eal/linux/include -Ilib/librte_eal/x86/include -I../lib/librte_eal/x86/include -Ilib/librte_eal/common -I../lib/librte_eal/common -Ilib/librte_eal -I../lib/librte_eal -Ilib/librte_kvargs -I../lib/librte_kvargs -Ilib/librte_metrics -I../lib/librte_metrics -Ilib/librte_telemetry -I../lib/librte_telemetry -Ilib/librte_ethdev -I../lib/librte_ethdev -Ilib/librte_net -I../lib/librte_net -Ilib/librte_mbuf -I../lib/librte_mbuf -Ilib/librte_mempool -I../lib/librte_mempool -Ilib/librte_ring -I../lib/librte_ring -Ilib/librte_meter -I../lib/librte_meter -fdiagnostics-color=always -pipe -D_FILE_OFFSET_BITS=64 -Wall -Winvalid-pch -Werror -O3 -include rte_config.h -Wextra -Wcast-qual -Wdeprecated -Wformat-nonliteral -Wformat-security -Wmissing-declarations -Wmissing-prototypes -Wnested-externs -Wold-style-definition -Wpointer-arith -Wsign-compare -Wstrict-prototypes -Wundef -Wwrite-strings -Wno-missing-field-initializers -D_GNU_SOURCE -fPIC -march=native -DALLOW_EXPERIMENTAL_API -DALLOW_INTERNAL_API -Wno-format-truncation -MD -MQ 'lib/76b5a35@@rte_gro at sta/librte_gro_gro_vxlan_udp4.c.o' -MF 'lib/76b5a35@@rte_gro at sta/librte_gro_gro_vxlan_udp4.c.o.d' -o 'lib/76b5a35@@rte_gro at sta/librte_gro_gro_vxlan_udp4.c.o' -c ../lib/librte_gro/gro_vxlan_udp4.c
../lib/librte_gro/gro_vxlan_udp4.c: In function ‘udp_check_vxlan_neighbor’:
../lib/librte_gro/gro_vxlan_udp4.c:216:8: error: implicit declaration of function ‘udp_check_neighbor’; did you mean ‘udp4_check_neighbor’? [-Werror=implicit-function-declaration]
  cmp = udp_check_neighbor(&item->inner_item, frag_offset, ip_dl,
        ^~~~~~~~~~~~~~~~~~
        udp4_check_neighbor
../lib/librte_gro/gro_vxlan_udp4.c:216:8: error: nested extern declaration of ‘udp_check_neighbor’ [-Werror=nested-externs]
cc1: all warnings being treated as errors
[279/2549] Generating efd.sym_chk with a meson_exe.py custom command
[280/2549] Generating symbol file 'lib/76b5a35@@rte_net at sha/librte_net.so.21.0.symbols'
[281/2549] Generating symbol file 'lib/76b5a35@@rte_compressdev at sha/librte_compressdev.so.21.0.symbols'
[282/2549] Generating symbol file 'lib/76b5a35@@rte_bbdev at sha/librte_bbdev.so.21.0.symbols'
[283/2549] Compiling C object 'lib/76b5a35@@rte_eventdev at sta/librte_eventdev_rte_event_crypto_adapter.c.o'
[284/2549] Compiling C object 'lib/76b5a35@@rte_gso at sta/librte_gso_gso_tcp4.c.o'
[285/2549] Compiling C object 'lib/76b5a35@@rte_eventdev at sta/librte_eventdev_rte_event_eth_rx_adapter.c.o'
[286/2549] Generating symbol file 'lib/76b5a35@@rte_cryptodev at sha/librte_cryptodev.so.21.0.symbols'
[287/2549] Compiling C object 'lib/76b5a35@@rte_gso at sta/librte_gso_gso_common.c.o'
ninja: build stopped: subcommand failed




*Build Failed #16:
OS: UB1804-64
Target: x86_64-gcc-static
FAILED: lib/76b5a35@@rte_gro at sta/librte_gro_gro_vxlan_udp4.c.o 
gcc -Ilib/76b5a35@@rte_gro at sta -Ilib -I../lib -Ilib/librte_gro -I../lib/librte_gro -I. -I../ -Iconfig -I../config -Ilib/librte_eal/include -I../lib/librte_eal/include -Ilib/librte_eal/linux/include -I../lib/librte_eal/linux/include -Ilib/librte_eal/x86/include -I../lib/librte_eal/x86/include -Ilib/librte_eal/common -I../lib/librte_eal/common -Ilib/librte_eal -I../lib/librte_eal -Ilib/librte_kvargs -I../lib/librte_kvargs -Ilib/librte_telemetry/../librte_metrics -I../lib/librte_telemetry/../librte_metrics -Ilib/librte_telemetry -I../lib/librte_telemetry -Ilib/librte_ethdev -I../lib/librte_ethdev -Ilib/librte_net -I../lib/librte_net -Ilib/librte_mbuf -I../lib/librte_mbuf -Ilib/librte_mempool -I../lib/librte_mempool -Ilib/librte_ring -I../lib/librte_ring -Ilib/librte_meter -I../lib/librte_meter -fdiagnostics-color=always -pipe -D_FILE_OFFSET_BITS=64 -Wall -Winvalid-pch -Werror -O3 -include rte_config.h -Wextra -Wcast-qual -Wdeprecated -Wformat-nonliteral -Wformat-security -Wmissing-declarations -Wmissing-prototypes -Wnested-externs -Wold-style-definition -Wpointer-arith -Wsign-compare -Wstrict-prototypes -Wundef -Wwrite-strings -Wno-packed-not-aligned -Wno-missing-field-initializers -D_GNU_SOURCE -fPIC -march=native -mno-avx512f -DALLOW_EXPERIMENTAL_API -DALLOW_INTERNAL_API -Wno-format-truncation -MD -MQ 'lib/76b5a35@@rte_gro at sta/librte_gro_gro_vxlan_udp4.c.o' -MF 'lib/76b5a35@@rte_gro at sta/librte_gro_gro_vxlan_udp4.c.o.d' -o 'lib/76b5a35@@rte_gro at sta/librte_gro_gro_vxlan_udp4.c.o' -c ../lib/librte_gro/gro_vxlan_udp4.c
../lib/librte_gro/gro_vxlan_udp4.c: In function ‘udp_check_vxlan_neighbor’:
../lib/librte_gro/gro_vxlan_udp4.c:216:8: error: implicit declaration of function ‘udp_check_neighbor’; did you mean ‘udp4_check_neighbor’? [-Werror=implicit-function-declaration]
  cmp = udp_check_neighbor(&item->inner_item, frag_offset, ip_dl,
        ^~~~~~~~~~~~~~~~~~
        udp4_check_neighbor
../lib/librte_gro/gro_vxlan_udp4.c:216:8: error: nested extern declaration of ‘udp_check_neighbor’ [-Werror=nested-externs]
cc1: all warnings being treated as errors
[275/2569] Generating rte_eventdev_def with a custom command.
[276/2569] Generating rte_eventdev_mingw with a custom command.
[277/2569] Generating efd.sym_chk with a meson_exe.py custom command.
[278/2569] Compiling C object 'lib/76b5a35@@rte_gro at sta/librte_gro_gro_tcp4.c.o'.
[279/2569] Compiling C object 'lib/76b5a35@@rte_eventdev at sta/librte_eventdev_rte_event_timer_adapter.c.o'.
[280/2569] Compiling C object 'lib/76b5a35@@rte_eventdev at sta/librte_eventdev_rte_event_eth_tx_adapter.c.o'.
[281/2569] Compiling C object 'lib/76b5a35@@rte_eventdev at sta/librte_eventdev_rte_event_crypto_adapter.c.o'.
[282/2569] Compiling C object 'lib/76b5a35@@rte_eventdev at sta/librte_eventdev_rte_event_eth_rx_adapter.c.o'.
[283/2569] Compiling C object 'lib/76b5a35@@rte_pipeline at sta/librte_pipeline_rte_table_action.c.o'.
ninja: build stopped: subcommand failed




*Build Failed #17:
OS: UB2004-32
Target: i686-gcc-static
FAILED: lib/76b5a35@@rte_gro at sta/librte_gro_gro_vxlan_udp4.c.o 
gcc -Ilib/76b5a35@@rte_gro at sta -Ilib -I../lib -Ilib/librte_gro -I../lib/librte_gro -I. -I../ -Iconfig -I../config -Ilib/librte_eal/include -I../lib/librte_eal/include -Ilib/librte_eal/linux/include -I../lib/librte_eal/linux/include -Ilib/librte_eal/x86/include -I../lib/librte_eal/x86/include -Ilib/librte_eal/common -I../lib/librte_eal/common -Ilib/librte_eal -I../lib/librte_eal -Ilib/librte_kvargs -I../lib/librte_kvargs -Ilib/librte_telemetry/../librte_metrics -I../lib/librte_telemetry/../librte_metrics -Ilib/librte_telemetry -I../lib/librte_telemetry -Ilib/librte_ethdev -I../lib/librte_ethdev -Ilib/librte_net -I../lib/librte_net -Ilib/librte_mbuf -I../lib/librte_mbuf -Ilib/librte_mempool -I../lib/librte_mempool -Ilib/librte_ring -I../lib/librte_ring -Ilib/librte_meter -I../lib/librte_meter -fdiagnostics-color=always -pipe -D_FILE_OFFSET_BITS=64 -Wall -Winvalid-pch -Werror -O3 -include rte_config.h -Wextra -Wcast-qual -Wdeprecated -Wformat-nonliteral -Wformat-security -Wmissing-declarations -Wmissing-prototypes -Wnested-externs -Wold-style-definition -Wpointer-arith -Wsign-compare -Wstrict-prototypes -Wundef -Wwrite-strings -Wno-address-of-packed-member -Wno-packed-not-aligned -Wno-missing-field-initializers -Wno-pointer-to-int-cast -D_GNU_SOURCE -m32 -fPIC -march=native -DALLOW_EXPERIMENTAL_API -DALLOW_INTERNAL_API -Wno-format-truncation -MD -MQ 'lib/76b5a35@@rte_gro at sta/librte_gro_gro_vxlan_udp4.c.o' -MF 'lib/76b5a35@@rte_gro at sta/librte_gro_gro_vxlan_udp4.c.o.d' -o 'lib/76b5a35@@rte_gro at sta/librte_gro_gro_vxlan_udp4.c.o' -c ../lib/librte_gro/gro_vxlan_udp4.c
../lib/librte_gro/gro_vxlan_udp4.c: In function ‘udp_check_vxlan_neighbor’:
../lib/librte_gro/gro_vxlan_udp4.c:216:8: error: implicit declaration of function ‘udp_check_neighbor’; did you mean ‘udp4_check_neighbor’? [-Werror=implicit-function-declaration]
  216 |  cmp = udp_check_neighbor(&item->inner_item, frag_offset, ip_dl,
      |        ^~~~~~~~~~~~~~~~~~
      |        udp4_check_neighbor
../lib/librte_gro/gro_vxlan_udp4.c:216:8: error: nested extern declaration of ‘udp_check_neighbor’ [-Werror=nested-externs]
cc1: all warnings being treated as errors
[259/2330] Generating symbol file 'lib/76b5a35@@rte_acl at sha/librte_acl.so.21.0.symbols'.
[260/2330] Generating symbol file 'lib/76b5a35@@rte_compressdev at sha/librte_compressdev.so.21.0.symbols'.
[261/2330] Generating symbol file 'lib/76b5a35@@rte_net at sha/librte_net.so.21.0.symbols'.
[262/2330] Compiling C object 'lib/76b5a35@@rte_eventdev at sta/librte_eventdev_rte_eventdev.c.o'.
[263/2330] Compiling C object 'lib/76b5a35@@rte_efd at sta/librte_efd_rte_efd.c.o'.
[264/2330] Compiling C object 'lib/76b5a35@@rte_eventdev at sta/librte_eventdev_rte_event_timer_adapter.c.o'.
[265/2330] Compiling C object 'lib/76b5a35@@rte_eventdev at sta/librte_eventdev_rte_event_eth_tx_adapter.c.o'.
[266/2330] Compiling C object 'lib/76b5a35@@rte_eventdev at sta/librte_eventdev_rte_event_crypto_adapter.c.o'.
[267/2330] Compiling C object 'lib/76b5a35@@rte_eventdev at sta/librte_eventdev_rte_event_eth_rx_adapter.c.o'.
ninja: build stopped: subcommand failed




*Build Failed #18:
OS: UB2004-64
Target: x86_64-clang-static
FAILED: lib/76b5a35@@rte_gro at sta/librte_gro_gro_vxlan_udp4.c.o 
clang -Ilib/76b5a35@@rte_gro at sta -Ilib -I../lib -Ilib/librte_gro -I../lib/librte_gro -I. -I../ -Iconfig -I../config -Ilib/librte_eal/include -I../lib/librte_eal/include -Ilib/librte_eal/linux/include -I../lib/librte_eal/linux/include -Ilib/librte_eal/x86/include -I../lib/librte_eal/x86/include -Ilib/librte_eal/common -I../lib/librte_eal/common -Ilib/librte_eal -I../lib/librte_eal -Ilib/librte_kvargs -I../lib/librte_kvargs -Ilib/librte_telemetry/../librte_metrics -I../lib/librte_telemetry/../librte_metrics -Ilib/librte_telemetry -I../lib/librte_telemetry -Ilib/librte_ethdev -I../lib/librte_ethdev -Ilib/librte_net -I../lib/librte_net -Ilib/librte_mbuf -I../lib/librte_mbuf -Ilib/librte_mempool -I../lib/librte_mempool -Ilib/librte_ring -I../lib/librte_ring -Ilib/librte_meter -I../lib/librte_meter -Xclang -fcolor-diagnostics -pipe -D_FILE_OFFSET_BITS=64 -Wall -Winvalid-pch -Werror -O3 -include rte_config.h -Wextra -Wcast-qual -Wdeprecated -Wformat-nonliteral -Wformat-security -Wmissing-declarations -Wmissing-prototypes -Wnested-externs -Wold-style-definition -Wpointer-arith -Wsign-compare -Wstrict-prototypes -Wundef -Wwrite-strings -Wno-address-of-packed-member -Wno-missing-field-initializers -D_GNU_SOURCE -fPIC -march=native -DALLOW_EXPERIMENTAL_API -DALLOW_INTERNAL_API -MD -MQ 'lib/76b5a35@@rte_gro at sta/librte_gro_gro_vxlan_udp4.c.o' -MF 'lib/76b5a35@@rte_gro at sta/librte_gro_gro_vxlan_udp4.c.o.d' -o 'lib/76b5a35@@rte_gro at sta/librte_gro_gro_vxlan_udp4.c.o' -c ../lib/librte_gro/gro_vxlan_udp4.c
../lib/librte_gro/gro_vxlan_udp4.c:216:8: error: implicit declaration of function 'udp_check_neighbor' is invalid in C99 [-Werror,-Wimplicit-function-declaration]
        cmp = udp_check_neighbor(&item->inner_item, frag_offset, ip_dl,
              ^
../lib/librte_gro/gro_vxlan_udp4.c:216:8: note: did you mean 'udp4_check_neighbor'?
../lib/librte_gro/gro_udp4.h:250:1: note: 'udp4_check_neighbor' declared here
udp4_check_neighbor(struct gro_udp4_item *item,
^
1 error generated.
[258/2571] Generating symbol file 'lib/76b5a35@@rte_net at sha/librte_net.so.21.0.symbols'.
[259/2571] Linking target lib/librte_cryptodev.so.21.0.
[260/2571] Generating distributor.sym_chk with a meson_exe.py custom command.
[261/2571] Generating symbol file 'lib/76b5a35@@rte_bbdev at sha/librte_bbdev.so.21.0.symbols'.
[262/2571] Generating compressdev.sym_chk with a meson_exe.py custom command.
[263/2571] Compiling C object 'lib/76b5a35@@rte_eventdev at sta/librte_eventdev_rte_event_ring.c.o'.
[264/2571] Compiling C object 'lib/76b5a35@@rte_efd at sta/librte_efd_rte_efd.c.o'.
[265/2571] Compiling C object 'lib/76b5a35@@rte_eventdev at sta/librte_eventdev_rte_eventdev.c.o'.
[266/2571] Compiling C object 'lib/76b5a35@@rte_pipeline at sta/librte_pipeline_rte_table_action.c.o'.
ninja: build stopped: subcommand failed




*Build Failed #19:
OS: UB2004-64
Target: x86_64-gcc-static
FAILED: lib/76b5a35@@rte_gro at sta/librte_gro_gro_vxlan_udp4.c.o 
gcc -Ilib/76b5a35@@rte_gro at sta -Ilib -I../lib -Ilib/librte_gro -I../lib/librte_gro -I. -I../ -Iconfig -I../config -Ilib/librte_eal/include -I../lib/librte_eal/include -Ilib/librte_eal/linux/include -I../lib/librte_eal/linux/include -Ilib/librte_eal/x86/include -I../lib/librte_eal/x86/include -Ilib/librte_eal/common -I../lib/librte_eal/common -Ilib/librte_eal -I../lib/librte_eal -Ilib/librte_kvargs -I../lib/librte_kvargs -Ilib/librte_telemetry/../librte_metrics -I../lib/librte_telemetry/../librte_metrics -Ilib/librte_telemetry -I../lib/librte_telemetry -Ilib/librte_ethdev -I../lib/librte_ethdev -Ilib/librte_net -I../lib/librte_net -Ilib/librte_mbuf -I../lib/librte_mbuf -Ilib/librte_mempool -I../lib/librte_mempool -Ilib/librte_ring -I../lib/librte_ring -Ilib/librte_meter -I../lib/librte_meter -fdiagnostics-color=always -pipe -D_FILE_OFFSET_BITS=64 -Wall -Winvalid-pch -Werror -O3 -include rte_config.h -Wextra -Wcast-qual -Wdeprecated -Wformat-nonliteral -Wformat-security -Wmissing-declarations -Wmissing-prototypes -Wnested-externs -Wold-style-definition -Wpointer-arith -Wsign-compare -Wstrict-prototypes -Wundef -Wwrite-strings -Wno-address-of-packed-member -Wno-packed-not-aligned -Wno-missing-field-initializers -Wno-zero-length-bounds -D_GNU_SOURCE -fPIC -march=native -DALLOW_EXPERIMENTAL_API -DALLOW_INTERNAL_API -Wno-format-truncation -MD -MQ 'lib/76b5a35@@rte_gro at sta/librte_gro_gro_vxlan_udp4.c.o' -MF 'lib/76b5a35@@rte_gro at sta/librte_gro_gro_vxlan_udp4.c.o.d' -o 'lib/76b5a35@@rte_gro at sta/librte_gro_gro_vxlan_udp4.c.o' -c ../lib/librte_gro/gro_vxlan_udp4.c
../lib/librte_gro/gro_vxlan_udp4.c: In function ‘udp_check_vxlan_neighbor’:
../lib/librte_gro/gro_vxlan_udp4.c:216:8: error: implicit declaration of function ‘udp_check_neighbor’; did you mean ‘udp4_check_neighbor’? [-Werror=implicit-function-declaration]
  216 |  cmp = udp_check_neighbor(&item->inner_item, frag_offset, ip_dl,
      |        ^~~~~~~~~~~~~~~~~~
      |        udp4_check_neighbor
../lib/librte_gro/gro_vxlan_udp4.c:216:8: error: nested extern declaration of ‘udp_check_neighbor’ [-Werror=nested-externs]
cc1: all warnings being treated as errors
[267/2571] Generating symbol file 'lib/76b5a35@@rte_ethdev at sha/librte_ethdev.so.21.0.symbols'.
[268/2571] Generating symbol file 'lib/76b5a35@@rte_cryptodev at sha/librte_cryptodev.so.21.0.symbols'.
[269/2571] Compiling C object 'lib/76b5a35@@rte_efd at sta/librte_efd_rte_efd.c.o'.
[270/2571] Compiling C object 'lib/76b5a35@@rte_eventdev at sta/librte_eventdev_rte_eventdev.c.o'.
[271/2571] Compiling C object 'lib/76b5a35@@rte_eventdev at sta/librte_eventdev_rte_event_timer_adapter.c.o'.
[272/2571] Compiling C object 'lib/76b5a35@@rte_eventdev at sta/librte_eventdev_rte_event_crypto_adapter.c.o'.
[273/2571] Compiling C object 'lib/76b5a35@@rte_eventdev at sta/librte_eventdev_rte_event_eth_tx_adapter.c.o'.
[274/2571] Compiling C object 'lib/76b5a35@@rte_eventdev at sta/librte_eventdev_rte_event_eth_rx_adapter.c.o'.
[275/2571] Compiling C object 'lib/76b5a35@@rte_pipeline at sta/librte_pipeline_rte_table_action.c.o'.
ninja: build stopped: subcommand failed




*Build Failed #20:
OS: UB2004-64
Target: x86_64-icc-static
FAILED: lib/76b5a35@@rte_gro at sta/librte_gro_gro_vxlan_udp4.c.o 
icc -Ilib/76b5a35@@rte_gro at sta -Ilib -I../lib -Ilib/librte_gro -I../lib/librte_gro -I. -I../ -Iconfig -I../config -Ilib/librte_eal/include -I../lib/librte_eal/include -Ilib/librte_eal/linux/include -I../lib/librte_eal/linux/include -Ilib/librte_eal/x86/include -I../lib/librte_eal/x86/include -Ilib/librte_eal/common -I../lib/librte_eal/common -Ilib/librte_eal -I../lib/librte_eal -Ilib/librte_kvargs -I../lib/librte_kvargs -Ilib/librte_telemetry/../librte_metrics -I../lib/librte_telemetry/../librte_metrics -Ilib/librte_telemetry -I../lib/librte_telemetry -Ilib/librte_ethdev -I../lib/librte_ethdev -Ilib/librte_net -I../lib/librte_net -Ilib/librte_mbuf -I../lib/librte_mbuf -Ilib/librte_mempool -I../lib/librte_mempool -Ilib/librte_ring -I../lib/librte_ring -Ilib/librte_meter -I../lib/librte_meter -pipe -D_FILE_OFFSET_BITS=64 -Wall -w3 -diag-disable:remark -Werror -O3 -include rte_config.h -Wextra -Wcast-qual -Wdeprecated -Wformat-security -Wmissing-declarations -Wmissing-prototypes -Wold-style-definition -Wpointer-arith -Wsign-compare -Wstrict-prototypes -Wundef -Wwrite-strings -Wno-missing-field-initializers -diag-disable=188 -diag-disable=2203 -diag-disable=2279 -diag-disable=2557 -diag-disable=3179 -diag-disable=3656 -D_GNU_SOURCE -fPIC -march=native -DALLOW_EXPERIMENTAL_API -DALLOW_INTERNAL_API -MD -MQ 'lib/76b5a35@@rte_gro at sta/librte_gro_gro_vxlan_udp4.c.o' -MF 'lib/76b5a35@@rte_gro at sta/librte_gro_gro_vxlan_udp4.c.o.d' -o 'lib/76b5a35@@rte_gro at sta/librte_gro_gro_vxlan_udp4.c.o' -c ../lib/librte_gro/gro_vxlan_udp4.c
../lib/librte_gro/gro_vxlan_udp4.c(216): error #266: function "udp_check_neighbor" declared implicitly
  	cmp = udp_check_neighbor(&item->inner_item, frag_offset, ip_dl,
  	      ^

compilation aborted for ../lib/librte_gro/gro_vxlan_udp4.c (code 2)
[267/2571] Compiling C object 'lib/76b5a35@@rte_eventdev at sta/librte_eventdev_rte_event_ring.c.o'.
[268/2571] Compiling C object 'lib/76b5a35@@rte_eventdev at sta/librte_eventdev_eventdev_trace_points.c.o'.
[269/2571] Generating symbol file 'lib/76b5a35@@rte_cryptodev at sha/librte_cryptodev.so.21.0.symbols'.
[270/2571] Linking target lib/librte_distributor.so.21.0.
[271/2571] Linking target lib/librte_ethdev.so.21.0.
[272/2571] Linking target lib/librte_cmdline.so.21.0.
[273/2571] Compiling C object 'lib/76b5a35@@rte_efd at sta/librte_efd_rte_efd.c.o'.
[274/2571] Compiling C object 'lib/76b5a35@@rte_eventdev at sta/librte_eventdev_rte_eventdev.c.o'.
[275/2571] Compiling C object 'lib/76b5a35@@rte_eventdev at sta/librte_eventdev_rte_event_eth_rx_adapter.c.o'.
ninja: build stopped: subcommand failed




*Build Failed #21:
OS: UB2004-64
Target: x86_64-gcc-doc
FAILED: lib/76b5a35@@rte_gro at sta/librte_gro_gro_vxlan_udp4.c.o 
gcc -Ilib/76b5a35@@rte_gro at sta -Ilib -I../lib -Ilib/librte_gro -I../lib/librte_gro -I. -I../ -Iconfig -I../config -Ilib/librte_eal/include -I../lib/librte_eal/include -Ilib/librte_eal/linux/include -I../lib/librte_eal/linux/include -Ilib/librte_eal/x86/include -I../lib/librte_eal/x86/include -Ilib/librte_eal/common -I../lib/librte_eal/common -Ilib/librte_eal -I../lib/librte_eal -Ilib/librte_kvargs -I../lib/librte_kvargs -Ilib/librte_telemetry/../librte_metrics -I../lib/librte_telemetry/../librte_metrics -Ilib/librte_telemetry -I../lib/librte_telemetry -Ilib/librte_ethdev -I../lib/librte_ethdev -Ilib/librte_net -I../lib/librte_net -Ilib/librte_mbuf -I../lib/librte_mbuf -Ilib/librte_mempool -I../lib/librte_mempool -Ilib/librte_ring -I../lib/librte_ring -Ilib/librte_meter -I../lib/librte_meter -fdiagnostics-color=always -pipe -D_FILE_OFFSET_BITS=64 -Wall -Winvalid-pch -Werror -O3 -include rte_config.h -Wextra -Wcast-qual -Wdeprecated -Wformat-nonliteral -Wformat-security -Wmissing-declarations -Wmissing-prototypes -Wnested-externs -Wold-style-definition -Wpointer-arith -Wsign-compare -Wstrict-prototypes -Wundef -Wwrite-strings -Wno-address-of-packed-member -Wno-packed-not-aligned -Wno-missing-field-initializers -D_GNU_SOURCE -fPIC -march=native -DALLOW_EXPERIMENTAL_API -DALLOW_INTERNAL_API -Wno-format-truncation -MD -MQ 'lib/76b5a35@@rte_gro at sta/librte_gro_gro_vxlan_udp4.c.o' -MF 'lib/76b5a35@@rte_gro at sta/librte_gro_gro_vxlan_udp4.c.o.d' -o 'lib/76b5a35@@rte_gro at sta/librte_gro_gro_vxlan_udp4.c.o' -c ../lib/librte_gro/gro_vxlan_udp4.c
../lib/librte_gro/gro_vxlan_udp4.c: In function ‘udp_check_vxlan_neighbor’:
../lib/librte_gro/gro_vxlan_udp4.c:216:8: error: implicit declaration of function ‘udp_check_neighbor’; did you mean ‘udp4_check_neighbor’? [-Werror=implicit-function-declaration]
  216 |  cmp = udp_check_neighbor(&item->inner_item, frag_offset, ip_dl,
      |        ^~~~~~~~~~~~~~~~~~
      |        udp4_check_neighbor
../lib/librte_gro/gro_vxlan_udp4.c:216:8: error: nested extern declaration of ‘udp_check_neighbor’ [-Werror=nested-externs]
cc1: all warnings being treated as errors
[259/2430] Linking target lib/librte_net.so.21.0.
[260/2430] Generating symbol file 'lib/76b5a35@@rte_compressdev at sha/librte_compressdev.so.21.0.symbols'.
[261/2430] Compiling C object 'lib/76b5a35@@rte_eventdev at sta/librte_eventdev_rte_eventdev.c.o'.
[262/2430] Compiling C object 'lib/76b5a35@@rte_efd at sta/librte_efd_rte_efd.c.o'.
[263/2430] Compiling C object 'lib/76b5a35@@rte_eventdev at sta/librte_eventdev_rte_event_timer_adapter.c.o'.
[264/2430] Compiling C object 'lib/76b5a35@@rte_eventdev at sta/librte_eventdev_rte_event_eth_tx_adapter.c.o'.
[265/2430] Compiling C object 'lib/76b5a35@@rte_eventdev at sta/librte_eventdev_rte_event_crypto_adapter.c.o'.
[266/2430] Compiling C object 'lib/76b5a35@@rte_eventdev at sta/librte_eventdev_rte_event_eth_rx_adapter.c.o'.
[267/2430] Compiling C object 'lib/76b5a35@@rte_pipeline at sta/librte_pipeline_rte_table_action.c.o'.
ninja: build stopped: subcommand failed


DPDK STV team


More information about the test-report mailing list