[dpdk-test-report] |FAILURE| pw(77141) net: add support for AVX512 when generating CRC

sys_stv at intel.com sys_stv at intel.com
Mon Sep 14 11:10:39 CEST 2020


Test-Label: Intel-compilation
Test-Status: FAILURE
http://dpdk.org/patch/77141

_Compilation issues_

Submitter: Mairtin o Loingsigh <mairtin.oloingsigh at intel.com>
Date: 2020-09-10 12:01:11
Reply_mail: 1599739271-16605-1-git-send-email-mairtin.oloingsigh at intel.com

DPDK git baseline: Repo:dpdk, CommitID: 25efc61539603dbe634cd1a5b84c956c55893e41


Build Summary: 22 Builds Done, 17 Successful, 5 Failures, 0 Blocked

+----------------+------------+--------------+------------+------------+-----------+----------+
| os             | gcc-static | clang-static | icc-static | gcc-shared | gcc-debug | document |
+----------------+------------+--------------+------------+------------+-----------+----------+
| CENTOS82-64    | pass       | pass         | pass       | pass       | pass      |          |
| UB2004-64      | FAIL       | FAIL         | pass       |            |           | FAIL     |
| UB1804-64      | pass       |              |            |            |           |          |
| FC32-64        | FAIL       | pass         |            |            |           |          |
| CENTOS77-64    | pass       |              |            |            |           |          |
| RHEL82-64      | pass       |              |            |            |           |          |
| WIN10-64       |            | pass         |            |            |           |          |
| UB2004-32      | pass       |              |            |            |           |          |
| FreeBSD1201-64 | pass       | pass         |            | pass       | pass      |          |
| SUSE15-64      | FAIL       | pass         |            |            |           |          |
+----------------+------------+--------------+------------+------------+-----------+----------+
Test environment and configuration as below:
** Meson build **



OS: CENTOS82-64
	Kernel Version: 4.18.0-193.el8.x86_64
	CPU info: Intel(R) Xeon(R) Platinum 8280M CPU @ 2.70GHz
	GCC Version: gcc (GCC) 8.3.1 20191121 (Red Hat 8.3.1-5)
	Clang Version: 9.0.1 (Red Hat 9.0.1-2.module_el8.2.0+309+0c7b6b03)
	x86_64-gcc-static
	x86_64-clang-static
	x86_64-icc-static
	x86_64-gcc-shared
	x86_64-gcc-debug


OS: UB2004-64
	Kernel Version: 5.4.0-26-generic
	CPU info: Intel(R) Xeon(R) Platinum 8180 CPU @ 2.50GHz
	GCC Version: gcc (Ubuntu 9.3.0-10ubuntu2) 9.3.0
	Clang Version: 10.0.0-4ubuntu1
	x86_64-gcc-doc
	x86_64-clang-static
	x86_64-gcc-static
	x86_64-icc-static


OS: UB1804-64
	Kernel Version: 5.3.0-59-generic
	CPU info: Intel(R) Xeon(R) Platinum 8180 CPU @ 2.50GHz
	GCC Version: gcc (Ubuntu 8.4.0-1ubuntu1~18.04) 8.4.0
	Clang Version: 6.0.0-1ubuntu2 (tags/RELEASE_600/final)
	x86_64-gcc-static


OS: FC32-64
	Kernel Version: 5.6.0-0.rc7.git0.2.fc32.x86_64
	CPU info: Intel(R) Xeon(R) Platinum 8280M CPU @ 2.70GHz
	GCC Version: gcc (GCC) 10.0.1 20200311 (Red Hat 10.0.1-0.9)
	Clang Version: 10.0.0 (Fedora 10.0.0-0.3.rc4.fc32)
	x86_64-gcc-static
	x86_64-clang-static


OS: CENTOS77-64
	Kernel Version: 3.10.0-1062.9.1.el7.x86_64
	CPU info: Intel(R) Xeon(R) Platinum 8280M CPU @ 2.70GHz
	GCC Version: gcc (GCC) 4.8.5 20150623 (Red Hat 4.8.5-39)
	Clang Version: 3.4.2 (tags/RELEASE_34/dot2-final)
	x86_64-gcc-static


OS: RHEL82-64
	Kernel Version: 4.18.0-193.el8.x86_64
	CPU info: Intel(R) Xeon(R) Platinum 8280M CPU @ 2.70GHz
	GCC Version: gcc (GCC) 8.3.1 20191121 (Red Hat 8.3.1-5)
	Clang Version: 8.0.1 (Red Hat 8.0.1-1.module_el8.1.0+215+a01033fb)
	x86_64-gcc-static


OS: WIN10-64
	Kernel Version: N/A
	CPU info: N/A
	GCC Version: N/A
	Clang Version: Clang 8.0.0
	x86_64-windows-clang


OS: UB2004-32
	Kernel Version: 5.4.0-26-generic
	CPU info: Intel(R) Xeon(R) Platinum 8180 CPU @ 2.50GHz
	GCC Version: gcc (Ubuntu 9.3.0-10ubuntu2) 9.3.0
	Clang Version: 10.0.0-4ubuntu1
	i686-gcc-static


OS: FreeBSD1201-64
	Kernel Version: 12.1-RELEASE
	CPU info: Intel(R) Xeon(R) CPU E5-2699 v3 @ 2.30GHz (2294.74-MHz K8-class CPU)
	GCC Version: gcc (FreeBSD Ports Collection) 9.2.0
	Clang Version: 8.0.1 (tags/RELEASE_801/final 366581) (based on LLVM 8.0.1)
	x86_64-gcc-static
	x86_64-clang-static
	x86_64-gcc-shared
	x86_64-gcc-debug


OS: SUSE15-64
	Kernel Version: 4.12.14-lp150.11-default
	CPU info: Intel(R) Xeon(R) CPU E5-2699 v4 @ 2.20GHz
	GCC Version: gcc (SUSE Linux) 7.3.1 20180323 [gcc-7-branch revision 258812]
	Clang Version: 5.0.1 (tags/RELEASE_501/final 312548)
	x86_64-clang-static
	x86_64-gcc-static



*Build Failed #1:
OS: UB2004-64
Target: x86_64-gcc-doc
FAILED: lib/76b5a35@@rte_net at sta/librte_net_rte_net_crc.c.o 
gcc -Ilib/76b5a35@@rte_net at sta -Ilib -I../lib -Ilib/librte_net -I../lib/librte_net -I. -I../ -Iconfig -I../config -Ilib/librte_eal/include -I../lib/librte_eal/include -Ilib/librte_eal/linux/include -I../lib/librte_eal/linux/include -Ilib/librte_eal/x86/include -I../lib/librte_eal/x86/include -Ilib/librte_eal/common -I../lib/librte_eal/common -Ilib/librte_eal -I../lib/librte_eal -Ilib/librte_kvargs -I../lib/librte_kvargs -Ilib/librte_telemetry/../librte_metrics -I../lib/librte_telemetry/../librte_metrics -Ilib/librte_telemetry -I../lib/librte_telemetry -Ilib/librte_mbuf -I../lib/librte_mbuf -Ilib/librte_mempool -I../lib/librte_mempool -Ilib/librte_ring -I../lib/librte_ring -fdiagnostics-color=always -pipe -D_FILE_OFFSET_BITS=64 -Wall -Winvalid-pch -Werror -O3 -include rte_config.h -Wextra -Wcast-qual -Wdeprecated -Wformat-nonliteral -Wformat-security -Wmissing-declarations -Wmissing-prototypes -Wnested-externs -Wold-style-definition -Wpointer-arith -Wsign-compare -Wstrict-prototypes -Wundef -Wwrite-strings -Wno-address-of-packed-member -Wno-packed-not-aligned -Wno-missing-field-initializers -D_GNU_SOURCE -fPIC -march=native -DALLOW_EXPERIMENTAL_API -DALLOW_INTERNAL_API -Wno-format-truncation -MD -MQ 'lib/76b5a35@@rte_net at sta/librte_net_rte_net_crc.c.o' -MF 'lib/76b5a35@@rte_net at sta/librte_net_rte_net_crc.c.o.d' -o 'lib/76b5a35@@rte_net at sta/librte_net_rte_net_crc.c.o' -c ../lib/librte_net/rte_net_crc.c
In file included from /usr/lib/gcc/x86_64-linux-gnu/9/include/immintrin.h:121,
                 from /usr/lib/gcc/x86_64-linux-gnu/9/include/x86intrin.h:32,
                 from ../lib/librte_eal/x86/include/rte_vect.h:30,
                 from ../lib/librte_net/net_crc_avx.h:10,
                 from ../lib/librte_net/rte_net_crc.c:23:
../lib/librte_net/net_crc_avx.h: In function ‘crcr32_folding_round’:
/usr/lib/gcc/x86_64-linux-gnu/9/include/vpclmulqdqintrin.h:40:1: error: inlining failed in call to always_inline ‘_mm512_clmulepi64_epi128’: target specific option mismatch
   40 | _mm512_clmulepi64_epi128 (__m512i __A, __m512i __B, const int __C)
      | ^~~~~~~~~~~~~~~~~~~~~~~~
In file included from ../lib/librte_net/rte_net_crc.c:23:
../lib/librte_net/net_crc_avx.h:56:17: note: called from here
   56 |  __m512i tmp1 = _mm512_clmulepi64_epi128(fold, precomp, 0x10);
      |                 ^~~~~~~~~~~~~~~~~~~~~~~~~~~~~~~~~~~~~~~~~~~~~
In file included from /usr/lib/gcc/x86_64-linux-gnu/9/include/immintrin.h:121,
                 from /usr/lib/gcc/x86_64-linux-gnu/9/include/x86intrin.h:32,
                 from ../lib/librte_eal/x86/include/rte_vect.h:30,
                 from ../lib/librte_net/net_crc_avx.h:10,
                 from ../lib/librte_net/rte_net_crc.c:23:
/usr/lib/gcc/x86_64-linux-gnu/9/include/vpclmulqdqintrin.h:40:1: error: inlining failed in call to always_inline ‘_mm512_clmulepi64_epi128’: target specific option mismatch
   40 | _mm512_clmulepi64_epi128 (__m512i __A, __m512i __B, const int __C)
      | ^~~~~~~~~~~~~~~~~~~~~~~~
In file included from ../lib/librte_net/rte_net_crc.c:23:
../lib/librte_net/net_crc_avx.h:55:17: note: called from here
   55 |  __m512i tmp0 = _mm512_clmulepi64_epi128(fold, precomp, 0x01);
      |                 ^~~~~~~~~~~~~~~~~~~~~~~~~~~~~~~~~~~~~~~~~~~~~
[117/2428] Generating rte_meter_def with a custom command.
[118/2428] Generating rcu.sym_chk with a meson_exe.py custom command.
[119/2428] Generating rte_meter_mingw with a custom command.
[120/2428] Compiling C object 'lib/76b5a35@@rte_meter at sta/librte_meter_rte_meter.c.o'.
[121/2428] Compiling C object 'lib/76b5a35@@rte_meter at sha/librte_meter_rte_meter.c.o'.
[122/2428] Compiling C object 'lib/76b5a35@@rte_distributor at sta/librte_distributor_rte_distributor_single.c.o'.
[123/2428] Compiling C object 'lib/76b5a35@@rte_ethdev at sta/librte_ethdev_ethdev_profile.c.o'.
[124/2428] Compiling C object 'lib/76b5a35@@rte_mbuf at sta/librte_mbuf_rte_mbuf.c.o'.
[125/2428] Generating eal.sym_chk with a meson_exe.py custom command.
ninja: build stopped: subcommand failed




*Build Failed #2:
OS: FC32-64
Target: x86_64-gcc-static
FAILED: lib/76b5a35@@rte_net at sta/librte_net_rte_net_crc.c.o 
gcc -Ilib/76b5a35@@rte_net at sta -Ilib -I../lib -Ilib/librte_net -I../lib/librte_net -I. -I../ -Iconfig -I../config -Ilib/librte_eal/include -I../lib/librte_eal/include -Ilib/librte_eal/linux/include -I../lib/librte_eal/linux/include -Ilib/librte_eal/x86/include -I../lib/librte_eal/x86/include -Ilib/librte_eal/common -I../lib/librte_eal/common -Ilib/librte_eal -I../lib/librte_eal -Ilib/librte_kvargs -I../lib/librte_kvargs -Ilib/librte_telemetry/../librte_metrics -I../lib/librte_telemetry/../librte_metrics -Ilib/librte_telemetry -I../lib/librte_telemetry -Ilib/librte_mbuf -I../lib/librte_mbuf -Ilib/librte_mempool -I../lib/librte_mempool -Ilib/librte_ring -I../lib/librte_ring -fdiagnostics-color=always -pipe -D_FILE_OFFSET_BITS=64 -Wall -Winvalid-pch -Werror -O3 -include rte_config.h -Wextra -Wcast-qual -Wdeprecated -Wformat-nonliteral -Wformat-security -Wmissing-declarations -Wmissing-prototypes -Wnested-externs -Wold-style-definition -Wpointer-arith -Wsign-compare -Wstrict-prototypes -Wundef -Wwrite-strings -Wno-address-of-packed-member -Wno-packed-not-aligned -Wno-missing-field-initializers -Wno-zero-length-bounds -D_GNU_SOURCE -fPIC -march=native -DALLOW_EXPERIMENTAL_API -DALLOW_INTERNAL_API -Wno-format-truncation -MD -MQ 'lib/76b5a35@@rte_net at sta/librte_net_rte_net_crc.c.o' -MF 'lib/76b5a35@@rte_net at sta/librte_net_rte_net_crc.c.o.d' -o 'lib/76b5a35@@rte_net at sta/librte_net_rte_net_crc.c.o' -c ../lib/librte_net/rte_net_crc.c
In file included from /usr/lib/gcc/x86_64-redhat-linux/10/include/immintrin.h:125,
                 from /usr/lib/gcc/x86_64-redhat-linux/10/include/x86intrin.h:32,
                 from ../lib/librte_eal/x86/include/rte_vect.h:30,
                 from ../lib/librte_net/net_crc_avx.h:10,
                 from ../lib/librte_net/rte_net_crc.c:23:
../lib/librte_net/net_crc_avx.h: In function ‘crcr32_folding_round’:
/usr/lib/gcc/x86_64-redhat-linux/10/include/vpclmulqdqintrin.h:40:1: error: inlining failed in call to ‘always_inline’ ‘_mm512_clmulepi64_epi128’: target specific option mismatch
   40 | _mm512_clmulepi64_epi128 (__m512i __A, __m512i __B, const int __C)
      | ^~~~~~~~~~~~~~~~~~~~~~~~
In file included from ../lib/librte_net/rte_net_crc.c:23:
../lib/librte_net/net_crc_avx.h:56:17: note: called from here
   56 |  __m512i tmp1 = _mm512_clmulepi64_epi128(fold, precomp, 0x10);
      |                 ^~~~~~~~~~~~~~~~~~~~~~~~~~~~~~~~~~~~~~~~~~~~~
In file included from /usr/lib/gcc/x86_64-redhat-linux/10/include/immintrin.h:125,
                 from /usr/lib/gcc/x86_64-redhat-linux/10/include/x86intrin.h:32,
                 from ../lib/librte_eal/x86/include/rte_vect.h:30,
                 from ../lib/librte_net/net_crc_avx.h:10,
                 from ../lib/librte_net/rte_net_crc.c:23:
/usr/lib/gcc/x86_64-redhat-linux/10/include/vpclmulqdqintrin.h:40:1: error: inlining failed in call to ‘always_inline’ ‘_mm512_clmulepi64_epi128’: target specific option mismatch
   40 | _mm512_clmulepi64_epi128 (__m512i __A, __m512i __B, const int __C)
      | ^~~~~~~~~~~~~~~~~~~~~~~~
In file included from ../lib/librte_net/rte_net_crc.c:23:
../lib/librte_net/net_crc_avx.h:55:17: note: called from here
   55 |  __m512i tmp0 = _mm512_clmulepi64_epi128(fold, precomp, 0x01);
      |                 ^~~~~~~~~~~~~~~~~~~~~~~~~~~~~~~~~~~~~~~~~~~~~
[116/2579] Compiling C object 'lib/76b5a35@@rte_net at sta/librte_net_rte_arp.c.o'.
[117/2579] Compiling C object 'lib/76b5a35@@rte_meter at sta/librte_meter_rte_meter.c.o'.
[118/2579] Compiling C object 'lib/76b5a35@@rte_meter at sha/librte_meter_rte_meter.c.o'.
[119/2579] Generating mempool.sym_chk with a meson_exe.py custom command.
[120/2579] Compiling C object 'lib/76b5a35@@rte_net at sta/librte_net_rte_net.c.o'.
[121/2579] Generating rcu.sym_chk with a meson_exe.py custom command.
[122/2579] Compiling C object 'lib/76b5a35@@rte_distributor at sta/librte_distributor_rte_distributor_single.c.o'.
[123/2579] Compiling C object 'lib/76b5a35@@rte_ethdev at sta/librte_ethdev_ethdev_private.c.o'.
[124/2579] Compiling C object 'lib/76b5a35@@rte_mbuf at sta/librte_mbuf_rte_mbuf.c.o'.
[125/2579] Compiling C object 'lib/76b5a35@@rte_ethdev at sta/librte_ethdev_ethdev_profile.c.o'.
[126/2579] Generating eal.sym_chk with a meson_exe.py custom command.
ninja: build stopped: subcommand failed




*Build Failed #3:
OS: SUSE15-64
Target: x86_64-gcc-static
FAILED: lib/76b5a35@@rte_net at sta/librte_net_rte_net_crc.c.o 
gcc -Ilib/76b5a35@@rte_net at sta -Ilib -I../lib -Ilib/librte_net -I../lib/librte_net -I. -I.. -Iconfig -I../config -Ilib/librte_eal/include -I../lib/librte_eal/include -Ilib/librte_eal/linux/include -I../lib/librte_eal/linux/include -Ilib/librte_eal/x86/include -I../lib/librte_eal/x86/include -Ilib/librte_eal/common -I../lib/librte_eal/common -Ilib/librte_eal -I../lib/librte_eal -Ilib/librte_kvargs -I../lib/librte_kvargs -Ilib/librte_metrics -I../lib/librte_metrics -Ilib/librte_telemetry -I../lib/librte_telemetry -Ilib/librte_mbuf -I../lib/librte_mbuf -Ilib/librte_mempool -I../lib/librte_mempool -Ilib/librte_ring -I../lib/librte_ring -fdiagnostics-color=always -pipe -D_FILE_OFFSET_BITS=64 -Wall -Winvalid-pch -Werror -O3 -include rte_config.h -Wextra -Wcast-qual -Wdeprecated -Wformat-nonliteral -Wformat-security -Wmissing-declarations -Wmissing-prototypes -Wnested-externs -Wold-style-definition -Wpointer-arith -Wsign-compare -Wstrict-prototypes -Wundef -Wwrite-strings -Wno-missing-field-initializers -D_GNU_SOURCE -fPIC -march=native -DALLOW_EXPERIMENTAL_API -DALLOW_INTERNAL_API -Wno-format-truncation -MD -MQ 'lib/76b5a35@@rte_net at sta/librte_net_rte_net_crc.c.o' -MF 'lib/76b5a35@@rte_net at sta/librte_net_rte_net_crc.c.o.d' -o 'lib/76b5a35@@rte_net at sta/librte_net_rte_net_crc.c.o' -c ../lib/librte_net/rte_net_crc.c
In file included from ../lib/librte_net/rte_net_crc.c:23:0:
../lib/librte_net/net_crc_avx.h: In function ‘crcr32_folding_round’:
../lib/librte_net/net_crc_avx.h:55:17: error: implicit declaration of function ‘_mm512_clmulepi64_epi128’; did you mean ‘_mm512_cvtusepi64_epi8’? [-Werror=implicit-function-declaration]
  __m512i tmp0 = _mm512_clmulepi64_epi128(fold, precomp, 0x01);
                 ^~~~~~~~~~~~~~~~~~~~~~~~
                 _mm512_cvtusepi64_epi8
../lib/librte_net/net_crc_avx.h:55:17: error: nested extern declaration of ‘_mm512_clmulepi64_epi128’ [-Werror=nested-externs]
../lib/librte_net/net_crc_avx.h:55:17: error: incompatible types when initializing type ‘__m512i {aka __vector(8) long long int}’ using type ‘int’
../lib/librte_net/net_crc_avx.h:56:17: error: incompatible types when initializing type ‘__m512i {aka __vector(8) long long int}’ using type ‘int’
  __m512i tmp1 = _mm512_clmulepi64_epi128(fold, precomp, 0x10);
                 ^~~~~~~~~~~~~~~~~~~~~~~~
../lib/librte_net/net_crc_avx.h: In function ‘crcr32_reduce_64_to_32’:
../lib/librte_net/net_crc_avx.h:117:7: error: incompatible types when assigning to type ‘__m512i {aka __vector(8) long long int}’ from type ‘int’
  tmp1 = _mm512_clmulepi64_epi128(tmp0, precomp, 0x00);
       ^
../lib/librte_net/net_crc_avx.h:122:7: error: incompatible types when assigning to type ‘__m512i {aka __vector(8) long long int}’ from type ‘int’
  tmp2 = _mm512_clmulepi64_epi128(tmp1, precomp, 0x10);
       ^
../lib/librte_net/net_crc_avx.h: In function ‘crc32_eth_calc_pclmulqdq’:
../lib/librte_net/net_crc_avx.h:260:8: error: incompatible types when assigning to type ‘__m512i {aka __vector(8) long long int}’ from type ‘int’
   temp = _mm512_clmulepi64_epi128(a, k, 0x01);
        ^
../lib/librte_net/net_crc_avx.h:261:9: error: incompatible types when assigning to type ‘__m512i {aka __vector(8) long long int}’ from type ‘int’
   fold0 = _mm512_clmulepi64_epi128(a, k, 0x10);
         ^
cc1: all warnings being treated as errors
[113/2547] Generating rte_net_mingw with a custom command
[114/2547] Compiling C object 'lib/76b5a35@@rte_net at sta/librte_net_rte_ether.c.o'
[115/2547] Compiling C object 'lib/76b5a35@@rte_mbuf at sta/librte_mbuf_rte_mbuf.c.o'
[116/2547] Compiling C object 'lib/76b5a35@@rte_net at sta/librte_net_rte_net.c.o'
[117/2547] Generating mempool.sym_chk with a meson_exe.py custom command
[118/2547] Compiling C object 'lib/76b5a35@@rte_distributor at sta/librte_distributor_rte_distributor_match_sse.c.o'
[119/2547] Compiling C object 'lib/76b5a35@@rte_acl at sta/librte_acl_acl_run_avx2.c.o'
[120/2547] Compiling C object 'lib/76b5a35@@rte_distributor at sta/librte_distributor_rte_distributor_single.c.o'
[121/2547] Generating eal.sym_chk with a meson_exe.py custom command
ninja: build stopped: subcommand failed




*Build Failed #4:
OS: UB2004-64
Target: x86_64-clang-static
FAILED: lib/76b5a35@@rte_net at sta/librte_net_rte_net_crc.c.o 
clang -Ilib/76b5a35@@rte_net at sta -Ilib -I../lib -Ilib/librte_net -I../lib/librte_net -I. -I../ -Iconfig -I../config -Ilib/librte_eal/include -I../lib/librte_eal/include -Ilib/librte_eal/linux/include -I../lib/librte_eal/linux/include -Ilib/librte_eal/x86/include -I../lib/librte_eal/x86/include -Ilib/librte_eal/common -I../lib/librte_eal/common -Ilib/librte_eal -I../lib/librte_eal -Ilib/librte_kvargs -I../lib/librte_kvargs -Ilib/librte_telemetry/../librte_metrics -I../lib/librte_telemetry/../librte_metrics -Ilib/librte_telemetry -I../lib/librte_telemetry -Ilib/librte_mbuf -I../lib/librte_mbuf -Ilib/librte_mempool -I../lib/librte_mempool -Ilib/librte_ring -I../lib/librte_ring -Xclang -fcolor-diagnostics -pipe -D_FILE_OFFSET_BITS=64 -Wall -Winvalid-pch -Werror -O3 -include rte_config.h -Wextra -Wcast-qual -Wdeprecated -Wformat-nonliteral -Wformat-security -Wmissing-declarations -Wmissing-prototypes -Wnested-externs -Wold-style-definition -Wpointer-arith -Wsign-compare -Wstrict-prototypes -Wundef -Wwrite-strings -Wno-address-of-packed-member -Wno-missing-field-initializers -D_GNU_SOURCE -fPIC -march=native -DALLOW_EXPERIMENTAL_API -DALLOW_INTERNAL_API -MD -MQ 'lib/76b5a35@@rte_net at sta/librte_net_rte_net_crc.c.o' -MF 'lib/76b5a35@@rte_net at sta/librte_net_rte_net_crc.c.o.d' -o 'lib/76b5a35@@rte_net at sta/librte_net_rte_net_crc.c.o' -c ../lib/librte_net/rte_net_crc.c
In file included from ../lib/librte_net/rte_net_crc.c:23:
../lib/librte_net/net_crc_avx.h:260:10: error: '__builtin_ia32_pclmulqdq512' needs target feature avx512f,vpclmulqdq
                temp = _mm512_clmulepi64_epi128(a, k, 0x01);
                       ^
/usr/lib/llvm-10/lib/clang/10.0.0/include/vpclmulqdqintrin.h:23:12: note: expanded from macro '_mm512_clmulepi64_epi128'
  (__m512i)__builtin_ia32_pclmulqdq512((__v8di)(__m512i)(A),  \
           ^
In file included from ../lib/librte_net/rte_net_crc.c:23:
../lib/librte_net/net_crc_avx.h:261:11: error: '__builtin_ia32_pclmulqdq512' needs target feature avx512f,vpclmulqdq
                fold0 = _mm512_clmulepi64_epi128(a, k, 0x10);
                        ^
/usr/lib/llvm-10/lib/clang/10.0.0/include/vpclmulqdqintrin.h:23:12: note: expanded from macro '_mm512_clmulepi64_epi128'
  (__m512i)__builtin_ia32_pclmulqdq512((__v8di)(__m512i)(A),  \
           ^
In file included from ../lib/librte_net/rte_net_crc.c:23:
../lib/librte_net/net_crc_avx.h:55:17: error: '__builtin_ia32_pclmulqdq512' needs target feature avx512f,vpclmulqdq
        __m512i tmp0 = _mm512_clmulepi64_epi128(fold, precomp, 0x01);
                       ^
/usr/lib/llvm-10/lib/clang/10.0.0/include/vpclmulqdqintrin.h:23:12: note: expanded from macro '_mm512_clmulepi64_epi128'
  (__m512i)__builtin_ia32_pclmulqdq512((__v8di)(__m512i)(A),  \
           ^
In file included from ../lib/librte_net/rte_net_crc.c:23:
../lib/librte_net/net_crc_avx.h:56:17: error: '__builtin_ia32_pclmulqdq512' needs target feature avx512f,vpclmulqdq
        __m512i tmp1 = _mm512_clmulepi64_epi128(fold, precomp, 0x10);
                       ^
/usr/lib/llvm-10/lib/clang/10.0.0/include/vpclmulqdqintrin.h:23:12: note: expanded from macro '_mm512_clmulepi64_epi128'
  (__m512i)__builtin_ia32_pclmulqdq512((__v8di)(__m512i)(A),  \
           ^
In file included from ../lib/librte_net/rte_net_crc.c:23:
../lib/librte_net/net_crc_avx.h:117:9: error: '__builtin_ia32_pclmulqdq512' needs target feature avx512f,vpclmulqdq
        tmp1 = _mm512_clmulepi64_epi128(tmp0, precomp, 0x00);
               ^
/usr/lib/llvm-10/lib/clang/10.0.0/include/vpclmulqdqintrin.h:23:12: note: expanded from macro '_mm512_clmulepi64_epi128'
  (__m512i)__builtin_ia32_pclmulqdq512((__v8di)(__m512i)(A),  \
           ^
In file included from ../lib/librte_net/rte_net_crc.c:23:
../lib/librte_net/net_crc_avx.h:122:9: error: '__builtin_ia32_pclmulqdq512' needs target feature avx512f,vpclmulqdq
        tmp2 = _mm512_clmulepi64_epi128(tmp1, precomp, 0x10);
               ^
/usr/lib/llvm-10/lib/clang/10.0.0/include/vpclmulqdqintrin.h:23:12: note: expanded from macro '_mm512_clmulepi64_epi128'
  (__m512i)__builtin_ia32_pclmulqdq512((__v8di)(__m512i)(A),  \
           ^
6 errors generated.
[119/2569] Compiling C object 'lib/76b5a35@@rte_mbuf at sta/librte_mbuf_rte_mbuf.c.o'.
[120/2569] Compiling C object 'lib/76b5a35@@rte_meter at sta/librte_meter_rte_meter.c.o'.
[121/2569] Compiling C object 'lib/76b5a35@@rte_meter at sha/librte_meter_rte_meter.c.o'.
[122/2569] Generating rcu.sym_chk with a meson_exe.py custom command.
[123/2569] Compiling C object 'lib/76b5a35@@rte_distributor at sta/librte_distributor_rte_distributor_single.c.o'.
[124/2569] Compiling C object 'lib/76b5a35@@rte_ethdev at sta/librte_ethdev_ethdev_profile.c.o'.
[125/2569] Generating eal.sym_chk with a meson_exe.py custom command.
[126/2569] Compiling C object 'lib/76b5a35@@rte_ethdev at sta/librte_ethdev_ethdev_private.c.o'.
[127/2569] Compiling C object 'lib/76b5a35@@rte_ethdev at sta/librte_ethdev_rte_class_eth.c.o'.
ninja: build stopped: subcommand failed




*Build Failed #5:
OS: UB2004-64
Target: x86_64-gcc-static
FAILED: lib/76b5a35@@rte_net at sta/librte_net_rte_net_crc.c.o 
gcc -Ilib/76b5a35@@rte_net at sta -Ilib -I../lib -Ilib/librte_net -I../lib/librte_net -I. -I../ -Iconfig -I../config -Ilib/librte_eal/include -I../lib/librte_eal/include -Ilib/librte_eal/linux/include -I../lib/librte_eal/linux/include -Ilib/librte_eal/x86/include -I../lib/librte_eal/x86/include -Ilib/librte_eal/common -I../lib/librte_eal/common -Ilib/librte_eal -I../lib/librte_eal -Ilib/librte_kvargs -I../lib/librte_kvargs -Ilib/librte_telemetry/../librte_metrics -I../lib/librte_telemetry/../librte_metrics -Ilib/librte_telemetry -I../lib/librte_telemetry -Ilib/librte_mbuf -I../lib/librte_mbuf -Ilib/librte_mempool -I../lib/librte_mempool -Ilib/librte_ring -I../lib/librte_ring -fdiagnostics-color=always -pipe -D_FILE_OFFSET_BITS=64 -Wall -Winvalid-pch -Werror -O3 -include rte_config.h -Wextra -Wcast-qual -Wdeprecated -Wformat-nonliteral -Wformat-security -Wmissing-declarations -Wmissing-prototypes -Wnested-externs -Wold-style-definition -Wpointer-arith -Wsign-compare -Wstrict-prototypes -Wundef -Wwrite-strings -Wno-address-of-packed-member -Wno-packed-not-aligned -Wno-missing-field-initializers -Wno-zero-length-bounds -D_GNU_SOURCE -fPIC -march=native -DALLOW_EXPERIMENTAL_API -DALLOW_INTERNAL_API -Wno-format-truncation -MD -MQ 'lib/76b5a35@@rte_net at sta/librte_net_rte_net_crc.c.o' -MF 'lib/76b5a35@@rte_net at sta/librte_net_rte_net_crc.c.o.d' -o 'lib/76b5a35@@rte_net at sta/librte_net_rte_net_crc.c.o' -c ../lib/librte_net/rte_net_crc.c
In file included from /usr/lib/gcc/x86_64-linux-gnu/10/include/immintrin.h:125,
                 from /usr/lib/gcc/x86_64-linux-gnu/10/include/x86intrin.h:32,
                 from ../lib/librte_eal/x86/include/rte_vect.h:30,
                 from ../lib/librte_net/net_crc_avx.h:10,
                 from ../lib/librte_net/rte_net_crc.c:23:
../lib/librte_net/net_crc_avx.h: In function ‘crcr32_folding_round’:
/usr/lib/gcc/x86_64-linux-gnu/10/include/vpclmulqdqintrin.h:40:1: error: inlining failed in call to ‘always_inline’ ‘_mm512_clmulepi64_epi128’: target specific option mismatch
   40 | _mm512_clmulepi64_epi128 (__m512i __A, __m512i __B, const int __C)
      | ^~~~~~~~~~~~~~~~~~~~~~~~
In file included from ../lib/librte_net/rte_net_crc.c:23:
../lib/librte_net/net_crc_avx.h:56:17: note: called from here
   56 |  __m512i tmp1 = _mm512_clmulepi64_epi128(fold, precomp, 0x10);
      |                 ^~~~~~~~~~~~~~~~~~~~~~~~~~~~~~~~~~~~~~~~~~~~~
In file included from /usr/lib/gcc/x86_64-linux-gnu/10/include/immintrin.h:125,
                 from /usr/lib/gcc/x86_64-linux-gnu/10/include/x86intrin.h:32,
                 from ../lib/librte_eal/x86/include/rte_vect.h:30,
                 from ../lib/librte_net/net_crc_avx.h:10,
                 from ../lib/librte_net/rte_net_crc.c:23:
/usr/lib/gcc/x86_64-linux-gnu/10/include/vpclmulqdqintrin.h:40:1: error: inlining failed in call to ‘always_inline’ ‘_mm512_clmulepi64_epi128’: target specific option mismatch
   40 | _mm512_clmulepi64_epi128 (__m512i __A, __m512i __B, const int __C)
      | ^~~~~~~~~~~~~~~~~~~~~~~~
In file included from ../lib/librte_net/rte_net_crc.c:23:
../lib/librte_net/net_crc_avx.h:55:17: note: called from here
   55 |  __m512i tmp0 = _mm512_clmulepi64_epi128(fold, precomp, 0x01);
      |                 ^~~~~~~~~~~~~~~~~~~~~~~~~~~~~~~~~~~~~~~~~~~~~
[109/2569] Compiling C object 'lib/76b5a35@@rte_net at sta/librte_net_rte_ether.c.o'.
[110/2569] Compiling C object 'lib/76b5a35@@rte_cryptodev at sta/librte_cryptodev_rte_cryptodev.c.o'.
[111/2569] Generating rcu.sym_chk with a meson_exe.py custom command.
[112/2569] Generating mempool.sym_chk with a meson_exe.py custom command.
[113/2569] Compiling C object 'lib/76b5a35@@rte_net at sta/librte_net_rte_arp.c.o'.
[114/2569] Compiling C object 'lib/76b5a35@@rte_net at sta/librte_net_rte_net.c.o'.
[115/2569] Generating eal.sym_chk with a meson_exe.py custom command.
[116/2569] Compiling C object 'lib/76b5a35@@rte_mbuf at sta/librte_mbuf_rte_mbuf.c.o'.
[117/2569] Compiling C object 'lib/76b5a35@@rte_distributor at sta/librte_distributor_rte_distributor_single.c.o'.
ninja: build stopped: subcommand failed


DPDK STV team


More information about the test-report mailing list