[dpdk-test-report] |FAILURE| pw(77318) [v1] net/iavf: fix invalid cmd after pf reset

sys_stv at intel.com sys_stv at intel.com
Mon Sep 14 11:14:19 CEST 2020


Test-Label: Intel-compilation
Test-Status: FAILURE
http://dpdk.org/patch/77318

_Compilation issues_

Submitter: Jeff Guo <jia.guo at intel.com>
Date: 2020-09-11 05:21:14
Reply_mail: 20200911052114.62723-1-jia.guo at intel.com

DPDK git baseline: Repo:dpdk-next-net-intel, CommitID: 94b907ef679b673a56a70dd80891f95e0cb4d56d


Build Summary: 22 Builds Done, 3 Successful, 19 Failures, 0 Blocked

+----------------+------------+--------------+------------+------------+-----------+----------+
| os             | gcc-static | clang-static | icc-static | gcc-shared | gcc-debug | document |
+----------------+------------+--------------+------------+------------+-----------+----------+
| CENTOS82-64    | FAIL       | FAIL         | pass       | FAIL       | FAIL      |          |
| RHEL82-64      | FAIL       |              |            |            |           |          |
| UB1804-64      | FAIL       |              |            |            |           |          |
| FC32-64        | FAIL       | FAIL         |            |            |           |          |
| CENTOS77-64    | FAIL       |              |            |            |           |          |
| UB2004-64      | FAIL       | FAIL         | pass       |            |           | FAIL     |
| WIN10-64       |            | pass         |            |            |           |          |
| UB2004-32      | FAIL       |              |            |            |           |          |
| FreeBSD1201-64 | FAIL       | FAIL         |            | FAIL       | FAIL      |          |
| SUSE15-64      | FAIL       | FAIL         |            |            |           |          |
+----------------+------------+--------------+------------+------------+-----------+----------+
Test environment and configuration as below:
** Meson build **



OS: CENTOS82-64
	Kernel Version: 4.18.0-193.el8.x86_64
	CPU info: Intel(R) Xeon(R) Platinum 8280M CPU @ 2.70GHz
	GCC Version: gcc (GCC) 8.3.1 20191121 (Red Hat 8.3.1-5)
	Clang Version: 9.0.1 (Red Hat 9.0.1-2.module_el8.2.0+309+0c7b6b03)
	x86_64-gcc-static
	x86_64-clang-static
	x86_64-icc-static
	x86_64-gcc-shared
	x86_64-gcc-debug


OS: RHEL82-64
	Kernel Version: 4.18.0-193.el8.x86_64
	CPU info: Intel(R) Xeon(R) Platinum 8280M CPU @ 2.70GHz
	GCC Version: gcc (GCC) 8.3.1 20191121 (Red Hat 8.3.1-5)
	Clang Version: 8.0.1 (Red Hat 8.0.1-1.module_el8.1.0+215+a01033fb)
	x86_64-gcc-static


OS: UB1804-64
	Kernel Version: 5.3.0-59-generic
	CPU info: Intel(R) Xeon(R) Platinum 8180 CPU @ 2.50GHz
	GCC Version: gcc (Ubuntu 8.4.0-1ubuntu1~18.04) 8.4.0
	Clang Version: 6.0.0-1ubuntu2 (tags/RELEASE_600/final)
	x86_64-gcc-static


OS: FC32-64
	Kernel Version: 5.6.0-0.rc7.git0.2.fc32.x86_64
	CPU info: Intel(R) Xeon(R) Platinum 8280M CPU @ 2.70GHz
	GCC Version: gcc (GCC) 10.0.1 20200311 (Red Hat 10.0.1-0.9)
	Clang Version: 10.0.0 (Fedora 10.0.0-0.3.rc4.fc32)
	x86_64-gcc-static
	x86_64-clang-static


OS: CENTOS77-64
	Kernel Version: 3.10.0-1062.9.1.el7.x86_64
	CPU info: Intel(R) Xeon(R) Platinum 8280M CPU @ 2.70GHz
	GCC Version: gcc (GCC) 4.8.5 20150623 (Red Hat 4.8.5-39)
	Clang Version: 3.4.2 (tags/RELEASE_34/dot2-final)
	x86_64-gcc-static


OS: UB2004-64
	Kernel Version: 5.4.0-26-generic
	CPU info: Intel(R) Xeon(R) Platinum 8180 CPU @ 2.50GHz
	GCC Version: gcc (Ubuntu 10-20200416-0ubuntu1) 10.0.1 20200416 (experimental) [master revision 3c3f12e2a76:dcee354ce56:44b326839d864fc10c459916abcc97f35a9ac3de]
	Clang Version: 10.0.0-4ubuntu1
	x86_64-clang-static
	x86_64-gcc-static
	x86_64-icc-static
	x86_64-gcc-doc


OS: WIN10-64
	Kernel Version: N/A
	CPU info: N/A
	GCC Version: N/A
	Clang Version: Clang 8.0.0
	x86_64-windows-clang


OS: UB2004-32
	Kernel Version: 5.4.0-26-generic
	CPU info: Intel(R) Xeon(R) Platinum 8180 CPU @ 2.50GHz
	GCC Version: gcc (Ubuntu 9.3.0-10ubuntu2) 9.3.0
	Clang Version: 10.0.0-4ubuntu1
	i686-gcc-static


OS: FreeBSD1201-64
	Kernel Version: 12.1-RELEASE
	CPU info: Intel(R) Xeon(R) CPU E5-2699 v3 @ 2.30GHz (2294.74-MHz K8-class CPU)
	GCC Version: gcc (FreeBSD Ports Collection) 9.2.0
	Clang Version: 8.0.1 (tags/RELEASE_801/final 366581) (based on LLVM 8.0.1)
	x86_64-gcc-static
	x86_64-clang-static
	x86_64-gcc-shared
	x86_64-gcc-debug


OS: SUSE15-64
	Kernel Version: 4.12.14-lp150.11-default
	CPU info: Intel(R) Xeon(R) CPU E5-2699 v4 @ 2.20GHz
	GCC Version: gcc (SUSE Linux) 7.3.1 20180323 [gcc-7-branch revision 258812]
	Clang Version: 5.0.1 (tags/RELEASE_501/final 312548)
	x86_64-clang-static
	x86_64-gcc-static



*Build Failed #1:
OS: CENTOS77-64
Target: x86_64-gcc-static
FAILED: drivers/a715181@@tmp_rte_pmd_ice at sta/net_ice_ice_fdir_filter.c.o 
gcc -Idrivers/a715181@@tmp_rte_pmd_ice at sta -Idrivers -I../drivers -Idrivers/net/ice -I../drivers/net/ice -Idrivers/net/ice/base -I../drivers/net/ice/base -Idrivers/net/ice/../../common/iavf -I../drivers/net/ice/../../common/iavf -Ilib/librte_ethdev -I../lib/librte_ethdev -I. -I../ -Iconfig -I../config -Ilib/librte_eal/include -I../lib/librte_eal/include -Ilib/librte_eal/linux/include -I../lib/librte_eal/linux/include -Ilib/librte_eal/x86/include -I../lib/librte_eal/x86/include -Ilib/librte_eal/common -I../lib/librte_eal/common -Ilib/librte_eal -I../lib/librte_eal -Ilib/librte_kvargs -I../lib/librte_kvargs -Ilib/librte_telemetry/../librte_metrics -I../lib/librte_telemetry/../librte_metrics -Ilib/librte_telemetry -I../lib/librte_telemetry -Ilib/librte_net -I../lib/librte_net -Ilib/librte_mbuf -I../lib/librte_mbuf -Ilib/librte_mempool -I../lib/librte_mempool -Ilib/librte_ring -I../lib/librte_ring -Ilib/librte_meter -I../lib/librte_meter -Idrivers/bus/pci -I../drivers/bus/pci -I../drivers/bus/pci/linux -Ilib/librte_pci -I../lib/librte_pci -Idrivers/bus/vdev -I../drivers/bus/vdev -Ilib/librte_hash -I../lib/librte_hash -Idrivers/common/iavf -I../drivers/common/iavf -pipe -D_FILE_OFFSET_BITS=64 -Wall -Winvalid-pch -Werror -O3 -include rte_config.h -Wextra -Wcast-qual -Wdeprecated -Wformat-nonliteral -Wformat-security -Wmissing-declarations -Wmissing-prototypes -Wnested-externs -Wold-style-definition -Wpointer-arith -Wsign-compare -Wstrict-prototypes -Wundef -Wwrite-strings -Wno-missing-field-initializers -D_GNU_SOURCE -fPIC -march=native -DALLOW_EXPERIMENTAL_API -DALLOW_INTERNAL_API -MD -MQ 'drivers/a715181@@tmp_rte_pmd_ice at sta/net_ice_ice_fdir_filter.c.o' -MF 'drivers/a715181@@tmp_rte_pmd_ice at sta/net_ice_ice_fdir_filter.c.o.d' -o 'drivers/a715181@@tmp_rte_pmd_ice at sta/net_ice_ice_fdir_filter.c.o' -c ../drivers/net/ice/ice_fdir_filter.c
../drivers/net/ice/ice_fdir_filter.c: In function ‘ice_fdir_input_set_hdrs’:
../drivers/net/ice/ice_fdir_filter.c:948:30: error: unused parameter ‘ttype’ [-Werror=unused-parameter]
    enum ice_fdir_tunnel_type ttype)
                              ^
cc1: all warnings being treated as errors
[1241/2549] Compiling C object 'drivers/a715181@@tmp_rte_pmd_ice at sta/net_ice_ice_switch_filter.c.o'.
[1242/2549] Generating rte_pmd_iavf.sym_chk with a meson_exe.py custom command.
[1243/2549] Compiling C object 'drivers/a715181@@tmp_rte_pmd_ice at sta/net_ice_ice_generic_flow.c.o'.
[1244/2549] Compiling C object 'drivers/a715181@@tmp_rte_pmd_ice at sta/net_ice_ice_hash.c.o'.
[1245/2549] Compiling C object 'drivers/net/ice/base/39545a2@@ice_base at sta/ice_flex_pipe.c.o'.
[1246/2549] Compiling C object 'drivers/net/ice/base/39545a2@@ice_base at sta/ice_switch.c.o'.
[1247/2549] Compiling C object 'drivers/a715181@@tmp_rte_pmd_ice at sta/net_ice_ice_ethdev.c.o'.
[1248/2549] Compiling C object 'drivers/a715181@@tmp_rte_pmd_ice at sta/net_ice_ice_rxtx_vec_sse.c.o'.
[1249/2549] Compiling C object 'drivers/a715181@@tmp_rte_pmd_ice at sta/net_ice_ice_rxtx.c.o'.
ninja: build stopped: subcommand failed




*Build Failed #2:
OS: CENTOS82-64
Target: x86_64-gcc-static
FAILED: drivers/a715181@@tmp_rte_pmd_ice at sta/net_ice_ice_fdir_filter.c.o 
gcc -Idrivers/a715181@@tmp_rte_pmd_ice at sta -Idrivers -I../drivers -Idrivers/net/ice -I../drivers/net/ice -Idrivers/net/ice/base -I../drivers/net/ice/base -Idrivers/net/ice/../../common/iavf -I../drivers/net/ice/../../common/iavf -Ilib/librte_ethdev -I../lib/librte_ethdev -I. -I../ -Iconfig -I../config -Ilib/librte_eal/include -I../lib/librte_eal/include -Ilib/librte_eal/linux/include -I../lib/librte_eal/linux/include -Ilib/librte_eal/x86/include -I../lib/librte_eal/x86/include -Ilib/librte_eal/common -I../lib/librte_eal/common -Ilib/librte_eal -I../lib/librte_eal -Ilib/librte_kvargs -I../lib/librte_kvargs -Ilib/librte_telemetry/../librte_metrics -I../lib/librte_telemetry/../librte_metrics -Ilib/librte_telemetry -I../lib/librte_telemetry -Ilib/librte_net -I../lib/librte_net -Ilib/librte_mbuf -I../lib/librte_mbuf -Ilib/librte_mempool -I../lib/librte_mempool -Ilib/librte_ring -I../lib/librte_ring -Ilib/librte_meter -I../lib/librte_meter -Idrivers/bus/pci -I../drivers/bus/pci -I../drivers/bus/pci/linux -Ilib/librte_pci -I../lib/librte_pci -Idrivers/bus/vdev -I../drivers/bus/vdev -Ilib/librte_hash -I../lib/librte_hash -Idrivers/common/iavf -I../drivers/common/iavf -fdiagnostics-color=always -pipe -D_FILE_OFFSET_BITS=64 -Wall -Winvalid-pch -Werror -O3 -include rte_config.h -Wextra -Wcast-qual -Wdeprecated -Wformat-nonliteral -Wformat-security -Wmissing-declarations -Wmissing-prototypes -Wnested-externs -Wold-style-definition -Wpointer-arith -Wsign-compare -Wstrict-prototypes -Wundef -Wwrite-strings -Wno-packed-not-aligned -Wno-missing-field-initializers -D_GNU_SOURCE -fPIC -march=native -mno-avx512f -DALLOW_EXPERIMENTAL_API -DALLOW_INTERNAL_API -Wno-format-truncation -MD -MQ 'drivers/a715181@@tmp_rte_pmd_ice at sta/net_ice_ice_fdir_filter.c.o' -MF 'drivers/a715181@@tmp_rte_pmd_ice at sta/net_ice_ice_fdir_filter.c.o.d' -o 'drivers/a715181@@tmp_rte_pmd_ice at sta/net_ice_ice_fdir_filter.c.o' -c ../drivers/net/ice/ice_fdir_filter.c
../drivers/net/ice/ice_fdir_filter.c: In function ‘ice_fdir_input_set_hdrs’:
../drivers/net/ice/ice_fdir_filter.c:948:30: error: unused parameter ‘ttype’ [-Werror=unused-parameter]
    enum ice_fdir_tunnel_type ttype)
    ~~~~~~~~~~~~~~~~~~~~~~~~~~^~~~~
cc1: all warnings being treated as errors
[1239/2582] Linking target drivers/librte_pmd_iavf.so.21.0.
[1240/2582] Compiling C object 'drivers/net/igc/base/94439f5@@igc_base at sta/igc_nvm.c.o'.
[1241/2582] Compiling C object 'drivers/a715181@@tmp_rte_pmd_ice at sta/net_ice_ice_dcf_ethdev.c.o'.
[1242/2582] Compiling C object 'drivers/a715181@@tmp_rte_pmd_ice at sta/net_ice_ice_dcf_parent.c.o'.
[1243/2582] Compiling C object 'drivers/a715181@@tmp_rte_pmd_ice at sta/net_ice_ice_dcf.c.o'.
[1244/2582] Compiling C object 'drivers/a715181@@tmp_rte_pmd_ice at sta/net_ice_ice_ethdev.c.o'.
[1245/2582] Compiling C object 'drivers/a715181@@tmp_rte_pmd_ice at sta/net_ice_ice_rxtx_vec_avx2.c.o'.
[1246/2582] Compiling C object 'drivers/a715181@@tmp_rte_pmd_ice at sta/net_ice_ice_rxtx.c.o'.
[1247/2582] Compiling C object 'drivers/a715181@@tmp_rte_pmd_ice at sta/net_ice_ice_rxtx_vec_sse.c.o'.
ninja: build stopped: subcommand failed




*Build Failed #3:
OS: CENTOS82-64
Target: x86_64-clang-static
FAILED: drivers/a715181@@tmp_rte_pmd_ice at sta/net_ice_ice_fdir_filter.c.o 
clang -Idrivers/a715181@@tmp_rte_pmd_ice at sta -Idrivers -I../drivers -Idrivers/net/ice -I../drivers/net/ice -Idrivers/net/ice/base -I../drivers/net/ice/base -Idrivers/net/ice/../../common/iavf -I../drivers/net/ice/../../common/iavf -Ilib/librte_ethdev -I../lib/librte_ethdev -I. -I../ -Iconfig -I../config -Ilib/librte_eal/include -I../lib/librte_eal/include -Ilib/librte_eal/linux/include -I../lib/librte_eal/linux/include -Ilib/librte_eal/x86/include -I../lib/librte_eal/x86/include -Ilib/librte_eal/common -I../lib/librte_eal/common -Ilib/librte_eal -I../lib/librte_eal -Ilib/librte_kvargs -I../lib/librte_kvargs -Ilib/librte_telemetry/../librte_metrics -I../lib/librte_telemetry/../librte_metrics -Ilib/librte_telemetry -I../lib/librte_telemetry -Ilib/librte_net -I../lib/librte_net -Ilib/librte_mbuf -I../lib/librte_mbuf -Ilib/librte_mempool -I../lib/librte_mempool -Ilib/librte_ring -I../lib/librte_ring -Ilib/librte_meter -I../lib/librte_meter -Idrivers/bus/pci -I../drivers/bus/pci -I../drivers/bus/pci/linux -Ilib/librte_pci -I../lib/librte_pci -Idrivers/bus/vdev -I../drivers/bus/vdev -Ilib/librte_hash -I../lib/librte_hash -Idrivers/common/iavf -I../drivers/common/iavf -Xclang -fcolor-diagnostics -pipe -D_FILE_OFFSET_BITS=64 -Wall -Winvalid-pch -Werror -O3 -include rte_config.h -Wextra -Wcast-qual -Wdeprecated -Wformat-nonliteral -Wformat-security -Wmissing-declarations -Wmissing-prototypes -Wnested-externs -Wold-style-definition -Wpointer-arith -Wsign-compare -Wstrict-prototypes -Wundef -Wwrite-strings -Wno-address-of-packed-member -Wno-missing-field-initializers -D_GNU_SOURCE -fPIC -march=native -mno-avx512f -DALLOW_EXPERIMENTAL_API -DALLOW_INTERNAL_API -MD -MQ 'drivers/a715181@@tmp_rte_pmd_ice at sta/net_ice_ice_fdir_filter.c.o' -MF 'drivers/a715181@@tmp_rte_pmd_ice at sta/net_ice_ice_fdir_filter.c.o.d' -o 'drivers/a715181@@tmp_rte_pmd_ice at sta/net_ice_ice_fdir_filter.c.o' -c ../drivers/net/ice/ice_fdir_filter.c
../drivers/net/ice/ice_fdir_filter.c:948:30: error: unused parameter 'ttype' [-Werror,-Wunused-parameter]
                        enum ice_fdir_tunnel_type ttype)
                                                  ^
1 error generated.
[1243/2582] Compiling C object 'drivers/a715181@@tmp_rte_pmd_ice at sta/net_ice_ice_ethdev.c.o'.
[1244/2582] Compiling C object 'drivers/net/igc/base/94439f5@@igc_base at sta/igc_nvm.c.o'.
[1245/2582] Compiling C object 'drivers/net/igc/base/94439f5@@igc_base at sta/igc_manage.c.o'.
[1246/2582] Compiling C object 'drivers/a715181@@tmp_rte_pmd_ice at sta/net_ice_ice_rxtx.c.o'.
[1247/2582] Compiling C object 'drivers/a715181@@tmp_rte_pmd_ice at sta/net_ice_ice_dcf_parent.c.o'.
[1248/2582] Compiling C object 'drivers/a715181@@tmp_rte_pmd_ice at sta/net_ice_ice_dcf.c.o'.
[1249/2582] Compiling C object 'drivers/a715181@@tmp_rte_pmd_ice at sta/net_ice_ice_dcf_ethdev.c.o'.
[1250/2582] Compiling C object 'drivers/a715181@@tmp_rte_pmd_ice at sta/net_ice_ice_rxtx_vec_sse.c.o'.
[1251/2582] Compiling C object 'drivers/a715181@@tmp_rte_pmd_ice at sta/net_ice_ice_rxtx_vec_avx2.c.o'.
ninja: build stopped: subcommand failed




*Build Failed #4:
OS: CENTOS82-64
Target: x86_64-gcc-shared
FAILED: drivers/a715181@@tmp_rte_pmd_ice at sta/net_ice_ice_fdir_filter.c.o 
gcc -Idrivers/a715181@@tmp_rte_pmd_ice at sta -Idrivers -I../drivers -Idrivers/net/ice -I../drivers/net/ice -Idrivers/net/ice/base -I../drivers/net/ice/base -Idrivers/net/ice/../../common/iavf -I../drivers/net/ice/../../common/iavf -Ilib/librte_ethdev -I../lib/librte_ethdev -I. -I../ -Iconfig -I../config -Ilib/librte_eal/include -I../lib/librte_eal/include -Ilib/librte_eal/linux/include -I../lib/librte_eal/linux/include -Ilib/librte_eal/x86/include -I../lib/librte_eal/x86/include -Ilib/librte_eal/common -I../lib/librte_eal/common -Ilib/librte_eal -I../lib/librte_eal -Ilib/librte_kvargs -I../lib/librte_kvargs -Ilib/librte_telemetry/../librte_metrics -I../lib/librte_telemetry/../librte_metrics -Ilib/librte_telemetry -I../lib/librte_telemetry -Ilib/librte_net -I../lib/librte_net -Ilib/librte_mbuf -I../lib/librte_mbuf -Ilib/librte_mempool -I../lib/librte_mempool -Ilib/librte_ring -I../lib/librte_ring -Ilib/librte_meter -I../lib/librte_meter -Idrivers/bus/pci -I../drivers/bus/pci -I../drivers/bus/pci/linux -Ilib/librte_pci -I../lib/librte_pci -Idrivers/bus/vdev -I../drivers/bus/vdev -Ilib/librte_hash -I../lib/librte_hash -Idrivers/common/iavf -I../drivers/common/iavf -fdiagnostics-color=always -pipe -D_FILE_OFFSET_BITS=64 -Wall -Winvalid-pch -Werror -O3 -include rte_config.h -Wextra -Wcast-qual -Wdeprecated -Wformat-nonliteral -Wformat-security -Wmissing-declarations -Wmissing-prototypes -Wnested-externs -Wold-style-definition -Wpointer-arith -Wsign-compare -Wstrict-prototypes -Wundef -Wwrite-strings -Wno-packed-not-aligned -Wno-missing-field-initializers -D_GNU_SOURCE -fPIC -march=native -mno-avx512f -DALLOW_EXPERIMENTAL_API -DALLOW_INTERNAL_API -Wno-format-truncation -MD -MQ 'drivers/a715181@@tmp_rte_pmd_ice at sta/net_ice_ice_fdir_filter.c.o' -MF 'drivers/a715181@@tmp_rte_pmd_ice at sta/net_ice_ice_fdir_filter.c.o.d' -o 'drivers/a715181@@tmp_rte_pmd_ice at sta/net_ice_ice_fdir_filter.c.o' -c ../drivers/net/ice/ice_fdir_filter.c
../drivers/net/ice/ice_fdir_filter.c: In function ‘ice_fdir_input_set_hdrs’:
../drivers/net/ice/ice_fdir_filter.c:948:30: error: unused parameter ‘ttype’ [-Werror=unused-parameter]
    enum ice_fdir_tunnel_type ttype)
    ~~~~~~~~~~~~~~~~~~~~~~~~~~^~~~~
cc1: all warnings being treated as errors
[1263/2611] Compiling C object 'drivers/a715181@@tmp_rte_pmd_ice at sta/net_ice_ice_ethdev.c.o'.
[1264/2611] Compiling C object 'drivers/a715181@@tmp_rte_pmd_ice at sta/net_ice_ice_dcf.c.o'.
[1265/2611] Compiling C object 'drivers/a715181@@tmp_rte_pmd_ice at sta/net_ice_ice_dcf_ethdev.c.o'.
[1266/2611] Compiling C object 'drivers/a715181@@tmp_rte_pmd_ice at sta/net_ice_ice_rxtx_vec_avx2.c.o'.
[1267/2611] Compiling C object 'drivers/a715181@@tmp_rte_pmd_ice at sta/net_ice_ice_rxtx_vec_sse.c.o'.
ninja: build stopped: subcommand failed




*Build Failed #5:
OS: CENTOS82-64
Target: x86_64-gcc-debug
FAILED: drivers/a715181@@tmp_rte_pmd_ice at sta/net_ice_ice_fdir_filter.c.o 
gcc -Idrivers/a715181@@tmp_rte_pmd_ice at sta -Idrivers -I../drivers -Idrivers/net/ice -I../drivers/net/ice -Idrivers/net/ice/base -I../drivers/net/ice/base -Idrivers/net/ice/../../common/iavf -I../drivers/net/ice/../../common/iavf -Ilib/librte_ethdev -I../lib/librte_ethdev -I. -I../ -Iconfig -I../config -Ilib/librte_eal/include -I../lib/librte_eal/include -Ilib/librte_eal/linux/include -I../lib/librte_eal/linux/include -Ilib/librte_eal/x86/include -I../lib/librte_eal/x86/include -Ilib/librte_eal/common -I../lib/librte_eal/common -Ilib/librte_eal -I../lib/librte_eal -Ilib/librte_kvargs -I../lib/librte_kvargs -Ilib/librte_telemetry/../librte_metrics -I../lib/librte_telemetry/../librte_metrics -Ilib/librte_telemetry -I../lib/librte_telemetry -Ilib/librte_net -I../lib/librte_net -Ilib/librte_mbuf -I../lib/librte_mbuf -Ilib/librte_mempool -I../lib/librte_mempool -Ilib/librte_ring -I../lib/librte_ring -Ilib/librte_meter -I../lib/librte_meter -Idrivers/bus/pci -I../drivers/bus/pci -I../drivers/bus/pci/linux -Ilib/librte_pci -I../lib/librte_pci -Idrivers/bus/vdev -I../drivers/bus/vdev -Ilib/librte_hash -I../lib/librte_hash -Idrivers/common/iavf -I../drivers/common/iavf -fdiagnostics-color=always -pipe -D_FILE_OFFSET_BITS=64 -Wall -Winvalid-pch -Werror -O2 -g -include rte_config.h -Wextra -Wcast-qual -Wdeprecated -Wformat-nonliteral -Wformat-security -Wmissing-declarations -Wmissing-prototypes -Wnested-externs -Wold-style-definition -Wpointer-arith -Wsign-compare -Wstrict-prototypes -Wundef -Wwrite-strings -Wno-packed-not-aligned -Wno-missing-field-initializers -D_GNU_SOURCE -fPIC -march=native -mno-avx512f -DALLOW_EXPERIMENTAL_API -DALLOW_INTERNAL_API -Wno-format-truncation -MD -MQ 'drivers/a715181@@tmp_rte_pmd_ice at sta/net_ice_ice_fdir_filter.c.o' -MF 'drivers/a715181@@tmp_rte_pmd_ice at sta/net_ice_ice_fdir_filter.c.o.d' -o 'drivers/a715181@@tmp_rte_pmd_ice at sta/net_ice_ice_fdir_filter.c.o' -c ../drivers/net/ice/ice_fdir_filter.c
../drivers/net/ice/ice_fdir_filter.c: In function ‘ice_fdir_input_set_hdrs’:
../drivers/net/ice/ice_fdir_filter.c:948:30: error: unused parameter ‘ttype’ [-Werror=unused-parameter]
    enum ice_fdir_tunnel_type ttype)
    ~~~~~~~~~~~~~~~~~~~~~~~~~~^~~~~
cc1: all warnings being treated as errors
[1243/2582] Compiling C object 'drivers/a715181@@tmp_rte_pmd_ice at sta/net_ice_ice_dcf.c.o'.
[1244/2582] Compiling C object 'drivers/a715181@@tmp_rte_pmd_ice at sta/net_ice_ice_dcf_parent.c.o'.
[1245/2582] Compiling C object 'drivers/a715181@@tmp_rte_pmd_ice at sta/net_ice_ice_dcf_ethdev.c.o'.
[1246/2582] Compiling C object 'drivers/a715181@@tmp_rte_pmd_ice at sta/net_ice_ice_rxtx_vec_sse.c.o'.
[1247/2582] Compiling C object 'drivers/a715181@@tmp_rte_pmd_ice at sta/net_ice_ice_rxtx_vec_avx2.c.o'.
ninja: build stopped: subcommand failed




*Build Failed #6:
OS: FC32-64
Target: x86_64-gcc-static
FAILED: drivers/a715181@@tmp_rte_pmd_ice at sta/net_ice_ice_fdir_filter.c.o 
gcc -Idrivers/a715181@@tmp_rte_pmd_ice at sta -Idrivers -I../drivers -Idrivers/net/ice -I../drivers/net/ice -Idrivers/net/ice/base -I../drivers/net/ice/base -Idrivers/net/ice/../../common/iavf -I../drivers/net/ice/../../common/iavf -Ilib/librte_ethdev -I../lib/librte_ethdev -I. -I../ -Iconfig -I../config -Ilib/librte_eal/include -I../lib/librte_eal/include -Ilib/librte_eal/linux/include -I../lib/librte_eal/linux/include -Ilib/librte_eal/x86/include -I../lib/librte_eal/x86/include -Ilib/librte_eal/common -I../lib/librte_eal/common -Ilib/librte_eal -I../lib/librte_eal -Ilib/librte_kvargs -I../lib/librte_kvargs -Ilib/librte_telemetry/../librte_metrics -I../lib/librte_telemetry/../librte_metrics -Ilib/librte_telemetry -I../lib/librte_telemetry -Ilib/librte_net -I../lib/librte_net -Ilib/librte_mbuf -I../lib/librte_mbuf -Ilib/librte_mempool -I../lib/librte_mempool -Ilib/librte_ring -I../lib/librte_ring -Ilib/librte_meter -I../lib/librte_meter -Idrivers/bus/pci -I../drivers/bus/pci -I../drivers/bus/pci/linux -Ilib/librte_pci -I../lib/librte_pci -Idrivers/bus/vdev -I../drivers/bus/vdev -Ilib/librte_hash -I../lib/librte_hash -Idrivers/common/iavf -I../drivers/common/iavf -fdiagnostics-color=always -pipe -D_FILE_OFFSET_BITS=64 -Wall -Winvalid-pch -Werror -O3 -include rte_config.h -Wextra -Wcast-qual -Wdeprecated -Wformat-nonliteral -Wformat-security -Wmissing-declarations -Wmissing-prototypes -Wnested-externs -Wold-style-definition -Wpointer-arith -Wsign-compare -Wstrict-prototypes -Wundef -Wwrite-strings -Wno-address-of-packed-member -Wno-packed-not-aligned -Wno-missing-field-initializers -Wno-zero-length-bounds -D_GNU_SOURCE -fPIC -march=native -DALLOW_EXPERIMENTAL_API -DALLOW_INTERNAL_API -Wno-format-truncation -MD -MQ 'drivers/a715181@@tmp_rte_pmd_ice at sta/net_ice_ice_fdir_filter.c.o' -MF 'drivers/a715181@@tmp_rte_pmd_ice at sta/net_ice_ice_fdir_filter.c.o.d' -o 'drivers/a715181@@tmp_rte_pmd_ice at sta/net_ice_ice_fdir_filter.c.o' -c ../drivers/net/ice/ice_fdir_filter.c
../drivers/net/ice/ice_fdir_filter.c: In function ‘ice_fdir_input_set_hdrs’:
../drivers/net/ice/ice_fdir_filter.c:948:30: error: unused parameter ‘ttype’ [-Werror=unused-parameter]
  948 |    enum ice_fdir_tunnel_type ttype)
      |    ~~~~~~~~~~~~~~~~~~~~~~~~~~^~~~~
cc1: all warnings being treated as errors
[1254/2583] Generating rte_pmd_igc_def with a custom command.
[1255/2583] Compiling C object 'drivers/net/igc/base/94439f5@@igc_base at sta/igc_mac.c.o'.
[1256/2583] Compiling C object 'drivers/a715181@@tmp_rte_pmd_ice at sta/net_ice_ice_rxtx_vec_avx2.c.o'.
[1257/2583] Compiling C object 'drivers/net/igc/base/94439f5@@igc_base at sta/igc_api.c.o'.
[1258/2583] Compiling C object 'drivers/net/ixgbe/base/a7935d9@@ixgbe_base at sta/ixgbe_82598.c.o'.
[1259/2583] Compiling C object 'drivers/a715181@@tmp_rte_pmd_ice at sta/net_ice_ice_rxtx_vec_sse.c.o'.
[1260/2583] Compiling C object 'drivers/a715181@@tmp_rte_pmd_igc at sta/net_igc_igc_flow.c.o'.
[1261/2583] Compiling C object 'drivers/a715181@@tmp_rte_pmd_igc at sta/net_igc_igc_filter.c.o'.
[1262/2583] Compiling C object 'drivers/net/igc/base/94439f5@@igc_base at sta/igc_phy.c.o'.
[1263/2583] Compiling C object 'drivers/a715181@@tmp_rte_pmd_igc at sta/net_igc_igc_ethdev.c.o'.
[1264/2583] Compiling C object 'drivers/a715181@@tmp_rte_pmd_igc at sta/net_igc_igc_txrx.c.o'.
ninja: build stopped: subcommand failed




*Build Failed #7:
OS: FC32-64
Target: x86_64-clang-static
FAILED: drivers/a715181@@tmp_rte_pmd_ice at sta/net_ice_ice_fdir_filter.c.o 
clang -Idrivers/a715181@@tmp_rte_pmd_ice at sta -Idrivers -I../drivers -Idrivers/net/ice -I../drivers/net/ice -Idrivers/net/ice/base -I../drivers/net/ice/base -Idrivers/net/ice/../../common/iavf -I../drivers/net/ice/../../common/iavf -Ilib/librte_ethdev -I../lib/librte_ethdev -I. -I../ -Iconfig -I../config -Ilib/librte_eal/include -I../lib/librte_eal/include -Ilib/librte_eal/linux/include -I../lib/librte_eal/linux/include -Ilib/librte_eal/x86/include -I../lib/librte_eal/x86/include -Ilib/librte_eal/common -I../lib/librte_eal/common -Ilib/librte_eal -I../lib/librte_eal -Ilib/librte_kvargs -I../lib/librte_kvargs -Ilib/librte_telemetry/../librte_metrics -I../lib/librte_telemetry/../librte_metrics -Ilib/librte_telemetry -I../lib/librte_telemetry -Ilib/librte_net -I../lib/librte_net -Ilib/librte_mbuf -I../lib/librte_mbuf -Ilib/librte_mempool -I../lib/librte_mempool -Ilib/librte_ring -I../lib/librte_ring -Ilib/librte_meter -I../lib/librte_meter -Idrivers/bus/pci -I../drivers/bus/pci -I../drivers/bus/pci/linux -Ilib/librte_pci -I../lib/librte_pci -Idrivers/bus/vdev -I../drivers/bus/vdev -Ilib/librte_hash -I../lib/librte_hash -Idrivers/common/iavf -I../drivers/common/iavf -Xclang -fcolor-diagnostics -pipe -D_FILE_OFFSET_BITS=64 -Wall -Winvalid-pch -Werror -O3 -include rte_config.h -Wextra -Wcast-qual -Wdeprecated -Wformat-nonliteral -Wformat-security -Wmissing-declarations -Wmissing-prototypes -Wnested-externs -Wold-style-definition -Wpointer-arith -Wsign-compare -Wstrict-prototypes -Wundef -Wwrite-strings -Wno-address-of-packed-member -Wno-missing-field-initializers -D_GNU_SOURCE -fPIC -march=native -DALLOW_EXPERIMENTAL_API -DALLOW_INTERNAL_API -MD -MQ 'drivers/a715181@@tmp_rte_pmd_ice at sta/net_ice_ice_fdir_filter.c.o' -MF 'drivers/a715181@@tmp_rte_pmd_ice at sta/net_ice_ice_fdir_filter.c.o.d' -o 'drivers/a715181@@tmp_rte_pmd_ice at sta/net_ice_ice_fdir_filter.c.o' -c ../drivers/net/ice/ice_fdir_filter.c
../drivers/net/ice/ice_fdir_filter.c:948:30: error: unused parameter 'ttype' [-Werror,-Wunused-parameter]
                        enum ice_fdir_tunnel_type ttype)
                                                  ^
1 error generated.
[1244/2583] Compiling C object 'drivers/a715181@@tmp_rte_pmd_ice at sta/net_ice_ice_dcf_parent.c.o'.
[1245/2583] Compiling C object 'drivers/a715181@@tmp_rte_pmd_ice at sta/net_ice_ice_ethdev.c.o'.
[1246/2583] Compiling C object 'drivers/net/igc/base/94439f5@@igc_base at sta/igc_manage.c.o'.
[1247/2583] Compiling C object 'drivers/a715181@@tmp_rte_pmd_ice at sta/net_ice_ice_switch_filter.c.o'.
[1248/2583] Compiling C object 'drivers/a715181@@tmp_rte_pmd_ice at sta/net_ice_ice_dcf_ethdev.c.o'.
[1249/2583] Compiling C object 'drivers/net/igc/base/94439f5@@igc_base at sta/igc_i225.c.o'.
[1250/2583] Compiling C object 'drivers/net/igc/base/94439f5@@igc_base at sta/igc_mac.c.o'.
[1251/2583] Compiling C object 'drivers/a715181@@tmp_rte_pmd_ice at sta/net_ice_ice_rxtx_vec_avx2.c.o'.
[1252/2583] Compiling C object 'drivers/a715181@@tmp_rte_pmd_ice at sta/net_ice_ice_rxtx_vec_sse.c.o'.
ninja: build stopped: subcommand failed




*Build Failed #8:
OS: FreeBSD1201-64
Target: x86_64-gcc-static
FAILED: drivers/libtmp_rte_pmd_ice.a.p/net_ice_ice_fdir_filter.c.o 
gcc -Idrivers/libtmp_rte_pmd_ice.a.p -Idrivers -I../drivers -Idrivers/net/ice -I../drivers/net/ice -Idrivers/net/ice/base -I../drivers/net/ice/base -Idrivers/common/iavf -I../drivers/common/iavf -Ilib/librte_ethdev -I../lib/librte_ethdev -I. -I.. -Iconfig -I../config -Ilib/librte_eal/include -I../lib/librte_eal/include -Ilib/librte_eal/freebsd/include -I../lib/librte_eal/freebsd/include -Ilib/librte_eal/x86/include -I../lib/librte_eal/x86/include -Ilib/librte_eal/common -I../lib/librte_eal/common -Ilib/librte_eal -I../lib/librte_eal -Ilib/librte_kvargs -I../lib/librte_kvargs -Ilib/librte_metrics -I../lib/librte_metrics -Ilib/librte_telemetry -I../lib/librte_telemetry -Ilib/librte_net -I../lib/librte_net -Ilib/librte_mbuf -I../lib/librte_mbuf -Ilib/librte_mempool -I../lib/librte_mempool -Ilib/librte_ring -I../lib/librte_ring -Ilib/librte_meter -I../lib/librte_meter -Idrivers/bus/pci -I../drivers/bus/pci -I../drivers/bus/pci/bsd -Ilib/librte_pci -I../lib/librte_pci -Idrivers/bus/vdev -I../drivers/bus/vdev -Ilib/librte_hash -I../lib/librte_hash -fdiagnostics-color=always -pipe -D_FILE_OFFSET_BITS=64 -Wall -Winvalid-pch -Werror -O3 -include rte_config.h -Wextra -Wcast-qual -Wdeprecated -Wformat-nonliteral -Wformat-security -Wmissing-declarations -Wmissing-prototypes -Wnested-externs -Wold-style-definition -Wpointer-arith -Wsign-compare -Wstrict-prototypes -Wundef -Wwrite-strings -Wno-address-of-packed-member -Wno-packed-not-aligned -Wno-missing-field-initializers -D_GNU_SOURCE -D__BSD_VISIBLE -fPIC -march=native -mno-avx512f -DALLOW_EXPERIMENTAL_API -DALLOW_INTERNAL_API -Wno-format-truncation -MD -MQ drivers/libtmp_rte_pmd_ice.a.p/net_ice_ice_fdir_filter.c.o -MF drivers/libtmp_rte_pmd_ice.a.p/net_ice_ice_fdir_filter.c.o.d -o drivers/libtmp_rte_pmd_ice.a.p/net_ice_ice_fdir_filter.c.o -c ../drivers/net/ice/ice_fdir_filter.c
../drivers/net/ice/ice_fdir_filter.c: In function 'ice_fdir_input_set_hdrs':
../drivers/net/ice/ice_fdir_filter.c:948:30: error: unused parameter 'ttype' [-Werror=unused-parameter]
  948 |    enum ice_fdir_tunnel_type ttype)
      |    ~~~~~~~~~~~~~~~~~~~~~~~~~~^~~~~
cc1: all warnings being treated as errors
[986/1921] Compiling C object drivers/libtmp_rte_pmd_ice.a.p/net_ice_ice_rxtx.c.o
[987/1921] Compiling C object drivers/libtmp_rte_pmd_ice.a.p/net_ice_ice_rxtx_vec_sse.c.o
[988/1921] Compiling C object drivers/libtmp_rte_pmd_ice.a.p/net_ice_ice_rxtx_vec_avx2.c.o
[989/1921] Compiling C object drivers/libtmp_rte_pmd_ice.a.p/net_ice_ice_dcf.c.o
[990/1921] Compiling C object drivers/libtmp_rte_pmd_ice.a.p/net_ice_ice_dcf_ethdev.c.o
ninja: build stopped: subcommand failed




*Build Failed #9:
OS: FreeBSD1201-64
Target: x86_64-clang-static
FAILED: drivers/libtmp_rte_pmd_ice.a.p/net_ice_ice_fdir_filter.c.o 
clang -Idrivers/libtmp_rte_pmd_ice.a.p -Idrivers -I../drivers -Idrivers/net/ice -I../drivers/net/ice -Idrivers/net/ice/base -I../drivers/net/ice/base -Idrivers/common/iavf -I../drivers/common/iavf -Ilib/librte_ethdev -I../lib/librte_ethdev -I. -I.. -Iconfig -I../config -Ilib/librte_eal/include -I../lib/librte_eal/include -Ilib/librte_eal/freebsd/include -I../lib/librte_eal/freebsd/include -Ilib/librte_eal/x86/include -I../lib/librte_eal/x86/include -Ilib/librte_eal/common -I../lib/librte_eal/common -Ilib/librte_eal -I../lib/librte_eal -Ilib/librte_kvargs -I../lib/librte_kvargs -Ilib/librte_metrics -I../lib/librte_metrics -Ilib/librte_telemetry -I../lib/librte_telemetry -Ilib/librte_net -I../lib/librte_net -Ilib/librte_mbuf -I../lib/librte_mbuf -Ilib/librte_mempool -I../lib/librte_mempool -Ilib/librte_ring -I../lib/librte_ring -Ilib/librte_meter -I../lib/librte_meter -Idrivers/bus/pci -I../drivers/bus/pci -I../drivers/bus/pci/bsd -Ilib/librte_pci -I../lib/librte_pci -Idrivers/bus/vdev -I../drivers/bus/vdev -Ilib/librte_hash -I../lib/librte_hash -Xclang -fcolor-diagnostics -pipe -D_FILE_OFFSET_BITS=64 -Wall -Winvalid-pch -Werror -O3 -include rte_config.h -Wextra -Wcast-qual -Wdeprecated -Wformat-nonliteral -Wformat-security -Wmissing-declarations -Wmissing-prototypes -Wnested-externs -Wold-style-definition -Wpointer-arith -Wsign-compare -Wstrict-prototypes -Wundef -Wwrite-strings -Wno-address-of-packed-member -Wno-missing-field-initializers -D_GNU_SOURCE -D__BSD_VISIBLE -fPIC -march=native -mno-avx512f -DALLOW_EXPERIMENTAL_API -DALLOW_INTERNAL_API -MD -MQ drivers/libtmp_rte_pmd_ice.a.p/net_ice_ice_fdir_filter.c.o -MF drivers/libtmp_rte_pmd_ice.a.p/net_ice_ice_fdir_filter.c.o.d -o drivers/libtmp_rte_pmd_ice.a.p/net_ice_ice_fdir_filter.c.o -c ../drivers/net/ice/ice_fdir_filter.c
../drivers/net/ice/ice_fdir_filter.c:948:30: error: unused parameter 'ttype' [-Werror,-Wunused-parameter]
                        enum ice_fdir_tunnel_type ttype)
                                                  ^
1 error generated.
[987/1921] Compiling C object drivers/libtmp_rte_pmd_ice.a.p/net_ice_ice_dcf_parent.c.o
[988/1921] Compiling C object drivers/libtmp_rte_pmd_ice.a.p/net_ice_ice_dcf.c.o
[989/1921] Compiling C object drivers/libtmp_rte_pmd_ice.a.p/net_ice_ice_rxtx_vec_sse.c.o
[990/1921] Compiling C object drivers/libtmp_rte_pmd_ice.a.p/net_ice_ice_dcf_ethdev.c.o
[991/1921] Compiling C object drivers/libtmp_rte_pmd_ice.a.p/net_ice_ice_rxtx_vec_avx2.c.o
ninja: build stopped: subcommand failed




*Build Failed #10:
OS: FreeBSD1201-64
Target: x86_64-gcc-shared
FAILED: drivers/libtmp_rte_pmd_ice.a.p/net_ice_ice_fdir_filter.c.o 
gcc -Idrivers/libtmp_rte_pmd_ice.a.p -Idrivers -I../drivers -Idrivers/net/ice -I../drivers/net/ice -Idrivers/net/ice/base -I../drivers/net/ice/base -Idrivers/common/iavf -I../drivers/common/iavf -Ilib/librte_ethdev -I../lib/librte_ethdev -I. -I.. -Iconfig -I../config -Ilib/librte_eal/include -I../lib/librte_eal/include -Ilib/librte_eal/freebsd/include -I../lib/librte_eal/freebsd/include -Ilib/librte_eal/x86/include -I../lib/librte_eal/x86/include -Ilib/librte_eal/common -I../lib/librte_eal/common -Ilib/librte_eal -I../lib/librte_eal -Ilib/librte_kvargs -I../lib/librte_kvargs -Ilib/librte_metrics -I../lib/librte_metrics -Ilib/librte_telemetry -I../lib/librte_telemetry -Ilib/librte_net -I../lib/librte_net -Ilib/librte_mbuf -I../lib/librte_mbuf -Ilib/librte_mempool -I../lib/librte_mempool -Ilib/librte_ring -I../lib/librte_ring -Ilib/librte_meter -I../lib/librte_meter -Idrivers/bus/pci -I../drivers/bus/pci -I../drivers/bus/pci/bsd -Ilib/librte_pci -I../lib/librte_pci -Idrivers/bus/vdev -I../drivers/bus/vdev -Ilib/librte_hash -I../lib/librte_hash -fdiagnostics-color=always -pipe -D_FILE_OFFSET_BITS=64 -Wall -Winvalid-pch -Werror -O3 -include rte_config.h -Wextra -Wcast-qual -Wdeprecated -Wformat-nonliteral -Wformat-security -Wmissing-declarations -Wmissing-prototypes -Wnested-externs -Wold-style-definition -Wpointer-arith -Wsign-compare -Wstrict-prototypes -Wundef -Wwrite-strings -Wno-address-of-packed-member -Wno-packed-not-aligned -Wno-missing-field-initializers -D_GNU_SOURCE -D__BSD_VISIBLE -fPIC -march=native -mno-avx512f -DALLOW_EXPERIMENTAL_API -DALLOW_INTERNAL_API -Wno-format-truncation -MD -MQ drivers/libtmp_rte_pmd_ice.a.p/net_ice_ice_fdir_filter.c.o -MF drivers/libtmp_rte_pmd_ice.a.p/net_ice_ice_fdir_filter.c.o.d -o drivers/libtmp_rte_pmd_ice.a.p/net_ice_ice_fdir_filter.c.o -c ../drivers/net/ice/ice_fdir_filter.c
../drivers/net/ice/ice_fdir_filter.c: In function 'ice_fdir_input_set_hdrs':
../drivers/net/ice/ice_fdir_filter.c:948:30: error: unused parameter 'ttype' [-Werror=unused-parameter]
  948 |    enum ice_fdir_tunnel_type ttype)
      |    ~~~~~~~~~~~~~~~~~~~~~~~~~~^~~~~
cc1: all warnings being treated as errors
[1009/1950] Compiling C object drivers/libtmp_rte_pmd_ice.a.p/net_ice_ice_rxtx.c.o
[1010/1950] Compiling C object drivers/libtmp_rte_pmd_ice.a.p/net_ice_ice_dcf.c.o
[1011/1950] Compiling C object drivers/libtmp_rte_pmd_ice.a.p/net_ice_ice_dcf_ethdev.c.o
[1012/1950] Compiling C object drivers/libtmp_rte_pmd_ice.a.p/net_ice_ice_rxtx_vec_sse.c.o
[1013/1950] Compiling C object drivers/libtmp_rte_pmd_ice.a.p/net_ice_ice_rxtx_vec_avx2.c.o
ninja: build stopped: subcommand failed




*Build Failed #11:
OS: FreeBSD1201-64
Target: x86_64-gcc-debug
FAILED: drivers/libtmp_rte_pmd_ice.a.p/net_ice_ice_fdir_filter.c.o 
gcc -Idrivers/libtmp_rte_pmd_ice.a.p -Idrivers -I../drivers -Idrivers/net/ice -I../drivers/net/ice -Idrivers/net/ice/base -I../drivers/net/ice/base -Idrivers/common/iavf -I../drivers/common/iavf -Ilib/librte_ethdev -I../lib/librte_ethdev -I. -I.. -Iconfig -I../config -Ilib/librte_eal/include -I../lib/librte_eal/include -Ilib/librte_eal/freebsd/include -I../lib/librte_eal/freebsd/include -Ilib/librte_eal/x86/include -I../lib/librte_eal/x86/include -Ilib/librte_eal/common -I../lib/librte_eal/common -Ilib/librte_eal -I../lib/librte_eal -Ilib/librte_kvargs -I../lib/librte_kvargs -Ilib/librte_metrics -I../lib/librte_metrics -Ilib/librte_telemetry -I../lib/librte_telemetry -Ilib/librte_net -I../lib/librte_net -Ilib/librte_mbuf -I../lib/librte_mbuf -Ilib/librte_mempool -I../lib/librte_mempool -Ilib/librte_ring -I../lib/librte_ring -Ilib/librte_meter -I../lib/librte_meter -Idrivers/bus/pci -I../drivers/bus/pci -I../drivers/bus/pci/bsd -Ilib/librte_pci -I../lib/librte_pci -Idrivers/bus/vdev -I../drivers/bus/vdev -Ilib/librte_hash -I../lib/librte_hash -fdiagnostics-color=always -pipe -D_FILE_OFFSET_BITS=64 -Wall -Winvalid-pch -Werror -O2 -g -include rte_config.h -Wextra -Wcast-qual -Wdeprecated -Wformat-nonliteral -Wformat-security -Wmissing-declarations -Wmissing-prototypes -Wnested-externs -Wold-style-definition -Wpointer-arith -Wsign-compare -Wstrict-prototypes -Wundef -Wwrite-strings -Wno-address-of-packed-member -Wno-packed-not-aligned -Wno-missing-field-initializers -D_GNU_SOURCE -D__BSD_VISIBLE -fPIC -march=native -mno-avx512f -DALLOW_EXPERIMENTAL_API -DALLOW_INTERNAL_API -Wno-format-truncation -MD -MQ drivers/libtmp_rte_pmd_ice.a.p/net_ice_ice_fdir_filter.c.o -MF drivers/libtmp_rte_pmd_ice.a.p/net_ice_ice_fdir_filter.c.o.d -o drivers/libtmp_rte_pmd_ice.a.p/net_ice_ice_fdir_filter.c.o -c ../drivers/net/ice/ice_fdir_filter.c
../drivers/net/ice/ice_fdir_filter.c: In function 'ice_fdir_input_set_hdrs':
../drivers/net/ice/ice_fdir_filter.c:948:30: error: unused parameter 'ttype' [-Werror=unused-parameter]
  948 |    enum ice_fdir_tunnel_type ttype)
      |    ~~~~~~~~~~~~~~~~~~~~~~~~~~^~~~~
cc1: all warnings being treated as errors
[983/1921] Compiling C object drivers/libtmp_rte_pmd_ice.a.p/net_ice_ice_switch_filter.c.o
[984/1921] Compiling C object drivers/libtmp_rte_pmd_ice.a.p/net_ice_ice_hash.c.o
[985/1921] Compiling C object drivers/libtmp_rte_pmd_ice.a.p/net_ice_ice_ethdev.c.o
[986/1921] Compiling C object drivers/libtmp_rte_pmd_ice.a.p/net_ice_ice_rxtx.c.o
[987/1921] Compiling C object drivers/libtmp_rte_pmd_ice.a.p/net_ice_ice_rxtx_vec_sse.c.o
ninja: build stopped: subcommand failed




*Build Failed #12:
OS: RHEL82-64
Target: x86_64-gcc-static
FAILED: drivers/a715181@@tmp_rte_pmd_ice at sta/net_ice_ice_fdir_filter.c.o 
gcc -Idrivers/a715181@@tmp_rte_pmd_ice at sta -Idrivers -I../drivers -Idrivers/net/ice -I../drivers/net/ice -Idrivers/net/ice/base -I../drivers/net/ice/base -Idrivers/net/ice/../../common/iavf -I../drivers/net/ice/../../common/iavf -Ilib/librte_ethdev -I../lib/librte_ethdev -I. -I../ -Iconfig -I../config -Ilib/librte_eal/include -I../lib/librte_eal/include -Ilib/librte_eal/linux/include -I../lib/librte_eal/linux/include -Ilib/librte_eal/x86/include -I../lib/librte_eal/x86/include -Ilib/librte_eal/common -I../lib/librte_eal/common -Ilib/librte_eal -I../lib/librte_eal -Ilib/librte_kvargs -I../lib/librte_kvargs -Ilib/librte_telemetry/../librte_metrics -I../lib/librte_telemetry/../librte_metrics -Ilib/librte_telemetry -I../lib/librte_telemetry -Ilib/librte_net -I../lib/librte_net -Ilib/librte_mbuf -I../lib/librte_mbuf -Ilib/librte_mempool -I../lib/librte_mempool -Ilib/librte_ring -I../lib/librte_ring -Ilib/librte_meter -I../lib/librte_meter -Idrivers/bus/pci -I../drivers/bus/pci -I../drivers/bus/pci/linux -Ilib/librte_pci -I../lib/librte_pci -Idrivers/bus/vdev -I../drivers/bus/vdev -Ilib/librte_hash -I../lib/librte_hash -Idrivers/common/iavf -I../drivers/common/iavf -fdiagnostics-color=always -pipe -D_FILE_OFFSET_BITS=64 -Wall -Winvalid-pch -Werror -O3 -include rte_config.h -Wextra -Wcast-qual -Wdeprecated -Wformat-nonliteral -Wformat-security -Wmissing-declarations -Wmissing-prototypes -Wnested-externs -Wold-style-definition -Wpointer-arith -Wsign-compare -Wstrict-prototypes -Wundef -Wwrite-strings -Wno-packed-not-aligned -Wno-missing-field-initializers -D_GNU_SOURCE -fPIC -march=native -mno-avx512f -DALLOW_EXPERIMENTAL_API -DALLOW_INTERNAL_API -Wno-format-truncation -MD -MQ 'drivers/a715181@@tmp_rte_pmd_ice at sta/net_ice_ice_fdir_filter.c.o' -MF 'drivers/a715181@@tmp_rte_pmd_ice at sta/net_ice_ice_fdir_filter.c.o.d' -o 'drivers/a715181@@tmp_rte_pmd_ice at sta/net_ice_ice_fdir_filter.c.o' -c ../drivers/net/ice/ice_fdir_filter.c
../drivers/net/ice/ice_fdir_filter.c: In function ‘ice_fdir_input_set_hdrs’:
../drivers/net/ice/ice_fdir_filter.c:948:30: error: unused parameter ‘ttype’ [-Werror=unused-parameter]
    enum ice_fdir_tunnel_type ttype)
    ~~~~~~~~~~~~~~~~~~~~~~~~~~^~~~~
cc1: all warnings being treated as errors
[1246/2582] Compiling C object 'drivers/net/igc/base/94439f5@@igc_base at sta/igc_nvm.c.o'.
[1247/2582] Compiling C object 'drivers/a715181@@tmp_rte_pmd_ice at sta/net_ice_ice_dcf_ethdev.c.o'.
[1248/2582] Compiling C object 'drivers/a715181@@tmp_rte_pmd_ice at sta/net_ice_ice_ethdev.c.o'.
[1249/2582] Compiling C object 'drivers/a715181@@tmp_rte_pmd_ice at sta/net_ice_ice_dcf_parent.c.o'.
[1250/2582] Compiling C object 'drivers/net/igc/base/94439f5@@igc_base at sta/igc_i225.c.o'.
[1251/2582] Compiling C object 'drivers/net/igc/base/94439f5@@igc_base at sta/igc_mac.c.o'.
[1252/2582] Compiling C object 'drivers/a715181@@tmp_rte_pmd_ice at sta/net_ice_ice_rxtx_vec_avx2.c.o'.
[1253/2582] Compiling C object 'drivers/a715181@@tmp_rte_pmd_ice at sta/net_ice_ice_rxtx.c.o'.
[1254/2582] Compiling C object 'drivers/a715181@@tmp_rte_pmd_ice at sta/net_ice_ice_rxtx_vec_sse.c.o'.
ninja: build stopped: subcommand failed




*Build Failed #13:
OS: SUSE15-64
Target: x86_64-clang-static
FAILED: drivers/libtmp_rte_pmd_ice.a.p/net_ice_ice_fdir_filter.c.o 
clang -Idrivers/libtmp_rte_pmd_ice.a.p -Idrivers -I../drivers -Idrivers/net/ice -I../drivers/net/ice -Idrivers/net/ice/base -I../drivers/net/ice/base -Idrivers/common/iavf -I../drivers/common/iavf -Ilib/librte_ethdev -I../lib/librte_ethdev -I. -I.. -Iconfig -I../config -Ilib/librte_eal/include -I../lib/librte_eal/include -Ilib/librte_eal/linux/include -I../lib/librte_eal/linux/include -Ilib/librte_eal/x86/include -I../lib/librte_eal/x86/include -Ilib/librte_eal/common -I../lib/librte_eal/common -Ilib/librte_eal -I../lib/librte_eal -Ilib/librte_kvargs -I../lib/librte_kvargs -Ilib/librte_metrics -I../lib/librte_metrics -Ilib/librte_telemetry -I../lib/librte_telemetry -Ilib/librte_net -I../lib/librte_net -Ilib/librte_mbuf -I../lib/librte_mbuf -Ilib/librte_mempool -I../lib/librte_mempool -Ilib/librte_ring -I../lib/librte_ring -Ilib/librte_meter -I../lib/librte_meter -Idrivers/bus/pci -I../drivers/bus/pci -I../drivers/bus/pci/linux -Ilib/librte_pci -I../lib/librte_pci -Idrivers/bus/vdev -I../drivers/bus/vdev -Ilib/librte_hash -I../lib/librte_hash -Xclang -fcolor-diagnostics -pipe -D_FILE_OFFSET_BITS=64 -Wall -Winvalid-pch -Werror -O3 -include rte_config.h -Wextra -Wcast-qual -Wdeprecated -Wformat-nonliteral -Wformat-security -Wmissing-declarations -Wmissing-prototypes -Wnested-externs -Wold-style-definition -Wpointer-arith -Wsign-compare -Wstrict-prototypes -Wundef -Wwrite-strings -Wno-address-of-packed-member -Wno-missing-field-initializers -D_GNU_SOURCE -fPIC -march=native -DALLOW_EXPERIMENTAL_API -DALLOW_INTERNAL_API -MD -MQ drivers/libtmp_rte_pmd_ice.a.p/net_ice_ice_fdir_filter.c.o -MF drivers/libtmp_rte_pmd_ice.a.p/net_ice_ice_fdir_filter.c.o.d -o drivers/libtmp_rte_pmd_ice.a.p/net_ice_ice_fdir_filter.c.o -c ../drivers/net/ice/ice_fdir_filter.c
../drivers/net/ice/ice_fdir_filter.c:948:30: error: unused parameter 'ttype' [-Werror,-Wunused-parameter]
                        enum ice_fdir_tunnel_type ttype)
                                                  ^
1 error generated.
[1254/2551] Compiling C object drivers/libtmp_rte_pmd_ice.a.p/net_ice_ice_generic_flow.c.o
[1255/2551] Compiling C object drivers/libtmp_rte_pmd_ice.a.p/net_ice_ice_switch_filter.c.o
[1256/2551] Compiling C object drivers/libtmp_rte_pmd_ice.a.p/net_ice_ice_rxtx_vec_sse.c.o
[1257/2551] Compiling C object drivers/net/igc/base/libigc_base.a.p/igc_manage.c.o
[1258/2551] Compiling C object drivers/net/igc/base/libigc_base.a.p/igc_i225.c.o
[1259/2551] Compiling C object drivers/libtmp_rte_pmd_ice.a.p/net_ice_ice_dcf_ethdev.c.o
[1260/2551] Compiling C object drivers/libtmp_rte_pmd_ice.a.p/net_ice_ice_dcf_parent.c.o
[1261/2551] Compiling C object drivers/libtmp_rte_pmd_ice.a.p/net_ice_ice_dcf.c.o
[1262/2551] Compiling C object drivers/libtmp_rte_pmd_ice.a.p/net_ice_ice_rxtx_vec_avx2.c.o
ninja: build stopped: subcommand failed




*Build Failed #14:
OS: SUSE15-64
Target: x86_64-gcc-static
FAILED: drivers/a715181@@tmp_rte_pmd_ice at sta/net_ice_ice_fdir_filter.c.o 
gcc -Idrivers/a715181@@tmp_rte_pmd_ice at sta -Idrivers -I../drivers -Idrivers/net/ice -I../drivers/net/ice -Idrivers/net/ice/base -I../drivers/net/ice/base -Idrivers/common/iavf -I../drivers/common/iavf -Ilib/librte_ethdev -I../lib/librte_ethdev -I. -I.. -Iconfig -I../config -Ilib/librte_eal/include -I../lib/librte_eal/include -Ilib/librte_eal/linux/include -I../lib/librte_eal/linux/include -Ilib/librte_eal/x86/include -I../lib/librte_eal/x86/include -Ilib/librte_eal/common -I../lib/librte_eal/common -Ilib/librte_eal -I../lib/librte_eal -Ilib/librte_kvargs -I../lib/librte_kvargs -Ilib/librte_metrics -I../lib/librte_metrics -Ilib/librte_telemetry -I../lib/librte_telemetry -Ilib/librte_net -I../lib/librte_net -Ilib/librte_mbuf -I../lib/librte_mbuf -Ilib/librte_mempool -I../lib/librte_mempool -Ilib/librte_ring -I../lib/librte_ring -Ilib/librte_meter -I../lib/librte_meter -Idrivers/bus/pci -I../drivers/bus/pci -I../drivers/bus/pci/linux -Ilib/librte_pci -I../lib/librte_pci -Idrivers/bus/vdev -I../drivers/bus/vdev -Ilib/librte_hash -I../lib/librte_hash -fdiagnostics-color=always -pipe -D_FILE_OFFSET_BITS=64 -Wall -Winvalid-pch -Werror -O3 -include rte_config.h -Wextra -Wcast-qual -Wdeprecated -Wformat-nonliteral -Wformat-security -Wmissing-declarations -Wmissing-prototypes -Wnested-externs -Wold-style-definition -Wpointer-arith -Wsign-compare -Wstrict-prototypes -Wundef -Wwrite-strings -Wno-missing-field-initializers -D_GNU_SOURCE -fPIC -march=native -DALLOW_EXPERIMENTAL_API -DALLOW_INTERNAL_API -Wno-format-truncation -MD -MQ 'drivers/a715181@@tmp_rte_pmd_ice at sta/net_ice_ice_fdir_filter.c.o' -MF 'drivers/a715181@@tmp_rte_pmd_ice at sta/net_ice_ice_fdir_filter.c.o.d' -o 'drivers/a715181@@tmp_rte_pmd_ice at sta/net_ice_ice_fdir_filter.c.o' -c ../drivers/net/ice/ice_fdir_filter.c
../drivers/net/ice/ice_fdir_filter.c: In function ‘ice_fdir_input_set_hdrs’:
../drivers/net/ice/ice_fdir_filter.c:948:30: error: unused parameter ‘ttype’ [-Werror=unused-parameter]
    enum ice_fdir_tunnel_type ttype)
                              ^~~~~
cc1: all warnings being treated as errors
[1245/2551] Compiling C object 'drivers/net/ice/base/39545a2@@ice_base at sta/ice_switch.c.o'
[1246/2551] Compiling C object 'drivers/a715181@@tmp_rte_pmd_ice at sta/net_ice_ice_hash.c.o'
[1247/2551] Compiling C object 'drivers/a715181@@tmp_rte_pmd_ice at sta/net_ice_ice_switch_filter.c.o'
[1248/2551] Compiling C object 'drivers/a715181@@tmp_rte_pmd_ice at sta/net_ice_ice_ethdev.c.o'
[1249/2551] Compiling C object 'drivers/net/igc/base/94439f5@@igc_base at sta/igc_api.c.o'
[1250/2551] Compiling C object 'drivers/a715181@@tmp_rte_pmd_ice at sta/net_ice_ice_dcf_ethdev.c.o'
[1251/2551] Compiling C object 'drivers/a715181@@tmp_rte_pmd_ice at sta/net_ice_ice_rxtx.c.o'
[1252/2551] Compiling C object 'drivers/a715181@@tmp_rte_pmd_ice at sta/net_ice_ice_rxtx_vec_avx2.c.o'
[1253/2551] Compiling C object 'drivers/a715181@@tmp_rte_pmd_ice at sta/net_ice_ice_rxtx_vec_sse.c.o'
ninja: build stopped: subcommand failed




*Build Failed #15:
OS: UB1804-64
Target: x86_64-gcc-static
FAILED: drivers/a715181@@tmp_rte_pmd_ice at sta/net_ice_ice_fdir_filter.c.o 
gcc -Idrivers/a715181@@tmp_rte_pmd_ice at sta -Idrivers -I../drivers -Idrivers/net/ice -I../drivers/net/ice -Idrivers/net/ice/base -I../drivers/net/ice/base -Idrivers/net/ice/../../common/iavf -I../drivers/net/ice/../../common/iavf -Ilib/librte_ethdev -I../lib/librte_ethdev -I. -I../ -Iconfig -I../config -Ilib/librte_eal/include -I../lib/librte_eal/include -Ilib/librte_eal/linux/include -I../lib/librte_eal/linux/include -Ilib/librte_eal/x86/include -I../lib/librte_eal/x86/include -Ilib/librte_eal/common -I../lib/librte_eal/common -Ilib/librte_eal -I../lib/librte_eal -Ilib/librte_kvargs -I../lib/librte_kvargs -Ilib/librte_telemetry/../librte_metrics -I../lib/librte_telemetry/../librte_metrics -Ilib/librte_telemetry -I../lib/librte_telemetry -Ilib/librte_net -I../lib/librte_net -Ilib/librte_mbuf -I../lib/librte_mbuf -Ilib/librte_mempool -I../lib/librte_mempool -Ilib/librte_ring -I../lib/librte_ring -Ilib/librte_meter -I../lib/librte_meter -Idrivers/bus/pci -I../drivers/bus/pci -I../drivers/bus/pci/linux -Ilib/librte_pci -I../lib/librte_pci -Idrivers/bus/vdev -I../drivers/bus/vdev -Ilib/librte_hash -I../lib/librte_hash -Idrivers/common/iavf -I../drivers/common/iavf -fdiagnostics-color=always -pipe -D_FILE_OFFSET_BITS=64 -Wall -Winvalid-pch -Werror -O3 -include rte_config.h -Wextra -Wcast-qual -Wdeprecated -Wformat-nonliteral -Wformat-security -Wmissing-declarations -Wmissing-prototypes -Wnested-externs -Wold-style-definition -Wpointer-arith -Wsign-compare -Wstrict-prototypes -Wundef -Wwrite-strings -Wno-packed-not-aligned -Wno-missing-field-initializers -D_GNU_SOURCE -fPIC -march=native -mno-avx512f -DALLOW_EXPERIMENTAL_API -DALLOW_INTERNAL_API -Wno-format-truncation -MD -MQ 'drivers/a715181@@tmp_rte_pmd_ice at sta/net_ice_ice_fdir_filter.c.o' -MF 'drivers/a715181@@tmp_rte_pmd_ice at sta/net_ice_ice_fdir_filter.c.o.d' -o 'drivers/a715181@@tmp_rte_pmd_ice at sta/net_ice_ice_fdir_filter.c.o' -c ../drivers/net/ice/ice_fdir_filter.c
../drivers/net/ice/ice_fdir_filter.c: In function ‘ice_fdir_input_set_hdrs’:
../drivers/net/ice/ice_fdir_filter.c:948:30: error: unused parameter ‘ttype’ [-Werror=unused-parameter]
    enum ice_fdir_tunnel_type ttype)
    ~~~~~~~~~~~~~~~~~~~~~~~~~~^~~~~
cc1: all warnings being treated as errors
[1251/2571] Generating rte_pmd_ice_def with a custom command.
[1252/2571] Compiling C object 'drivers/a715181@@tmp_rte_pmd_ice at sta/net_ice_ice_dcf_ethdev.c.o'.
[1253/2571] Compiling C object 'drivers/net/igc/base/94439f5@@igc_base at sta/igc_nvm.c.o'.
[1254/2571] Compiling C object 'drivers/net/igc/base/94439f5@@igc_base at sta/igc_manage.c.o'.
[1255/2571] Compiling C object 'drivers/a715181@@tmp_rte_pmd_ice at sta/net_ice_ice_dcf_parent.c.o'.
[1256/2571] Compiling C object 'drivers/a715181@@tmp_rte_pmd_ice at sta/net_ice_ice_rxtx.c.o'.
[1257/2571] Compiling C object 'drivers/net/igc/base/94439f5@@igc_base at sta/igc_mac.c.o'.
[1258/2571] Compiling C object 'drivers/a715181@@tmp_rte_pmd_ice at sta/net_ice_ice_rxtx_vec_avx2.c.o'.
[1259/2571] Compiling C object 'drivers/a715181@@tmp_rte_pmd_ice at sta/net_ice_ice_rxtx_vec_sse.c.o'.
ninja: build stopped: subcommand failed




*Build Failed #16:
OS: UB2004-32
Target: i686-gcc-static
FAILED: drivers/a715181@@tmp_rte_pmd_ice at sta/net_ice_ice_fdir_filter.c.o 
gcc -Idrivers/a715181@@tmp_rte_pmd_ice at sta -Idrivers -I../drivers -Idrivers/net/ice -I../drivers/net/ice -Idrivers/net/ice/base -I../drivers/net/ice/base -Idrivers/net/ice/../../common/iavf -I../drivers/net/ice/../../common/iavf -Ilib/librte_ethdev -I../lib/librte_ethdev -I. -I../ -Iconfig -I../config -Ilib/librte_eal/include -I../lib/librte_eal/include -Ilib/librte_eal/linux/include -I../lib/librte_eal/linux/include -Ilib/librte_eal/x86/include -I../lib/librte_eal/x86/include -Ilib/librte_eal/common -I../lib/librte_eal/common -Ilib/librte_eal -I../lib/librte_eal -Ilib/librte_kvargs -I../lib/librte_kvargs -Ilib/librte_telemetry/../librte_metrics -I../lib/librte_telemetry/../librte_metrics -Ilib/librte_telemetry -I../lib/librte_telemetry -Ilib/librte_net -I../lib/librte_net -Ilib/librte_mbuf -I../lib/librte_mbuf -Ilib/librte_mempool -I../lib/librte_mempool -Ilib/librte_ring -I../lib/librte_ring -Ilib/librte_meter -I../lib/librte_meter -Idrivers/bus/pci -I../drivers/bus/pci -I../drivers/bus/pci/linux -Ilib/librte_pci -I../lib/librte_pci -Idrivers/bus/vdev -I../drivers/bus/vdev -Ilib/librte_hash -I../lib/librte_hash -Idrivers/common/iavf -I../drivers/common/iavf -fdiagnostics-color=always -pipe -D_FILE_OFFSET_BITS=64 -Wall -Winvalid-pch -Werror -O3 -include rte_config.h -Wextra -Wcast-qual -Wdeprecated -Wformat-nonliteral -Wformat-security -Wmissing-declarations -Wmissing-prototypes -Wnested-externs -Wold-style-definition -Wpointer-arith -Wsign-compare -Wstrict-prototypes -Wundef -Wwrite-strings -Wno-address-of-packed-member -Wno-packed-not-aligned -Wno-missing-field-initializers -Wno-pointer-to-int-cast -D_GNU_SOURCE -m32 -fPIC -march=native -DALLOW_EXPERIMENTAL_API -DALLOW_INTERNAL_API -Wno-format-truncation -MD -MQ 'drivers/a715181@@tmp_rte_pmd_ice at sta/net_ice_ice_fdir_filter.c.o' -MF 'drivers/a715181@@tmp_rte_pmd_ice at sta/net_ice_ice_fdir_filter.c.o.d' -o 'drivers/a715181@@tmp_rte_pmd_ice at sta/net_ice_ice_fdir_filter.c.o' -c ../drivers/net/ice/ice_fdir_filter.c
../drivers/net/ice/ice_fdir_filter.c: In function ‘ice_fdir_input_set_hdrs’:
../drivers/net/ice/ice_fdir_filter.c:948:30: error: unused parameter ‘ttype’ [-Werror=unused-parameter]
  948 |    enum ice_fdir_tunnel_type ttype)
      |    ~~~~~~~~~~~~~~~~~~~~~~~~~~^~~~~
cc1: all warnings being treated as errors
[1202/2332] Compiling C object 'drivers/a715181@@tmp_rte_pmd_ice at sta/net_ice_ice_dcf.c.o'.
[1203/2332] Compiling C object 'drivers/a715181@@tmp_rte_pmd_ice at sta/net_ice_ice_switch_filter.c.o'.
[1204/2332] Compiling C object 'drivers/a715181@@tmp_rte_pmd_ice at sta/net_ice_ice_dcf_ethdev.c.o'.
[1205/2332] Compiling C object 'drivers/net/igc/base/94439f5@@igc_base at sta/igc_nvm.c.o'.
[1206/2332] Compiling C object 'drivers/a715181@@tmp_rte_pmd_ice at sta/net_ice_ice_dcf_parent.c.o'.
[1207/2332] Compiling C object 'drivers/a715181@@tmp_rte_pmd_ice at sta/net_ice_ice_rxtx_vec_avx2.c.o'.
[1208/2332] Compiling C object 'drivers/a715181@@tmp_rte_pmd_ice at sta/net_ice_ice_ethdev.c.o'.
[1209/2332] Compiling C object 'drivers/a715181@@tmp_rte_pmd_ice at sta/net_ice_ice_rxtx_vec_sse.c.o'.
[1210/2332] Compiling C object 'drivers/a715181@@tmp_rte_pmd_ice at sta/net_ice_ice_rxtx.c.o'.
ninja: build stopped: subcommand failed




*Build Failed #17:
OS: UB2004-64
Target: x86_64-clang-static
FAILED: drivers/a715181@@tmp_rte_pmd_ice at sta/net_ice_ice_fdir_filter.c.o 
clang -Idrivers/a715181@@tmp_rte_pmd_ice at sta -Idrivers -I../drivers -Idrivers/net/ice -I../drivers/net/ice -Idrivers/net/ice/base -I../drivers/net/ice/base -Idrivers/net/ice/../../common/iavf -I../drivers/net/ice/../../common/iavf -Ilib/librte_ethdev -I../lib/librte_ethdev -I. -I../ -Iconfig -I../config -Ilib/librte_eal/include -I../lib/librte_eal/include -Ilib/librte_eal/linux/include -I../lib/librte_eal/linux/include -Ilib/librte_eal/x86/include -I../lib/librte_eal/x86/include -Ilib/librte_eal/common -I../lib/librte_eal/common -Ilib/librte_eal -I../lib/librte_eal -Ilib/librte_kvargs -I../lib/librte_kvargs -Ilib/librte_telemetry/../librte_metrics -I../lib/librte_telemetry/../librte_metrics -Ilib/librte_telemetry -I../lib/librte_telemetry -Ilib/librte_net -I../lib/librte_net -Ilib/librte_mbuf -I../lib/librte_mbuf -Ilib/librte_mempool -I../lib/librte_mempool -Ilib/librte_ring -I../lib/librte_ring -Ilib/librte_meter -I../lib/librte_meter -Idrivers/bus/pci -I../drivers/bus/pci -I../drivers/bus/pci/linux -Ilib/librte_pci -I../lib/librte_pci -Idrivers/bus/vdev -I../drivers/bus/vdev -Ilib/librte_hash -I../lib/librte_hash -Idrivers/common/iavf -I../drivers/common/iavf -Xclang -fcolor-diagnostics -pipe -D_FILE_OFFSET_BITS=64 -Wall -Winvalid-pch -Werror -O3 -include rte_config.h -Wextra -Wcast-qual -Wdeprecated -Wformat-nonliteral -Wformat-security -Wmissing-declarations -Wmissing-prototypes -Wnested-externs -Wold-style-definition -Wpointer-arith -Wsign-compare -Wstrict-prototypes -Wundef -Wwrite-strings -Wno-address-of-packed-member -Wno-missing-field-initializers -D_GNU_SOURCE -fPIC -march=native -DALLOW_EXPERIMENTAL_API -DALLOW_INTERNAL_API -MD -MQ 'drivers/a715181@@tmp_rte_pmd_ice at sta/net_ice_ice_fdir_filter.c.o' -MF 'drivers/a715181@@tmp_rte_pmd_ice at sta/net_ice_ice_fdir_filter.c.o.d' -o 'drivers/a715181@@tmp_rte_pmd_ice at sta/net_ice_ice_fdir_filter.c.o' -c ../drivers/net/ice/ice_fdir_filter.c
../drivers/net/ice/ice_fdir_filter.c:948:30: error: unused parameter 'ttype' [-Werror,-Wunused-parameter]
                        enum ice_fdir_tunnel_type ttype)
                                                  ^
1 error generated.
[1245/2573] Compiling C object 'drivers/net/ice/base/39545a2@@ice_base at sta/ice_switch.c.o'.
[1246/2573] Compiling C object 'drivers/a715181@@tmp_rte_pmd_ice at sta/net_ice_ice_generic_flow.c.o'.
[1247/2573] Compiling C object 'drivers/a715181@@tmp_rte_pmd_ice at sta/net_ice_ice_rxtx.c.o'.
[1248/2573] Compiling C object 'drivers/a715181@@tmp_rte_pmd_ice at sta/net_ice_ice_dcf.c.o'.
[1249/2573] Compiling C object 'drivers/a715181@@tmp_rte_pmd_ice at sta/net_ice_ice_ethdev.c.o'.
[1250/2573] Compiling C object 'drivers/a715181@@tmp_rte_pmd_ice at sta/net_ice_ice_dcf_parent.c.o'.
[1251/2573] Compiling C object 'drivers/a715181@@tmp_rte_pmd_ice at sta/net_ice_ice_rxtx_vec_sse.c.o'.
[1252/2573] Compiling C object 'drivers/a715181@@tmp_rte_pmd_ice at sta/net_ice_ice_dcf_ethdev.c.o'.
[1253/2573] Compiling C object 'drivers/a715181@@tmp_rte_pmd_ice at sta/net_ice_ice_rxtx_vec_avx2.c.o'.
ninja: build stopped: subcommand failed




*Build Failed #18:
OS: UB2004-64
Target: x86_64-gcc-static
FAILED: drivers/a715181@@tmp_rte_pmd_ice at sta/net_ice_ice_fdir_filter.c.o 
gcc -Idrivers/a715181@@tmp_rte_pmd_ice at sta -Idrivers -I../drivers -Idrivers/net/ice -I../drivers/net/ice -Idrivers/net/ice/base -I../drivers/net/ice/base -Idrivers/net/ice/../../common/iavf -I../drivers/net/ice/../../common/iavf -Ilib/librte_ethdev -I../lib/librte_ethdev -I. -I../ -Iconfig -I../config -Ilib/librte_eal/include -I../lib/librte_eal/include -Ilib/librte_eal/linux/include -I../lib/librte_eal/linux/include -Ilib/librte_eal/x86/include -I../lib/librte_eal/x86/include -Ilib/librte_eal/common -I../lib/librte_eal/common -Ilib/librte_eal -I../lib/librte_eal -Ilib/librte_kvargs -I../lib/librte_kvargs -Ilib/librte_telemetry/../librte_metrics -I../lib/librte_telemetry/../librte_metrics -Ilib/librte_telemetry -I../lib/librte_telemetry -Ilib/librte_net -I../lib/librte_net -Ilib/librte_mbuf -I../lib/librte_mbuf -Ilib/librte_mempool -I../lib/librte_mempool -Ilib/librte_ring -I../lib/librte_ring -Ilib/librte_meter -I../lib/librte_meter -Idrivers/bus/pci -I../drivers/bus/pci -I../drivers/bus/pci/linux -Ilib/librte_pci -I../lib/librte_pci -Idrivers/bus/vdev -I../drivers/bus/vdev -Ilib/librte_hash -I../lib/librte_hash -Idrivers/common/iavf -I../drivers/common/iavf -fdiagnostics-color=always -pipe -D_FILE_OFFSET_BITS=64 -Wall -Winvalid-pch -Werror -O3 -include rte_config.h -Wextra -Wcast-qual -Wdeprecated -Wformat-nonliteral -Wformat-security -Wmissing-declarations -Wmissing-prototypes -Wnested-externs -Wold-style-definition -Wpointer-arith -Wsign-compare -Wstrict-prototypes -Wundef -Wwrite-strings -Wno-address-of-packed-member -Wno-packed-not-aligned -Wno-missing-field-initializers -Wno-zero-length-bounds -D_GNU_SOURCE -fPIC -march=native -DALLOW_EXPERIMENTAL_API -DALLOW_INTERNAL_API -Wno-format-truncation -MD -MQ 'drivers/a715181@@tmp_rte_pmd_ice at sta/net_ice_ice_fdir_filter.c.o' -MF 'drivers/a715181@@tmp_rte_pmd_ice at sta/net_ice_ice_fdir_filter.c.o.d' -o 'drivers/a715181@@tmp_rte_pmd_ice at sta/net_ice_ice_fdir_filter.c.o' -c ../drivers/net/ice/ice_fdir_filter.c
../drivers/net/ice/ice_fdir_filter.c: In function ‘ice_fdir_input_set_hdrs’:
../drivers/net/ice/ice_fdir_filter.c:948:30: error: unused parameter ‘ttype’ [-Werror=unused-parameter]
  948 |    enum ice_fdir_tunnel_type ttype)
      |    ~~~~~~~~~~~~~~~~~~~~~~~~~~^~~~~
cc1: all warnings being treated as errors
[1250/2573] Compiling C object 'drivers/net/igc/base/94439f5@@igc_base at sta/igc_manage.c.o'.
[1251/2573] Compiling C object 'drivers/a715181@@tmp_rte_pmd_ice at sta/net_ice_ice_ethdev.c.o'.
[1252/2573] Compiling C object 'drivers/a715181@@tmp_rte_pmd_ice at sta/net_ice_ice_dcf_parent.c.o'.
[1253/2573] Compiling C object 'drivers/net/igc/base/94439f5@@igc_base at sta/igc_i225.c.o'.
[1254/2573] Compiling C object 'drivers/a715181@@tmp_rte_pmd_ice at sta/net_ice_ice_dcf_ethdev.c.o'.
[1255/2573] Compiling C object 'drivers/net/igc/base/94439f5@@igc_base at sta/igc_mac.c.o'.
[1256/2573] Compiling C object 'drivers/a715181@@tmp_rte_pmd_ice at sta/net_ice_ice_rxtx.c.o'.
[1257/2573] Compiling C object 'drivers/a715181@@tmp_rte_pmd_ice at sta/net_ice_ice_rxtx_vec_sse.c.o'.
[1258/2573] Compiling C object 'drivers/a715181@@tmp_rte_pmd_ice at sta/net_ice_ice_rxtx_vec_avx2.c.o'.
ninja: build stopped: subcommand failed




*Build Failed #19:
OS: UB2004-64
Target: x86_64-gcc-doc
FAILED: drivers/a715181@@tmp_rte_pmd_ice at sta/net_ice_ice_fdir_filter.c.o 
gcc -Idrivers/a715181@@tmp_rte_pmd_ice at sta -Idrivers -I../drivers -Idrivers/net/ice -I../drivers/net/ice -Idrivers/net/ice/base -I../drivers/net/ice/base -Idrivers/net/ice/../../common/iavf -I../drivers/net/ice/../../common/iavf -Ilib/librte_ethdev -I../lib/librte_ethdev -I. -I../ -Iconfig -I../config -Ilib/librte_eal/include -I../lib/librte_eal/include -Ilib/librte_eal/linux/include -I../lib/librte_eal/linux/include -Ilib/librte_eal/x86/include -I../lib/librte_eal/x86/include -Ilib/librte_eal/common -I../lib/librte_eal/common -Ilib/librte_eal -I../lib/librte_eal -Ilib/librte_kvargs -I../lib/librte_kvargs -Ilib/librte_telemetry/../librte_metrics -I../lib/librte_telemetry/../librte_metrics -Ilib/librte_telemetry -I../lib/librte_telemetry -Ilib/librte_net -I../lib/librte_net -Ilib/librte_mbuf -I../lib/librte_mbuf -Ilib/librte_mempool -I../lib/librte_mempool -Ilib/librte_ring -I../lib/librte_ring -Ilib/librte_meter -I../lib/librte_meter -Idrivers/bus/pci -I../drivers/bus/pci -I../drivers/bus/pci/linux -Ilib/librte_pci -I../lib/librte_pci -Idrivers/bus/vdev -I../drivers/bus/vdev -Ilib/librte_hash -I../lib/librte_hash -Idrivers/common/iavf -I../drivers/common/iavf -fdiagnostics-color=always -pipe -D_FILE_OFFSET_BITS=64 -Wall -Winvalid-pch -Werror -O3 -include rte_config.h -Wextra -Wcast-qual -Wdeprecated -Wformat-nonliteral -Wformat-security -Wmissing-declarations -Wmissing-prototypes -Wnested-externs -Wold-style-definition -Wpointer-arith -Wsign-compare -Wstrict-prototypes -Wundef -Wwrite-strings -Wno-address-of-packed-member -Wno-packed-not-aligned -Wno-missing-field-initializers -D_GNU_SOURCE -fPIC -march=native -DALLOW_EXPERIMENTAL_API -DALLOW_INTERNAL_API -Wno-format-truncation -MD -MQ 'drivers/a715181@@tmp_rte_pmd_ice at sta/net_ice_ice_fdir_filter.c.o' -MF 'drivers/a715181@@tmp_rte_pmd_ice at sta/net_ice_ice_fdir_filter.c.o.d' -o 'drivers/a715181@@tmp_rte_pmd_ice at sta/net_ice_ice_fdir_filter.c.o' -c ../drivers/net/ice/ice_fdir_filter.c
../drivers/net/ice/ice_fdir_filter.c: In function ‘ice_fdir_input_set_hdrs’:
../drivers/net/ice/ice_fdir_filter.c:948:30: error: unused parameter ‘ttype’ [-Werror=unused-parameter]
  948 |    enum ice_fdir_tunnel_type ttype)
      |    ~~~~~~~~~~~~~~~~~~~~~~~~~~^~~~~
cc1: all warnings being treated as errors
[1252/2432] Compiling C object 'drivers/net/ice/base/39545a2@@ice_base at sta/ice_switch.c.o'.
[1253/2432] Compiling C object 'drivers/a715181@@tmp_rte_pmd_ice at sta/net_ice_ice_dcf_parent.c.o'.
[1254/2432] Compiling C object 'drivers/a715181@@tmp_rte_pmd_ice at sta/net_ice_ice_switch_filter.c.o'.
[1255/2432] Compiling C object 'drivers/net/igc/base/94439f5@@igc_base at sta/igc_nvm.c.o'.
[1256/2432] Compiling C object 'drivers/a715181@@tmp_rte_pmd_ice at sta/net_ice_ice_dcf_ethdev.c.o'.
[1257/2432] Compiling C object 'drivers/a715181@@tmp_rte_pmd_ice at sta/net_ice_ice_ethdev.c.o'.
[1258/2432] Compiling C object 'drivers/a715181@@tmp_rte_pmd_ice at sta/net_ice_ice_rxtx_vec_avx2.c.o'.
[1259/2432] Compiling C object 'drivers/a715181@@tmp_rte_pmd_ice at sta/net_ice_ice_rxtx_vec_sse.c.o'.
[1260/2432] Compiling C object 'drivers/a715181@@tmp_rte_pmd_ice at sta/net_ice_ice_rxtx.c.o'.
ninja: build stopped: subcommand failed


DPDK STV team


More information about the test-report mailing list