[dpdk-test-report] |FAILURE| pw(77380) [v2, 3/3] crypto/aesni_mb: support KASUMI F8/F9

sys_stv at intel.com sys_stv at intel.com
Tue Sep 15 03:48:51 CEST 2020


Test-Label: Intel-compilation
Test-Status: FAILURE
http://dpdk.org/patch/77380

_Compilation issues_

Submitter: Pablo de Lara <pablo.de.lara.guarch at intel.com>
Date: 2020-09-11 11:38:01
Reply_mail: 20200911113801.2664990-3-pablo.de.lara.guarch at intel.com

DPDK git baseline: Repo:dpdk-next-crypto, CommitID: b9b10ddb4292f2bc5524ae9f427a2795514eff02


Build Summary: 22 Builds Done, 6 Successful, 16 Failures, 0 Blocked

+----------------+------------+--------------+------------+------------+-----------+----------+
| os             | gcc-static | clang-static | icc-static | gcc-shared | gcc-debug | document |
+----------------+------------+--------------+------------+------------+-----------+----------+
| CENTOS82-64    | FAIL       | FAIL         | FAIL       | FAIL       | FAIL      |          |
| RHEL82-64      | FAIL       |              |            |            |           |          |
| UB1804-64      | FAIL       |              |            |            |           |          |
| FC32-64        | FAIL       | FAIL         |            |            |           |          |
| CENTOS77-64    | FAIL       |              |            |            |           |          |
| UB2004-64      | FAIL       | FAIL         | FAIL       |            |           | FAIL     |
| WIN10-64       |            | pass         |            |            |           |          |
| UB2004-32      | pass       |              |            |            |           |          |
| FreeBSD1201-64 | pass       | pass         |            | pass       | pass      |          |
| SUSE15-64      | FAIL       | FAIL         |            |            |           |          |
+----------------+------------+--------------+------------+------------+-----------+----------+
Test environment and configuration as below:
** Meson build **



OS: CENTOS82-64
	Kernel Version: 4.18.0-193.el8.x86_64
	CPU info: Intel(R) Xeon(R) Platinum 8280M CPU @ 2.70GHz
	GCC Version: gcc (GCC) 8.3.1 20191121 (Red Hat 8.3.1-5)
	Clang Version: 9.0.1 (Red Hat 9.0.1-2.module_el8.2.0+309+0c7b6b03)
	x86_64-gcc-static
	x86_64-clang-static
	x86_64-icc-static
	x86_64-gcc-shared
	x86_64-gcc-debug


OS: RHEL82-64
	Kernel Version: 4.18.0-193.el8.x86_64
	CPU info: Intel(R) Xeon(R) Platinum 8280M CPU @ 2.70GHz
	GCC Version: gcc (GCC) 8.3.1 20191121 (Red Hat 8.3.1-5)
	Clang Version: 8.0.1 (Red Hat 8.0.1-1.module_el8.1.0+215+a01033fb)
	x86_64-gcc-static


OS: UB1804-64
	Kernel Version: 5.3.0-59-generic
	CPU info: Intel(R) Xeon(R) Platinum 8180 CPU @ 2.50GHz
	GCC Version: gcc (Ubuntu 8.4.0-1ubuntu1~18.04) 8.4.0
	Clang Version: 6.0.0-1ubuntu2 (tags/RELEASE_600/final)
	x86_64-gcc-static


OS: FC32-64
	Kernel Version: 5.6.0-0.rc7.git0.2.fc32.x86_64
	CPU info: Intel(R) Xeon(R) Platinum 8280M CPU @ 2.70GHz
	GCC Version: gcc (GCC) 10.0.1 20200311 (Red Hat 10.0.1-0.9)
	Clang Version: 10.0.0 (Fedora 10.0.0-0.3.rc4.fc32)
	x86_64-gcc-static
	x86_64-clang-static


OS: CENTOS77-64
	Kernel Version: 3.10.0-1062.9.1.el7.x86_64
	CPU info: Intel(R) Xeon(R) Platinum 8280M CPU @ 2.70GHz
	GCC Version: gcc (GCC) 4.8.5 20150623 (Red Hat 4.8.5-39)
	Clang Version: 3.4.2 (tags/RELEASE_34/dot2-final)
	x86_64-gcc-static


OS: UB2004-64
	Kernel Version: 5.4.0-26-generic
	CPU info: Intel(R) Xeon(R) Platinum 8180 CPU @ 2.50GHz
	GCC Version: gcc (Ubuntu 10-20200416-0ubuntu1) 10.0.1 20200416 (experimental) [master revision 3c3f12e2a76:dcee354ce56:44b326839d864fc10c459916abcc97f35a9ac3de]
	Clang Version: 10.0.0-4ubuntu1
	x86_64-clang-static
	x86_64-gcc-static
	x86_64-icc-static
	x86_64-gcc-doc


OS: WIN10-64
	Kernel Version: N/A
	CPU info: N/A
	GCC Version: N/A
	Clang Version: Clang 8.0.0
	x86_64-windows-clang


OS: UB2004-32
	Kernel Version: 5.4.0-26-generic
	CPU info: Intel(R) Xeon(R) Platinum 8180 CPU @ 2.50GHz
	GCC Version: gcc (Ubuntu 9.3.0-10ubuntu2) 9.3.0
	Clang Version: 10.0.0-4ubuntu1
	i686-gcc-static


OS: FreeBSD1201-64
	Kernel Version: 12.1-RELEASE
	CPU info: Intel(R) Xeon(R) CPU E5-2699 v3 @ 2.30GHz (2294.74-MHz K8-class CPU)
	GCC Version: gcc (FreeBSD Ports Collection) 9.2.0
	Clang Version: 8.0.1 (tags/RELEASE_801/final 366581) (based on LLVM 8.0.1)
	x86_64-gcc-static
	x86_64-clang-static
	x86_64-gcc-shared
	x86_64-gcc-debug


OS: SUSE15-64
	Kernel Version: 4.12.14-lp150.11-default
	CPU info: Intel(R) Xeon(R) CPU E5-2699 v4 @ 2.20GHz
	GCC Version: gcc (SUSE Linux) 7.3.1 20180323 [gcc-7-branch revision 258812]
	Clang Version: 5.0.1 (tags/RELEASE_501/final 312548)
	x86_64-clang-static
	x86_64-gcc-static



*Build Failed #1:
OS: CENTOS77-64
Target: x86_64-gcc-static
FAILED: drivers/a715181@@tmp_rte_pmd_aesni_mb at sta/crypto_aesni_mb_rte_aesni_mb_pmd_ops.c.o 
gcc -Idrivers/a715181@@tmp_rte_pmd_aesni_mb at sta -Idrivers -I../drivers -Idrivers/crypto/aesni_mb -I../drivers/crypto/aesni_mb -Ilib/librte_cryptodev -I../lib/librte_cryptodev -I. -I../ -Iconfig -I../config -Ilib/librte_eal/include -I../lib/librte_eal/include -Ilib/librte_eal/linux/include -I../lib/librte_eal/linux/include -Ilib/librte_eal/x86/include -I../lib/librte_eal/x86/include -Ilib/librte_eal/common -I../lib/librte_eal/common -Ilib/librte_eal -I../lib/librte_eal -Ilib/librte_kvargs -I../lib/librte_kvargs -Ilib/librte_telemetry/../librte_metrics -I../lib/librte_telemetry/../librte_metrics -Ilib/librte_telemetry -I../lib/librte_telemetry -Ilib/librte_mbuf -I../lib/librte_mbuf -Ilib/librte_mempool -I../lib/librte_mempool -Ilib/librte_ring -I../lib/librte_ring -Idrivers/bus/vdev -I../drivers/bus/vdev -Ilib/librte_net -I../lib/librte_net -Ilib/librte_security -I../lib/librte_security -pipe -D_FILE_OFFSET_BITS=64 -Wall -Winvalid-pch -Werror -O3 -include rte_config.h -Wextra -Wcast-qual -Wdeprecated -Wformat-nonliteral -Wformat-security -Wmissing-declarations -Wmissing-prototypes -Wnested-externs -Wold-style-definition -Wpointer-arith -Wsign-compare -Wstrict-prototypes -Wundef -Wwrite-strings -Wno-missing-field-initializers -D_GNU_SOURCE -fPIC -march=native -DALLOW_EXPERIMENTAL_API -DALLOW_INTERNAL_API -MD -MQ 'drivers/a715181@@tmp_rte_pmd_aesni_mb at sta/crypto_aesni_mb_rte_aesni_mb_pmd_ops.c.o' -MF 'drivers/a715181@@tmp_rte_pmd_aesni_mb at sta/crypto_aesni_mb_rte_aesni_mb_pmd_ops.c.o.d' -o 'drivers/a715181@@tmp_rte_pmd_aesni_mb at sta/crypto_aesni_mb_rte_aesni_mb_pmd_ops.c.o' -c ../drivers/crypto/aesni_mb/rte_aesni_mb_pmd_ops.c
In file included from ../drivers/crypto/aesni_mb/rte_aesni_mb_pmd_ops.c:13:0:
../drivers/crypto/aesni_mb/aesni_mb_pmd_private.h:247:4: error: unknown type name ‘snow3g_key_schedule_t’
    snow3g_key_schedule_t pKeySched_snow3g_cipher;
    ^
../drivers/crypto/aesni_mb/aesni_mb_pmd_private.h:249:4: error: unknown type name ‘kasumi_key_sched_t’
    kasumi_key_sched_t pKeySched_kasumi_cipher;
    ^
../drivers/crypto/aesni_mb/aesni_mb_pmd_private.h:292:4: error: unknown type name ‘snow3g_key_schedule_t’
    snow3g_key_schedule_t pKeySched_snow3g_auth;
    ^
../drivers/crypto/aesni_mb/aesni_mb_pmd_private.h:294:4: error: unknown type name ‘kasumi_key_sched_t’
    kasumi_key_sched_t pKeySched_kasumi_auth;
    ^
[1755/2545] Compiling C object 'drivers/a715181@@tmp_rte_pmd_aesni_mb at sta/crypto_aesni_mb_rte_aesni_mb_pmd.c.o'.
FAILED: drivers/a715181@@tmp_rte_pmd_aesni_mb at sta/crypto_aesni_mb_rte_aesni_mb_pmd.c.o 
gcc -Idrivers/a715181@@tmp_rte_pmd_aesni_mb at sta -Idrivers -I../drivers -Idrivers/crypto/aesni_mb -I../drivers/crypto/aesni_mb -Ilib/librte_cryptodev -I../lib/librte_cryptodev -I. -I../ -Iconfig -I../config -Ilib/librte_eal/include -I../lib/librte_eal/include -Ilib/librte_eal/linux/include -I../lib/librte_eal/linux/include -Ilib/librte_eal/x86/include -I../lib/librte_eal/x86/include -Ilib/librte_eal/common -I../lib/librte_eal/common -Ilib/librte_eal -I../lib/librte_eal -Ilib/librte_kvargs -I../lib/librte_kvargs -Ilib/librte_telemetry/../librte_metrics -I../lib/librte_telemetry/../librte_metrics -Ilib/librte_telemetry -I../lib/librte_telemetry -Ilib/librte_mbuf -I../lib/librte_mbuf -Ilib/librte_mempool -I../lib/librte_mempool -Ilib/librte_ring -I../lib/librte_ring -Idrivers/bus/vdev -I../drivers/bus/vdev -Ilib/librte_net -I../lib/librte_net -Ilib/librte_security -I../lib/librte_security -pipe -D_FILE_OFFSET_BITS=64 -Wall -Winvalid-pch -Werror -O3 -include rte_config.h -Wextra -Wcast-qual -Wdeprecated -Wformat-nonliteral -Wformat-security -Wmissing-declarations -Wmissing-prototypes -Wnested-externs -Wold-style-definition -Wpointer-arith -Wsign-compare -Wstrict-prototypes -Wundef -Wwrite-strings -Wno-missing-field-initializers -D_GNU_SOURCE -fPIC -march=native -DALLOW_EXPERIMENTAL_API -DALLOW_INTERNAL_API -MD -MQ 'drivers/a715181@@tmp_rte_pmd_aesni_mb at sta/crypto_aesni_mb_rte_aesni_mb_pmd.c.o' -MF 'drivers/a715181@@tmp_rte_pmd_aesni_mb at sta/crypto_aesni_mb_rte_aesni_mb_pmd.c.o.d' -o 'drivers/a715181@@tmp_rte_pmd_aesni_mb at sta/crypto_aesni_mb_rte_aesni_mb_pmd.c.o' -c ../drivers/crypto/aesni_mb/rte_aesni_mb_pmd.c
In file included from ../drivers/crypto/aesni_mb/rte_aesni_mb_pmd.c:17:0:
../drivers/crypto/aesni_mb/aesni_mb_pmd_private.h:247:4: error: unknown type name ‘snow3g_key_schedule_t’
    snow3g_key_schedule_t pKeySched_snow3g_cipher;
    ^
../drivers/crypto/aesni_mb/aesni_mb_pmd_private.h:249:4: error: unknown type name ‘kasumi_key_sched_t’
    kasumi_key_sched_t pKeySched_kasumi_cipher;
    ^
../drivers/crypto/aesni_mb/aesni_mb_pmd_private.h:292:4: error: unknown type name ‘snow3g_key_schedule_t’
    snow3g_key_schedule_t pKeySched_snow3g_auth;
    ^
../drivers/crypto/aesni_mb/aesni_mb_pmd_private.h:294:4: error: unknown type name ‘kasumi_key_sched_t’
    kasumi_key_sched_t pKeySched_kasumi_auth;
    ^
[1756/2545] Linking target drivers/librte_rawdev_ioat.so.21.0.
[1757/2545] Generating rte_pmd_aesni_mb_def with a custom command.
[1758/2545] Generating rte_rawdev_ntb.sym_chk with a meson_exe.py custom command.
[1759/2545] Compiling C object 'drivers/a715181@@tmp_rte_pmd_virtio at sta/net_virtio_virtio_rxtx.c.o'.
[1760/2545] Generating rte_rawdev_octeontx2_dma.sym_chk with a meson_exe.py custom command.
[1761/2545] Compiling C object 'drivers/a715181@@tmp_rte_pmd_aesni_gcm at sta/crypto_aesni_gcm_aesni_gcm_pmd.c.o'.
[1762/2545] Generating rte_rawdev_octeontx2_ep.sym_chk with a meson_exe.py custom command.
[1763/2545] Generating rte_rawdev_skeleton.sym_chk with a meson_exe.py custom command.
ninja: build stopped: subcommand failed




*Build Failed #2:
OS: CENTOS82-64
Target: x86_64-gcc-static
FAILED: drivers/a715181@@tmp_rte_pmd_aesni_mb at sta/crypto_aesni_mb_rte_aesni_mb_pmd_ops.c.o 
gcc -Idrivers/a715181@@tmp_rte_pmd_aesni_mb at sta -Idrivers -I../drivers -Idrivers/crypto/aesni_mb -I../drivers/crypto/aesni_mb -Ilib/librte_cryptodev -I../lib/librte_cryptodev -I. -I../ -Iconfig -I../config -Ilib/librte_eal/include -I../lib/librte_eal/include -Ilib/librte_eal/linux/include -I../lib/librte_eal/linux/include -Ilib/librte_eal/x86/include -I../lib/librte_eal/x86/include -Ilib/librte_eal/common -I../lib/librte_eal/common -Ilib/librte_eal -I../lib/librte_eal -Ilib/librte_kvargs -I../lib/librte_kvargs -Ilib/librte_telemetry/../librte_metrics -I../lib/librte_telemetry/../librte_metrics -Ilib/librte_telemetry -I../lib/librte_telemetry -Ilib/librte_mbuf -I../lib/librte_mbuf -Ilib/librte_mempool -I../lib/librte_mempool -Ilib/librte_ring -I../lib/librte_ring -Idrivers/bus/vdev -I../drivers/bus/vdev -Ilib/librte_net -I../lib/librte_net -Ilib/librte_security -I../lib/librte_security -fdiagnostics-color=always -pipe -D_FILE_OFFSET_BITS=64 -Wall -Winvalid-pch -Werror -O3 -include rte_config.h -Wextra -Wcast-qual -Wdeprecated -Wformat-nonliteral -Wformat-security -Wmissing-declarations -Wmissing-prototypes -Wnested-externs -Wold-style-definition -Wpointer-arith -Wsign-compare -Wstrict-prototypes -Wundef -Wwrite-strings -Wno-packed-not-aligned -Wno-missing-field-initializers -D_GNU_SOURCE -fPIC -march=native -mno-avx512f -DALLOW_EXPERIMENTAL_API -DALLOW_INTERNAL_API -Wno-format-truncation -MD -MQ 'drivers/a715181@@tmp_rte_pmd_aesni_mb at sta/crypto_aesni_mb_rte_aesni_mb_pmd_ops.c.o' -MF 'drivers/a715181@@tmp_rte_pmd_aesni_mb at sta/crypto_aesni_mb_rte_aesni_mb_pmd_ops.c.o.d' -o 'drivers/a715181@@tmp_rte_pmd_aesni_mb at sta/crypto_aesni_mb_rte_aesni_mb_pmd_ops.c.o' -c ../drivers/crypto/aesni_mb/rte_aesni_mb_pmd_ops.c
In file included from ../drivers/crypto/aesni_mb/rte_aesni_mb_pmd_ops.c:13:
../drivers/crypto/aesni_mb/aesni_mb_pmd_private.h:60:3: error: subscripted value is neither array nor pointer nor vector
   [IMB_AUTH_SNOW3G_UIA2_BITLEN] = 16
   ^
../drivers/crypto/aesni_mb/aesni_mb_pmd_private.h:61:3: error: subscripted value is neither array nor pointer nor vector
   [IMB_AUTH_KASUMI_UIA1]  = 16
   ^
../drivers/crypto/aesni_mb/aesni_mb_pmd_private.h:96:3: error: subscripted value is neither array nor pointer nor vector
   [IMB_AUTH_SNOW3G_UIA2_BITLEN] = 4
   ^
../drivers/crypto/aesni_mb/aesni_mb_pmd_private.h:97:3: error: subscripted value is neither array nor pointer nor vector
   [IMB_AUTH_KASUMI_UIA1]  = 4
   ^
../drivers/crypto/aesni_mb/aesni_mb_pmd_private.h:95:32: error: initialization of ‘unsigned int’ from ‘const unsigned int *’ makes integer from pointer without a cast [-Werror=int-conversion]
   [IMB_AUTH_ZUC_EIA3_BITLEN] = 4
                                ^
../drivers/crypto/aesni_mb/aesni_mb_pmd_private.h:95:32: note: (near initialization for ‘auth_truncated_digest_byte_lengths[20]’)
../drivers/crypto/aesni_mb/aesni_mb_pmd_private.h:95:32: error: initializer element is not constant
../drivers/crypto/aesni_mb/aesni_mb_pmd_private.h:95:32: note: (near initialization for ‘auth_truncated_digest_byte_lengths[20]’)
../drivers/crypto/aesni_mb/aesni_mb_pmd_private.h:133:3: error: subscripted value is neither array nor pointer nor vector
   [IMB_AUTH_SNOW3G_UIA2_BITLEN] = 4
   ^
../drivers/crypto/aesni_mb/aesni_mb_pmd_private.h:134:3: error: subscripted value is neither array nor pointer nor vector
   [IMB_AUTH_KASUMI_UIA1]  = 4
   ^
../drivers/crypto/aesni_mb/aesni_mb_pmd_private.h:132:32: error: initialization of ‘unsigned int’ from ‘const unsigned int *’ makes integer from pointer without a cast [-Werror=int-conversion]
   [IMB_AUTH_ZUC_EIA3_BITLEN] = 4
                                ^
../drivers/crypto/aesni_mb/aesni_mb_pmd_private.h:132:32: note: (near initialization for ‘auth_digest_byte_lengths[20]’)
../drivers/crypto/aesni_mb/aesni_mb_pmd_private.h:132:32: error: initializer element is not constant
../drivers/crypto/aesni_mb/aesni_mb_pmd_private.h:132:32: note: (near initialization for ‘auth_digest_byte_lengths[20]’)
cc1: all warnings being treated as errors
[1763/2578] Compiling C object 'drivers/a715181@@tmp_rte_pmd_aesni_mb at sta/crypto_aesni_mb_rte_aesni_mb_pmd.c.o'.
FAILED: drivers/a715181@@tmp_rte_pmd_aesni_mb at sta/crypto_aesni_mb_rte_aesni_mb_pmd.c.o 
gcc -Idrivers/a715181@@tmp_rte_pmd_aesni_mb at sta -Idrivers -I../drivers -Idrivers/crypto/aesni_mb -I../drivers/crypto/aesni_mb -Ilib/librte_cryptodev -I../lib/librte_cryptodev -I. -I../ -Iconfig -I../config -Ilib/librte_eal/include -I../lib/librte_eal/include -Ilib/librte_eal/linux/include -I../lib/librte_eal/linux/include -Ilib/librte_eal/x86/include -I../lib/librte_eal/x86/include -Ilib/librte_eal/common -I../lib/librte_eal/common -Ilib/librte_eal -I../lib/librte_eal -Ilib/librte_kvargs -I../lib/librte_kvargs -Ilib/librte_telemetry/../librte_metrics -I../lib/librte_telemetry/../librte_metrics -Ilib/librte_telemetry -I../lib/librte_telemetry -Ilib/librte_mbuf -I../lib/librte_mbuf -Ilib/librte_mempool -I../lib/librte_mempool -Ilib/librte_ring -I../lib/librte_ring -Idrivers/bus/vdev -I../drivers/bus/vdev -Ilib/librte_net -I../lib/librte_net -Ilib/librte_security -I../lib/librte_security -fdiagnostics-color=always -pipe -D_FILE_OFFSET_BITS=64 -Wall -Winvalid-pch -Werror -O3 -include rte_config.h -Wextra -Wcast-qual -Wdeprecated -Wformat-nonliteral -Wformat-security -Wmissing-declarations -Wmissing-prototypes -Wnested-externs -Wold-style-definition -Wpointer-arith -Wsign-compare -Wstrict-prototypes -Wundef -Wwrite-strings -Wno-packed-not-aligned -Wno-missing-field-initializers -D_GNU_SOURCE -fPIC -march=native -mno-avx512f -DALLOW_EXPERIMENTAL_API -DALLOW_INTERNAL_API -Wno-format-truncation -MD -MQ 'drivers/a715181@@tmp_rte_pmd_aesni_mb at sta/crypto_aesni_mb_rte_aesni_mb_pmd.c.o' -MF 'drivers/a715181@@tmp_rte_pmd_aesni_mb at sta/crypto_aesni_mb_rte_aesni_mb_pmd.c.o.d' -o 'drivers/a715181@@tmp_rte_pmd_aesni_mb at sta/crypto_aesni_mb_rte_aesni_mb_pmd.c.o' -c ../drivers/crypto/aesni_mb/rte_aesni_mb_pmd.c
In file included from ../drivers/crypto/aesni_mb/rte_aesni_mb_pmd.c:17:
../drivers/crypto/aesni_mb/aesni_mb_pmd_private.h:60:3: error: subscripted value is neither array nor pointer nor vector
   [IMB_AUTH_SNOW3G_UIA2_BITLEN] = 16
   ^
../drivers/crypto/aesni_mb/aesni_mb_pmd_private.h:61:3: error: subscripted value is neither array nor pointer nor vector
   [IMB_AUTH_KASUMI_UIA1]  = 16
   ^
../drivers/crypto/aesni_mb/aesni_mb_pmd_private.h:96:3: error: subscripted value is neither array nor pointer nor vector
   [IMB_AUTH_SNOW3G_UIA2_BITLEN] = 4
   ^
../drivers/crypto/aesni_mb/aesni_mb_pmd_private.h:97:3: error: subscripted value is neither array nor pointer nor vector
   [IMB_AUTH_KASUMI_UIA1]  = 4
   ^
../drivers/crypto/aesni_mb/aesni_mb_pmd_private.h:95:32: error: initialization of ‘unsigned int’ from ‘const unsigned int *’ makes integer from pointer without a cast [-Werror=int-conversion]
   [IMB_AUTH_ZUC_EIA3_BITLEN] = 4
                                ^
../drivers/crypto/aesni_mb/aesni_mb_pmd_private.h:95:32: note: (near initialization for ‘auth_truncated_digest_byte_lengths[20]’)
../drivers/crypto/aesni_mb/aesni_mb_pmd_private.h:95:32: error: initializer element is not constant
../drivers/crypto/aesni_mb/aesni_mb_pmd_private.h:95:32: note: (near initialization for ‘auth_truncated_digest_byte_lengths[20]’)
../drivers/crypto/aesni_mb/aesni_mb_pmd_private.h:133:3: error: subscripted value is neither array nor pointer nor vector
   [IMB_AUTH_SNOW3G_UIA2_BITLEN] = 4
   ^
../drivers/crypto/aesni_mb/aesni_mb_pmd_private.h:134:3: error: subscripted value is neither array nor pointer nor vector
   [IMB_AUTH_KASUMI_UIA1]  = 4
   ^
../drivers/crypto/aesni_mb/aesni_mb_pmd_private.h:132:32: error: initialization of ‘unsigned int’ from ‘const unsigned int *’ makes integer from pointer without a cast [-Werror=int-conversion]
   [IMB_AUTH_ZUC_EIA3_BITLEN] = 4
                                ^
../drivers/crypto/aesni_mb/aesni_mb_pmd_private.h:132:32: note: (near initialization for ‘auth_digest_byte_lengths[20]’)
../drivers/crypto/aesni_mb/aesni_mb_pmd_private.h:132:32: error: initializer element is not constant
../drivers/crypto/aesni_mb/aesni_mb_pmd_private.h:132:32: note: (near initialization for ‘auth_digest_byte_lengths[20]’)
cc1: all warnings being treated as errors
[1764/2578] Generating rte_rawdev_octeontx2_ep.sym_chk with a meson_exe.py custom command.
[1765/2578] Compiling C object 'drivers/a715181@@tmp_rte_pmd_caam_jr at sta/crypto_caam_jr_caam_jr_hw.c.o'.
[1766/2578] Compiling C object 'drivers/a715181@@tmp_rte_pmd_caam_jr at sta/crypto_caam_jr_caam_jr_capabilities.c.o'.
[1767/2578] Compiling C object 'drivers/a715181@@tmp_rte_pmd_caam_jr at sta/crypto_caam_jr_caam_jr_uio.c.o'.
[1768/2578] Generating rte_rawdev_skeleton.sym_chk with a meson_exe.py custom command.
[1769/2578] Generating rte_rawdev_ntb.sym_chk with a meson_exe.py custom command.
[1770/2578] Compiling C object 'drivers/a715181@@tmp_rte_pmd_aesni_gcm at sta/crypto_aesni_gcm_aesni_gcm_pmd.c.o'.
[1771/2578] Compiling C object 'drivers/a715181@@tmp_rte_pmd_caam_jr at sta/crypto_caam_jr_caam_jr.c.o'.
ninja: build stopped: subcommand failed




*Build Failed #3:
OS: CENTOS82-64
Target: x86_64-clang-static
FAILED: drivers/a715181@@tmp_rte_pmd_aesni_mb at sta/crypto_aesni_mb_rte_aesni_mb_pmd_ops.c.o 
clang -Idrivers/a715181@@tmp_rte_pmd_aesni_mb at sta -Idrivers -I../drivers -Idrivers/crypto/aesni_mb -I../drivers/crypto/aesni_mb -Ilib/librte_cryptodev -I../lib/librte_cryptodev -I. -I../ -Iconfig -I../config -Ilib/librte_eal/include -I../lib/librte_eal/include -Ilib/librte_eal/linux/include -I../lib/librte_eal/linux/include -Ilib/librte_eal/x86/include -I../lib/librte_eal/x86/include -Ilib/librte_eal/common -I../lib/librte_eal/common -Ilib/librte_eal -I../lib/librte_eal -Ilib/librte_kvargs -I../lib/librte_kvargs -Ilib/librte_telemetry/../librte_metrics -I../lib/librte_telemetry/../librte_metrics -Ilib/librte_telemetry -I../lib/librte_telemetry -Ilib/librte_mbuf -I../lib/librte_mbuf -Ilib/librte_mempool -I../lib/librte_mempool -Ilib/librte_ring -I../lib/librte_ring -Idrivers/bus/vdev -I../drivers/bus/vdev -Ilib/librte_net -I../lib/librte_net -Ilib/librte_security -I../lib/librte_security -Xclang -fcolor-diagnostics -pipe -D_FILE_OFFSET_BITS=64 -Wall -Winvalid-pch -Werror -O3 -include rte_config.h -Wextra -Wcast-qual -Wdeprecated -Wformat-nonliteral -Wformat-security -Wmissing-declarations -Wmissing-prototypes -Wnested-externs -Wold-style-definition -Wpointer-arith -Wsign-compare -Wstrict-prototypes -Wundef -Wwrite-strings -Wno-address-of-packed-member -Wno-missing-field-initializers -D_GNU_SOURCE -fPIC -march=native -mno-avx512f -DALLOW_EXPERIMENTAL_API -DALLOW_INTERNAL_API -MD -MQ 'drivers/a715181@@tmp_rte_pmd_aesni_mb at sta/crypto_aesni_mb_rte_aesni_mb_pmd_ops.c.o' -MF 'drivers/a715181@@tmp_rte_pmd_aesni_mb at sta/crypto_aesni_mb_rte_aesni_mb_pmd_ops.c.o.d' -o 'drivers/a715181@@tmp_rte_pmd_aesni_mb at sta/crypto_aesni_mb_rte_aesni_mb_pmd_ops.c.o' -c ../drivers/crypto/aesni_mb/rte_aesni_mb_pmd_ops.c
In file included from ../drivers/crypto/aesni_mb/rte_aesni_mb_pmd_ops.c:13:
../drivers/crypto/aesni_mb/aesni_mb_pmd_private.h:60:3: error: subscripted value is not an array, pointer, or vector
                [IMB_AUTH_SNOW3G_UIA2_BITLEN]   = 16
                ^~~~~~~~~~~~~~~~~~~~~~~~~~~~
../drivers/crypto/aesni_mb/aesni_mb_pmd_private.h:61:3: error: subscripted value is not an array, pointer, or vector
                [IMB_AUTH_KASUMI_UIA1]          = 16
                ^~~~~~~~~~~~~~~~~~~~~
../drivers/crypto/aesni_mb/aesni_mb_pmd_private.h:96:3: error: subscripted value is not an array, pointer, or vector
                [IMB_AUTH_SNOW3G_UIA2_BITLEN]   = 4
                ^~~~~~~~~~~~~~~~~~~~~~~~~~~~
../drivers/crypto/aesni_mb/aesni_mb_pmd_private.h:97:3: error: subscripted value is not an array, pointer, or vector
                [IMB_AUTH_KASUMI_UIA1]          = 4
                ^~~~~~~~~~~~~~~~~~~~~
../drivers/crypto/aesni_mb/aesni_mb_pmd_private.h:133:3: error: subscripted value is not an array, pointer, or vector
                [IMB_AUTH_SNOW3G_UIA2_BITLEN]   = 4
                ^~~~~~~~~~~~~~~~~~~~~~~~~~~~
../drivers/crypto/aesni_mb/aesni_mb_pmd_private.h:134:3: error: subscripted value is not an array, pointer, or vector
                [IMB_AUTH_KASUMI_UIA1]          = 4
                ^~~~~~~~~~~~~~~~~~~~~
6 errors generated.
[1765/2578] Compiling C object 'drivers/a715181@@rte_rawdev_skeleton at sha/meson-generated_.._rte_rawdev_skeleton.pmd.c.o'.
[1766/2578] Compiling C object 'drivers/a715181@@tmp_rte_pmd_aesni_mb at sta/crypto_aesni_mb_rte_aesni_mb_pmd.c.o'.
FAILED: drivers/a715181@@tmp_rte_pmd_aesni_mb at sta/crypto_aesni_mb_rte_aesni_mb_pmd.c.o 
clang -Idrivers/a715181@@tmp_rte_pmd_aesni_mb at sta -Idrivers -I../drivers -Idrivers/crypto/aesni_mb -I../drivers/crypto/aesni_mb -Ilib/librte_cryptodev -I../lib/librte_cryptodev -I. -I../ -Iconfig -I../config -Ilib/librte_eal/include -I../lib/librte_eal/include -Ilib/librte_eal/linux/include -I../lib/librte_eal/linux/include -Ilib/librte_eal/x86/include -I../lib/librte_eal/x86/include -Ilib/librte_eal/common -I../lib/librte_eal/common -Ilib/librte_eal -I../lib/librte_eal -Ilib/librte_kvargs -I../lib/librte_kvargs -Ilib/librte_telemetry/../librte_metrics -I../lib/librte_telemetry/../librte_metrics -Ilib/librte_telemetry -I../lib/librte_telemetry -Ilib/librte_mbuf -I../lib/librte_mbuf -Ilib/librte_mempool -I../lib/librte_mempool -Ilib/librte_ring -I../lib/librte_ring -Idrivers/bus/vdev -I../drivers/bus/vdev -Ilib/librte_net -I../lib/librte_net -Ilib/librte_security -I../lib/librte_security -Xclang -fcolor-diagnostics -pipe -D_FILE_OFFSET_BITS=64 -Wall -Winvalid-pch -Werror -O3 -include rte_config.h -Wextra -Wcast-qual -Wdeprecated -Wformat-nonliteral -Wformat-security -Wmissing-declarations -Wmissing-prototypes -Wnested-externs -Wold-style-definition -Wpointer-arith -Wsign-compare -Wstrict-prototypes -Wundef -Wwrite-strings -Wno-address-of-packed-member -Wno-missing-field-initializers -D_GNU_SOURCE -fPIC -march=native -mno-avx512f -DALLOW_EXPERIMENTAL_API -DALLOW_INTERNAL_API -MD -MQ 'drivers/a715181@@tmp_rte_pmd_aesni_mb at sta/crypto_aesni_mb_rte_aesni_mb_pmd.c.o' -MF 'drivers/a715181@@tmp_rte_pmd_aesni_mb at sta/crypto_aesni_mb_rte_aesni_mb_pmd.c.o.d' -o 'drivers/a715181@@tmp_rte_pmd_aesni_mb at sta/crypto_aesni_mb_rte_aesni_mb_pmd.c.o' -c ../drivers/crypto/aesni_mb/rte_aesni_mb_pmd.c
In file included from ../drivers/crypto/aesni_mb/rte_aesni_mb_pmd.c:17:
../drivers/crypto/aesni_mb/aesni_mb_pmd_private.h:60:3: error: subscripted value is not an array, pointer, or vector
                [IMB_AUTH_SNOW3G_UIA2_BITLEN]   = 16
                ^~~~~~~~~~~~~~~~~~~~~~~~~~~~
../drivers/crypto/aesni_mb/aesni_mb_pmd_private.h:61:3: error: subscripted value is not an array, pointer, or vector
                [IMB_AUTH_KASUMI_UIA1]          = 16
                ^~~~~~~~~~~~~~~~~~~~~
../drivers/crypto/aesni_mb/aesni_mb_pmd_private.h:96:3: error: subscripted value is not an array, pointer, or vector
                [IMB_AUTH_SNOW3G_UIA2_BITLEN]   = 4
                ^~~~~~~~~~~~~~~~~~~~~~~~~~~~
../drivers/crypto/aesni_mb/aesni_mb_pmd_private.h:97:3: error: subscripted value is not an array, pointer, or vector
                [IMB_AUTH_KASUMI_UIA1]          = 4
                ^~~~~~~~~~~~~~~~~~~~~
../drivers/crypto/aesni_mb/aesni_mb_pmd_private.h:133:3: error: subscripted value is not an array, pointer, or vector
                [IMB_AUTH_SNOW3G_UIA2_BITLEN]   = 4
                ^~~~~~~~~~~~~~~~~~~~~~~~~~~~
../drivers/crypto/aesni_mb/aesni_mb_pmd_private.h:134:3: error: subscripted value is not an array, pointer, or vector
                [IMB_AUTH_KASUMI_UIA1]          = 4
                ^~~~~~~~~~~~~~~~~~~~~
6 errors generated.
[1767/2578] Generating rte_rawdev_octeontx2_ep.sym_chk with a meson_exe.py custom command.
[1768/2578] Generating rte_rawdev_skeleton.sym_chk with a meson_exe.py custom command.
[1769/2578] Compiling C object 'drivers/a715181@@tmp_rte_pmd_caam_jr at sta/crypto_caam_jr_caam_jr_capabilities.c.o'.
[1770/2578] Compiling C object 'drivers/a715181@@tmp_rte_pmd_caam_jr at sta/crypto_caam_jr_caam_jr_hw.c.o'.
[1771/2578] Compiling C object 'drivers/a715181@@tmp_rte_pmd_caam_jr at sta/crypto_caam_jr_caam_jr_uio.c.o'.
[1772/2578] Compiling C object 'drivers/a715181@@tmp_rte_pmd_aesni_gcm at sta/crypto_aesni_gcm_aesni_gcm_pmd.c.o'.
[1773/2578] Compiling C object 'drivers/a715181@@tmp_rte_pmd_caam_jr at sta/crypto_caam_jr_caam_jr.c.o'.
ninja: build stopped: subcommand failed




*Build Failed #4:
OS: CENTOS82-64
Target: x86_64-icc-static
FAILED: drivers/a715181@@tmp_rte_pmd_aesni_mb at sta/crypto_aesni_mb_rte_aesni_mb_pmd_ops.c.o 
icc -Idrivers/a715181@@tmp_rte_pmd_aesni_mb at sta -Idrivers -I../drivers -Idrivers/crypto/aesni_mb -I../drivers/crypto/aesni_mb -Ilib/librte_cryptodev -I../lib/librte_cryptodev -I. -I../ -Iconfig -I../config -Ilib/librte_eal/include -I../lib/librte_eal/include -Ilib/librte_eal/linux/include -I../lib/librte_eal/linux/include -Ilib/librte_eal/x86/include -I../lib/librte_eal/x86/include -Ilib/librte_eal/common -I../lib/librte_eal/common -Ilib/librte_eal -I../lib/librte_eal -Ilib/librte_kvargs -I../lib/librte_kvargs -Ilib/librte_telemetry/../librte_metrics -I../lib/librte_telemetry/../librte_metrics -Ilib/librte_telemetry -I../lib/librte_telemetry -Ilib/librte_mbuf -I../lib/librte_mbuf -Ilib/librte_mempool -I../lib/librte_mempool -Ilib/librte_ring -I../lib/librte_ring -Idrivers/bus/vdev -I../drivers/bus/vdev -Ilib/librte_net -I../lib/librte_net -Ilib/librte_security -I../lib/librte_security -pipe -D_FILE_OFFSET_BITS=64 -Wall -w3 -diag-disable:remark -Werror -O3 -include rte_config.h -Wextra -Wcast-qual -Wdeprecated -Wformat-security -Wmissing-declarations -Wmissing-prototypes -Wold-style-definition -Wpointer-arith -Wsign-compare -Wstrict-prototypes -Wundef -Wwrite-strings -Wno-missing-field-initializers -diag-disable=188 -diag-disable=2203 -diag-disable=2279 -diag-disable=2557 -diag-disable=3179 -diag-disable=3656 -D_GNU_SOURCE -fPIC -march=native -mno-avx512f -DALLOW_EXPERIMENTAL_API -DALLOW_INTERNAL_API -MD -MQ 'drivers/a715181@@tmp_rte_pmd_aesni_mb at sta/crypto_aesni_mb_rte_aesni_mb_pmd_ops.c.o' -MF 'drivers/a715181@@tmp_rte_pmd_aesni_mb at sta/crypto_aesni_mb_rte_aesni_mb_pmd_ops.c.o.d' -o 'drivers/a715181@@tmp_rte_pmd_aesni_mb at sta/crypto_aesni_mb_rte_aesni_mb_pmd_ops.c.o' -c ../drivers/crypto/aesni_mb/rte_aesni_mb_pmd_ops.c
In file included from ../drivers/crypto/aesni_mb/rte_aesni_mb_pmd_ops.c(13):
../drivers/crypto/aesni_mb/aesni_mb_pmd_private.h(60): error: expression must have pointer-to-object type
  		[IMB_AUTH_SNOW3G_UIA2_BITLEN]	= 16
  		 ^

In file included from ../drivers/crypto/aesni_mb/rte_aesni_mb_pmd_ops.c(13):
../drivers/crypto/aesni_mb/aesni_mb_pmd_private.h(60): error: this operator is not allowed in a constant expression
  		[IMB_AUTH_SNOW3G_UIA2_BITLEN]	= 16
  		                             	^

In file included from ../drivers/crypto/aesni_mb/rte_aesni_mb_pmd_ops.c(13):
../drivers/crypto/aesni_mb/aesni_mb_pmd_private.h(61): error: expression must have pointer-to-object type
  		[IMB_AUTH_KASUMI_UIA1]		= 16
  		 ^

In file included from ../drivers/crypto/aesni_mb/rte_aesni_mb_pmd_ops.c(13):
../drivers/crypto/aesni_mb/aesni_mb_pmd_private.h(61): error: this operator is not allowed in a constant expression
  		[IMB_AUTH_KASUMI_UIA1]		= 16
  		                      		^

In file included from ../drivers/crypto/aesni_mb/rte_aesni_mb_pmd_ops.c(13):
../drivers/crypto/aesni_mb/aesni_mb_pmd_private.h(96): error: expression must have pointer-to-object type
  		[IMB_AUTH_SNOW3G_UIA2_BITLEN]	= 4
  		 ^

In file included from ../drivers/crypto/aesni_mb/rte_aesni_mb_pmd_ops.c(13):
../drivers/crypto/aesni_mb/aesni_mb_pmd_private.h(96): error: this operator is not allowed in a constant expression
  		[IMB_AUTH_SNOW3G_UIA2_BITLEN]	= 4
  		                             	^

In file included from ../drivers/crypto/aesni_mb/rte_aesni_mb_pmd_ops.c(13):
../drivers/crypto/aesni_mb/aesni_mb_pmd_private.h(97): error: expression must have pointer-to-object type
  		[IMB_AUTH_KASUMI_UIA1]		= 4
  		 ^

In file included from ../drivers/crypto/aesni_mb/rte_aesni_mb_pmd_ops.c(13):
../drivers/crypto/aesni_mb/aesni_mb_pmd_private.h(97): error: this operator is not allowed in a constant expression
  		[IMB_AUTH_KASUMI_UIA1]		= 4
  		                      		^

In file included from ../drivers/crypto/aesni_mb/rte_aesni_mb_pmd_ops.c(13):
../drivers/crypto/aesni_mb/aesni_mb_pmd_private.h(133): error: expression must have pointer-to-object type
  		[IMB_AUTH_SNOW3G_UIA2_BITLEN]	= 4
  		 ^

In file included from ../drivers/crypto/aesni_mb/rte_aesni_mb_pmd_ops.c(13):
../drivers/crypto/aesni_mb/aesni_mb_pmd_private.h(133): error: this operator is not allowed in a constant expression
  		[IMB_AUTH_SNOW3G_UIA2_BITLEN]	= 4
  		                             	^

In file included from ../drivers/crypto/aesni_mb/rte_aesni_mb_pmd_ops.c(13):
../drivers/crypto/aesni_mb/aesni_mb_pmd_private.h(134): error: expression must have pointer-to-object type
  		[IMB_AUTH_KASUMI_UIA1]		= 4
  		 ^

In file included from ../drivers/crypto/aesni_mb/rte_aesni_mb_pmd_ops.c(13):
../drivers/crypto/aesni_mb/aesni_mb_pmd_private.h(134): error: this operator is not allowed in a constant expression
  		[IMB_AUTH_KASUMI_UIA1]		= 4
  		                      		^

compilation aborted for ../drivers/crypto/aesni_mb/rte_aesni_mb_pmd_ops.c (code 2)
[1751/2578] Compiling C object 'drivers/a715181@@tmp_rte_pmd_aesni_mb at sta/crypto_aesni_mb_rte_aesni_mb_pmd.c.o'.
FAILED: drivers/a715181@@tmp_rte_pmd_aesni_mb at sta/crypto_aesni_mb_rte_aesni_mb_pmd.c.o 
icc -Idrivers/a715181@@tmp_rte_pmd_aesni_mb at sta -Idrivers -I../drivers -Idrivers/crypto/aesni_mb -I../drivers/crypto/aesni_mb -Ilib/librte_cryptodev -I../lib/librte_cryptodev -I. -I../ -Iconfig -I../config -Ilib/librte_eal/include -I../lib/librte_eal/include -Ilib/librte_eal/linux/include -I../lib/librte_eal/linux/include -Ilib/librte_eal/x86/include -I../lib/librte_eal/x86/include -Ilib/librte_eal/common -I../lib/librte_eal/common -Ilib/librte_eal -I../lib/librte_eal -Ilib/librte_kvargs -I../lib/librte_kvargs -Ilib/librte_telemetry/../librte_metrics -I../lib/librte_telemetry/../librte_metrics -Ilib/librte_telemetry -I../lib/librte_telemetry -Ilib/librte_mbuf -I../lib/librte_mbuf -Ilib/librte_mempool -I../lib/librte_mempool -Ilib/librte_ring -I../lib/librte_ring -Idrivers/bus/vdev -I../drivers/bus/vdev -Ilib/librte_net -I../lib/librte_net -Ilib/librte_security -I../lib/librte_security -pipe -D_FILE_OFFSET_BITS=64 -Wall -w3 -diag-disable:remark -Werror -O3 -include rte_config.h -Wextra -Wcast-qual -Wdeprecated -Wformat-security -Wmissing-declarations -Wmissing-prototypes -Wold-style-definition -Wpointer-arith -Wsign-compare -Wstrict-prototypes -Wundef -Wwrite-strings -Wno-missing-field-initializers -diag-disable=188 -diag-disable=2203 -diag-disable=2279 -diag-disable=2557 -diag-disable=3179 -diag-disable=3656 -D_GNU_SOURCE -fPIC -march=native -mno-avx512f -DALLOW_EXPERIMENTAL_API -DALLOW_INTERNAL_API -MD -MQ 'drivers/a715181@@tmp_rte_pmd_aesni_mb at sta/crypto_aesni_mb_rte_aesni_mb_pmd.c.o' -MF 'drivers/a715181@@tmp_rte_pmd_aesni_mb at sta/crypto_aesni_mb_rte_aesni_mb_pmd.c.o.d' -o 'drivers/a715181@@tmp_rte_pmd_aesni_mb at sta/crypto_aesni_mb_rte_aesni_mb_pmd.c.o' -c ../drivers/crypto/aesni_mb/rte_aesni_mb_pmd.c
In file included from ../drivers/crypto/aesni_mb/rte_aesni_mb_pmd.c(17):
../drivers/crypto/aesni_mb/aesni_mb_pmd_private.h(60): error: expression must have pointer-to-object type
  		[IMB_AUTH_SNOW3G_UIA2_BITLEN]	= 16
  		 ^

In file included from ../drivers/crypto/aesni_mb/rte_aesni_mb_pmd.c(17):
../drivers/crypto/aesni_mb/aesni_mb_pmd_private.h(60): error: this operator is not allowed in a constant expression
  		[IMB_AUTH_SNOW3G_UIA2_BITLEN]	= 16
  		                             	^

In file included from ../drivers/crypto/aesni_mb/rte_aesni_mb_pmd.c(17):
../drivers/crypto/aesni_mb/aesni_mb_pmd_private.h(61): error: expression must have pointer-to-object type
  		[IMB_AUTH_KASUMI_UIA1]		= 16
  		 ^

In file included from ../drivers/crypto/aesni_mb/rte_aesni_mb_pmd.c(17):
../drivers/crypto/aesni_mb/aesni_mb_pmd_private.h(61): error: this operator is not allowed in a constant expression
  		[IMB_AUTH_KASUMI_UIA1]		= 16
  		                      		^

In file included from ../drivers/crypto/aesni_mb/rte_aesni_mb_pmd.c(17):
../drivers/crypto/aesni_mb/aesni_mb_pmd_private.h(96): error: expression must have pointer-to-object type
  		[IMB_AUTH_SNOW3G_UIA2_BITLEN]	= 4
  		 ^

In file included from ../drivers/crypto/aesni_mb/rte_aesni_mb_pmd.c(17):
../drivers/crypto/aesni_mb/aesni_mb_pmd_private.h(96): error: this operator is not allowed in a constant expression
  		[IMB_AUTH_SNOW3G_UIA2_BITLEN]	= 4
  		                             	^

In file included from ../drivers/crypto/aesni_mb/rte_aesni_mb_pmd.c(17):
../drivers/crypto/aesni_mb/aesni_mb_pmd_private.h(97): error: expression must have pointer-to-object type
  		[IMB_AUTH_KASUMI_UIA1]		= 4
  		 ^

In file included from ../drivers/crypto/aesni_mb/rte_aesni_mb_pmd.c(17):
../drivers/crypto/aesni_mb/aesni_mb_pmd_private.h(97): error: this operator is not allowed in a constant expression
  		[IMB_AUTH_KASUMI_UIA1]		= 4
  		                      		^

In file included from ../drivers/crypto/aesni_mb/rte_aesni_mb_pmd.c(17):
../drivers/crypto/aesni_mb/aesni_mb_pmd_private.h(133): error: expression must have pointer-to-object type
  		[IMB_AUTH_SNOW3G_UIA2_BITLEN]	= 4
  		 ^

In file included from ../drivers/crypto/aesni_mb/rte_aesni_mb_pmd.c(17):
../drivers/crypto/aesni_mb/aesni_mb_pmd_private.h(133): error: this operator is not allowed in a constant expression
  		[IMB_AUTH_SNOW3G_UIA2_BITLEN]	= 4
  		                             	^

In file included from ../drivers/crypto/aesni_mb/rte_aesni_mb_pmd.c(17):
../drivers/crypto/aesni_mb/aesni_mb_pmd_private.h(134): error: expression must have pointer-to-object type
  		[IMB_AUTH_KASUMI_UIA1]		= 4
  		 ^

In file included from ../drivers/crypto/aesni_mb/rte_aesni_mb_pmd.c(17):
../drivers/crypto/aesni_mb/aesni_mb_pmd_private.h(134): error: this operator is not allowed in a constant expression
  		[IMB_AUTH_KASUMI_UIA1]		= 4
  		                      		^

compilation aborted for ../drivers/crypto/aesni_mb/rte_aesni_mb_pmd.c (code 2)
[1752/2578] Linking target drivers/librte_pmd_vmxnet3.so.21.0.
[1753/2578] Compiling C object 'drivers/a715181@@tmp_rte_pmd_caam_jr at sta/crypto_caam_jr_caam_jr_capabilities.c.o'.
[1754/2578] Generating rte_rawdev_octeontx2_ep.sym_chk with a meson_exe.py custom command.
[1755/2578] Generating rte_rawdev_skeleton.sym_chk with a meson_exe.py custom command.
[1756/2578] Compiling C object 'drivers/a715181@@rte_rawdev_ntb at sta/meson-generated_.._rte_rawdev_ntb.pmd.c.o'.
[1757/2578] Compiling C object 'drivers/a715181@@tmp_rte_pmd_aesni_gcm at sta/crypto_aesni_gcm_aesni_gcm_pmd.c.o'.
[1758/2578] Compiling C object 'drivers/a715181@@tmp_rte_pmd_caam_jr at sta/crypto_caam_jr_caam_jr_hw.c.o'.
[1759/2578] Compiling C object 'drivers/a715181@@tmp_rte_pmd_octeontx2 at sta/net_octeontx2_otx2_tx.c.o'.
ninja: build stopped: subcommand failed




*Build Failed #5:
OS: CENTOS82-64
Target: x86_64-gcc-shared
FAILED: drivers/a715181@@tmp_rte_pmd_aesni_mb at sta/crypto_aesni_mb_rte_aesni_mb_pmd_ops.c.o 
gcc -Idrivers/a715181@@tmp_rte_pmd_aesni_mb at sta -Idrivers -I../drivers -Idrivers/crypto/aesni_mb -I../drivers/crypto/aesni_mb -Ilib/librte_cryptodev -I../lib/librte_cryptodev -I. -I../ -Iconfig -I../config -Ilib/librte_eal/include -I../lib/librte_eal/include -Ilib/librte_eal/linux/include -I../lib/librte_eal/linux/include -Ilib/librte_eal/x86/include -I../lib/librte_eal/x86/include -Ilib/librte_eal/common -I../lib/librte_eal/common -Ilib/librte_eal -I../lib/librte_eal -Ilib/librte_kvargs -I../lib/librte_kvargs -Ilib/librte_telemetry/../librte_metrics -I../lib/librte_telemetry/../librte_metrics -Ilib/librte_telemetry -I../lib/librte_telemetry -Ilib/librte_mbuf -I../lib/librte_mbuf -Ilib/librte_mempool -I../lib/librte_mempool -Ilib/librte_ring -I../lib/librte_ring -Idrivers/bus/vdev -I../drivers/bus/vdev -Ilib/librte_net -I../lib/librte_net -Ilib/librte_security -I../lib/librte_security -fdiagnostics-color=always -pipe -D_FILE_OFFSET_BITS=64 -Wall -Winvalid-pch -Werror -O3 -include rte_config.h -Wextra -Wcast-qual -Wdeprecated -Wformat-nonliteral -Wformat-security -Wmissing-declarations -Wmissing-prototypes -Wnested-externs -Wold-style-definition -Wpointer-arith -Wsign-compare -Wstrict-prototypes -Wundef -Wwrite-strings -Wno-packed-not-aligned -Wno-missing-field-initializers -D_GNU_SOURCE -fPIC -march=native -mno-avx512f -DALLOW_EXPERIMENTAL_API -DALLOW_INTERNAL_API -Wno-format-truncation -MD -MQ 'drivers/a715181@@tmp_rte_pmd_aesni_mb at sta/crypto_aesni_mb_rte_aesni_mb_pmd_ops.c.o' -MF 'drivers/a715181@@tmp_rte_pmd_aesni_mb at sta/crypto_aesni_mb_rte_aesni_mb_pmd_ops.c.o.d' -o 'drivers/a715181@@tmp_rte_pmd_aesni_mb at sta/crypto_aesni_mb_rte_aesni_mb_pmd_ops.c.o' -c ../drivers/crypto/aesni_mb/rte_aesni_mb_pmd_ops.c
In file included from ../drivers/crypto/aesni_mb/rte_aesni_mb_pmd_ops.c:13:
../drivers/crypto/aesni_mb/aesni_mb_pmd_private.h:60:3: error: subscripted value is neither array nor pointer nor vector
   [IMB_AUTH_SNOW3G_UIA2_BITLEN] = 16
   ^
../drivers/crypto/aesni_mb/aesni_mb_pmd_private.h:61:3: error: subscripted value is neither array nor pointer nor vector
   [IMB_AUTH_KASUMI_UIA1]  = 16
   ^
../drivers/crypto/aesni_mb/aesni_mb_pmd_private.h:96:3: error: subscripted value is neither array nor pointer nor vector
   [IMB_AUTH_SNOW3G_UIA2_BITLEN] = 4
   ^
../drivers/crypto/aesni_mb/aesni_mb_pmd_private.h:97:3: error: subscripted value is neither array nor pointer nor vector
   [IMB_AUTH_KASUMI_UIA1]  = 4
   ^
../drivers/crypto/aesni_mb/aesni_mb_pmd_private.h:95:32: error: initialization of ‘unsigned int’ from ‘const unsigned int *’ makes integer from pointer without a cast [-Werror=int-conversion]
   [IMB_AUTH_ZUC_EIA3_BITLEN] = 4
                                ^
../drivers/crypto/aesni_mb/aesni_mb_pmd_private.h:95:32: note: (near initialization for ‘auth_truncated_digest_byte_lengths[20]’)
../drivers/crypto/aesni_mb/aesni_mb_pmd_private.h:95:32: error: initializer element is not constant
../drivers/crypto/aesni_mb/aesni_mb_pmd_private.h:95:32: note: (near initialization for ‘auth_truncated_digest_byte_lengths[20]’)
../drivers/crypto/aesni_mb/aesni_mb_pmd_private.h:133:3: error: subscripted value is neither array nor pointer nor vector
   [IMB_AUTH_SNOW3G_UIA2_BITLEN] = 4
   ^
../drivers/crypto/aesni_mb/aesni_mb_pmd_private.h:134:3: error: subscripted value is neither array nor pointer nor vector
   [IMB_AUTH_KASUMI_UIA1]  = 4
   ^
../drivers/crypto/aesni_mb/aesni_mb_pmd_private.h:132:32: error: initialization of ‘unsigned int’ from ‘const unsigned int *’ makes integer from pointer without a cast [-Werror=int-conversion]
   [IMB_AUTH_ZUC_EIA3_BITLEN] = 4
                                ^
../drivers/crypto/aesni_mb/aesni_mb_pmd_private.h:132:32: note: (near initialization for ‘auth_digest_byte_lengths[20]’)
../drivers/crypto/aesni_mb/aesni_mb_pmd_private.h:132:32: error: initializer element is not constant
../drivers/crypto/aesni_mb/aesni_mb_pmd_private.h:132:32: note: (near initialization for ‘auth_digest_byte_lengths[20]’)
cc1: all warnings being treated as errors
[1796/2607] Compiling C object 'drivers/a715181@@tmp_rte_pmd_aesni_mb at sta/crypto_aesni_mb_rte_aesni_mb_pmd.c.o'.
FAILED: drivers/a715181@@tmp_rte_pmd_aesni_mb at sta/crypto_aesni_mb_rte_aesni_mb_pmd.c.o 
gcc -Idrivers/a715181@@tmp_rte_pmd_aesni_mb at sta -Idrivers -I../drivers -Idrivers/crypto/aesni_mb -I../drivers/crypto/aesni_mb -Ilib/librte_cryptodev -I../lib/librte_cryptodev -I. -I../ -Iconfig -I../config -Ilib/librte_eal/include -I../lib/librte_eal/include -Ilib/librte_eal/linux/include -I../lib/librte_eal/linux/include -Ilib/librte_eal/x86/include -I../lib/librte_eal/x86/include -Ilib/librte_eal/common -I../lib/librte_eal/common -Ilib/librte_eal -I../lib/librte_eal -Ilib/librte_kvargs -I../lib/librte_kvargs -Ilib/librte_telemetry/../librte_metrics -I../lib/librte_telemetry/../librte_metrics -Ilib/librte_telemetry -I../lib/librte_telemetry -Ilib/librte_mbuf -I../lib/librte_mbuf -Ilib/librte_mempool -I../lib/librte_mempool -Ilib/librte_ring -I../lib/librte_ring -Idrivers/bus/vdev -I../drivers/bus/vdev -Ilib/librte_net -I../lib/librte_net -Ilib/librte_security -I../lib/librte_security -fdiagnostics-color=always -pipe -D_FILE_OFFSET_BITS=64 -Wall -Winvalid-pch -Werror -O3 -include rte_config.h -Wextra -Wcast-qual -Wdeprecated -Wformat-nonliteral -Wformat-security -Wmissing-declarations -Wmissing-prototypes -Wnested-externs -Wold-style-definition -Wpointer-arith -Wsign-compare -Wstrict-prototypes -Wundef -Wwrite-strings -Wno-packed-not-aligned -Wno-missing-field-initializers -D_GNU_SOURCE -fPIC -march=native -mno-avx512f -DALLOW_EXPERIMENTAL_API -DALLOW_INTERNAL_API -Wno-format-truncation -MD -MQ 'drivers/a715181@@tmp_rte_pmd_aesni_mb at sta/crypto_aesni_mb_rte_aesni_mb_pmd.c.o' -MF 'drivers/a715181@@tmp_rte_pmd_aesni_mb at sta/crypto_aesni_mb_rte_aesni_mb_pmd.c.o.d' -o 'drivers/a715181@@tmp_rte_pmd_aesni_mb at sta/crypto_aesni_mb_rte_aesni_mb_pmd.c.o' -c ../drivers/crypto/aesni_mb/rte_aesni_mb_pmd.c
In file included from ../drivers/crypto/aesni_mb/rte_aesni_mb_pmd.c:17:
../drivers/crypto/aesni_mb/aesni_mb_pmd_private.h:60:3: error: subscripted value is neither array nor pointer nor vector
   [IMB_AUTH_SNOW3G_UIA2_BITLEN] = 16
   ^
../drivers/crypto/aesni_mb/aesni_mb_pmd_private.h:61:3: error: subscripted value is neither array nor pointer nor vector
   [IMB_AUTH_KASUMI_UIA1]  = 16
   ^
../drivers/crypto/aesni_mb/aesni_mb_pmd_private.h:96:3: error: subscripted value is neither array nor pointer nor vector
   [IMB_AUTH_SNOW3G_UIA2_BITLEN] = 4
   ^
../drivers/crypto/aesni_mb/aesni_mb_pmd_private.h:97:3: error: subscripted value is neither array nor pointer nor vector
   [IMB_AUTH_KASUMI_UIA1]  = 4
   ^
../drivers/crypto/aesni_mb/aesni_mb_pmd_private.h:95:32: error: initialization of ‘unsigned int’ from ‘const unsigned int *’ makes integer from pointer without a cast [-Werror=int-conversion]
   [IMB_AUTH_ZUC_EIA3_BITLEN] = 4
                                ^
../drivers/crypto/aesni_mb/aesni_mb_pmd_private.h:95:32: note: (near initialization for ‘auth_truncated_digest_byte_lengths[20]’)
../drivers/crypto/aesni_mb/aesni_mb_pmd_private.h:95:32: error: initializer element is not constant
../drivers/crypto/aesni_mb/aesni_mb_pmd_private.h:95:32: note: (near initialization for ‘auth_truncated_digest_byte_lengths[20]’)
../drivers/crypto/aesni_mb/aesni_mb_pmd_private.h:133:3: error: subscripted value is neither array nor pointer nor vector
   [IMB_AUTH_SNOW3G_UIA2_BITLEN] = 4
   ^
../drivers/crypto/aesni_mb/aesni_mb_pmd_private.h:134:3: error: subscripted value is neither array nor pointer nor vector
   [IMB_AUTH_KASUMI_UIA1]  = 4
   ^
../drivers/crypto/aesni_mb/aesni_mb_pmd_private.h:132:32: error: initialization of ‘unsigned int’ from ‘const unsigned int *’ makes integer from pointer without a cast [-Werror=int-conversion]
   [IMB_AUTH_ZUC_EIA3_BITLEN] = 4
                                ^
../drivers/crypto/aesni_mb/aesni_mb_pmd_private.h:132:32: note: (near initialization for ‘auth_digest_byte_lengths[20]’)
../drivers/crypto/aesni_mb/aesni_mb_pmd_private.h:132:32: error: initializer element is not constant
../drivers/crypto/aesni_mb/aesni_mb_pmd_private.h:132:32: note: (near initialization for ‘auth_digest_byte_lengths[20]’)
cc1: all warnings being treated as errors
[1797/2607] Generating rte_rawdev_octeontx2_ep.sym_chk with a meson_exe.py custom command.
[1798/2607] Generating rte_rawdev_skeleton.sym_chk with a meson_exe.py custom command.
[1799/2607] Compiling C object 'drivers/a715181@@tmp_rte_pmd_caam_jr at sta/crypto_caam_jr_caam_jr_capabilities.c.o'.
[1800/2607] Generating rte_pmd_aesni_gcm.sym_chk with a meson_exe.py custom command.
ninja: build stopped: subcommand failed




*Build Failed #6:
OS: CENTOS82-64
Target: x86_64-gcc-debug
FAILED: drivers/a715181@@tmp_rte_pmd_aesni_mb at sta/crypto_aesni_mb_rte_aesni_mb_pmd.c.o 
gcc -Idrivers/a715181@@tmp_rte_pmd_aesni_mb at sta -Idrivers -I../drivers -Idrivers/crypto/aesni_mb -I../drivers/crypto/aesni_mb -Ilib/librte_cryptodev -I../lib/librte_cryptodev -I. -I../ -Iconfig -I../config -Ilib/librte_eal/include -I../lib/librte_eal/include -Ilib/librte_eal/linux/include -I../lib/librte_eal/linux/include -Ilib/librte_eal/x86/include -I../lib/librte_eal/x86/include -Ilib/librte_eal/common -I../lib/librte_eal/common -Ilib/librte_eal -I../lib/librte_eal -Ilib/librte_kvargs -I../lib/librte_kvargs -Ilib/librte_telemetry/../librte_metrics -I../lib/librte_telemetry/../librte_metrics -Ilib/librte_telemetry -I../lib/librte_telemetry -Ilib/librte_mbuf -I../lib/librte_mbuf -Ilib/librte_mempool -I../lib/librte_mempool -Ilib/librte_ring -I../lib/librte_ring -Idrivers/bus/vdev -I../drivers/bus/vdev -Ilib/librte_net -I../lib/librte_net -Ilib/librte_security -I../lib/librte_security -fdiagnostics-color=always -pipe -D_FILE_OFFSET_BITS=64 -Wall -Winvalid-pch -Werror -O2 -g -include rte_config.h -Wextra -Wcast-qual -Wdeprecated -Wformat-nonliteral -Wformat-security -Wmissing-declarations -Wmissing-prototypes -Wnested-externs -Wold-style-definition -Wpointer-arith -Wsign-compare -Wstrict-prototypes -Wundef -Wwrite-strings -Wno-packed-not-aligned -Wno-missing-field-initializers -D_GNU_SOURCE -fPIC -march=native -mno-avx512f -DALLOW_EXPERIMENTAL_API -DALLOW_INTERNAL_API -Wno-format-truncation -MD -MQ 'drivers/a715181@@tmp_rte_pmd_aesni_mb at sta/crypto_aesni_mb_rte_aesni_mb_pmd.c.o' -MF 'drivers/a715181@@tmp_rte_pmd_aesni_mb at sta/crypto_aesni_mb_rte_aesni_mb_pmd.c.o.d' -o 'drivers/a715181@@tmp_rte_pmd_aesni_mb at sta/crypto_aesni_mb_rte_aesni_mb_pmd.c.o' -c ../drivers/crypto/aesni_mb/rte_aesni_mb_pmd.c
In file included from ../drivers/crypto/aesni_mb/rte_aesni_mb_pmd.c:17:
../drivers/crypto/aesni_mb/aesni_mb_pmd_private.h:60:3: error: subscripted value is neither array nor pointer nor vector
   [IMB_AUTH_SNOW3G_UIA2_BITLEN] = 16
   ^
../drivers/crypto/aesni_mb/aesni_mb_pmd_private.h:61:3: error: subscripted value is neither array nor pointer nor vector
   [IMB_AUTH_KASUMI_UIA1]  = 16
   ^
../drivers/crypto/aesni_mb/aesni_mb_pmd_private.h:96:3: error: subscripted value is neither array nor pointer nor vector
   [IMB_AUTH_SNOW3G_UIA2_BITLEN] = 4
   ^
../drivers/crypto/aesni_mb/aesni_mb_pmd_private.h:97:3: error: subscripted value is neither array nor pointer nor vector
   [IMB_AUTH_KASUMI_UIA1]  = 4
   ^
../drivers/crypto/aesni_mb/aesni_mb_pmd_private.h:95:32: error: initialization of ‘unsigned int’ from ‘const unsigned int *’ makes integer from pointer without a cast [-Werror=int-conversion]
   [IMB_AUTH_ZUC_EIA3_BITLEN] = 4
                                ^
../drivers/crypto/aesni_mb/aesni_mb_pmd_private.h:95:32: note: (near initialization for ‘auth_truncated_digest_byte_lengths[20]’)
../drivers/crypto/aesni_mb/aesni_mb_pmd_private.h:95:32: error: initializer element is not constant
../drivers/crypto/aesni_mb/aesni_mb_pmd_private.h:95:32: note: (near initialization for ‘auth_truncated_digest_byte_lengths[20]’)
../drivers/crypto/aesni_mb/aesni_mb_pmd_private.h:133:3: error: subscripted value is neither array nor pointer nor vector
   [IMB_AUTH_SNOW3G_UIA2_BITLEN] = 4
   ^
../drivers/crypto/aesni_mb/aesni_mb_pmd_private.h:134:3: error: subscripted value is neither array nor pointer nor vector
   [IMB_AUTH_KASUMI_UIA1]  = 4
   ^
../drivers/crypto/aesni_mb/aesni_mb_pmd_private.h:132:32: error: initialization of ‘unsigned int’ from ‘const unsigned int *’ makes integer from pointer without a cast [-Werror=int-conversion]
   [IMB_AUTH_ZUC_EIA3_BITLEN] = 4
                                ^
../drivers/crypto/aesni_mb/aesni_mb_pmd_private.h:132:32: note: (near initialization for ‘auth_digest_byte_lengths[20]’)
../drivers/crypto/aesni_mb/aesni_mb_pmd_private.h:132:32: error: initializer element is not constant
../drivers/crypto/aesni_mb/aesni_mb_pmd_private.h:132:32: note: (near initialization for ‘auth_digest_byte_lengths[20]’)
cc1: all warnings being treated as errors
[1756/2578] Compiling C object 'drivers/a715181@@tmp_rte_pmd_aesni_mb at sta/crypto_aesni_mb_rte_aesni_mb_pmd_ops.c.o'.
FAILED: drivers/a715181@@tmp_rte_pmd_aesni_mb at sta/crypto_aesni_mb_rte_aesni_mb_pmd_ops.c.o 
gcc -Idrivers/a715181@@tmp_rte_pmd_aesni_mb at sta -Idrivers -I../drivers -Idrivers/crypto/aesni_mb -I../drivers/crypto/aesni_mb -Ilib/librte_cryptodev -I../lib/librte_cryptodev -I. -I../ -Iconfig -I../config -Ilib/librte_eal/include -I../lib/librte_eal/include -Ilib/librte_eal/linux/include -I../lib/librte_eal/linux/include -Ilib/librte_eal/x86/include -I../lib/librte_eal/x86/include -Ilib/librte_eal/common -I../lib/librte_eal/common -Ilib/librte_eal -I../lib/librte_eal -Ilib/librte_kvargs -I../lib/librte_kvargs -Ilib/librte_telemetry/../librte_metrics -I../lib/librte_telemetry/../librte_metrics -Ilib/librte_telemetry -I../lib/librte_telemetry -Ilib/librte_mbuf -I../lib/librte_mbuf -Ilib/librte_mempool -I../lib/librte_mempool -Ilib/librte_ring -I../lib/librte_ring -Idrivers/bus/vdev -I../drivers/bus/vdev -Ilib/librte_net -I../lib/librte_net -Ilib/librte_security -I../lib/librte_security -fdiagnostics-color=always -pipe -D_FILE_OFFSET_BITS=64 -Wall -Winvalid-pch -Werror -O2 -g -include rte_config.h -Wextra -Wcast-qual -Wdeprecated -Wformat-nonliteral -Wformat-security -Wmissing-declarations -Wmissing-prototypes -Wnested-externs -Wold-style-definition -Wpointer-arith -Wsign-compare -Wstrict-prototypes -Wundef -Wwrite-strings -Wno-packed-not-aligned -Wno-missing-field-initializers -D_GNU_SOURCE -fPIC -march=native -mno-avx512f -DALLOW_EXPERIMENTAL_API -DALLOW_INTERNAL_API -Wno-format-truncation -MD -MQ 'drivers/a715181@@tmp_rte_pmd_aesni_mb at sta/crypto_aesni_mb_rte_aesni_mb_pmd_ops.c.o' -MF 'drivers/a715181@@tmp_rte_pmd_aesni_mb at sta/crypto_aesni_mb_rte_aesni_mb_pmd_ops.c.o.d' -o 'drivers/a715181@@tmp_rte_pmd_aesni_mb at sta/crypto_aesni_mb_rte_aesni_mb_pmd_ops.c.o' -c ../drivers/crypto/aesni_mb/rte_aesni_mb_pmd_ops.c
In file included from ../drivers/crypto/aesni_mb/rte_aesni_mb_pmd_ops.c:13:
../drivers/crypto/aesni_mb/aesni_mb_pmd_private.h:60:3: error: subscripted value is neither array nor pointer nor vector
   [IMB_AUTH_SNOW3G_UIA2_BITLEN] = 16
   ^
../drivers/crypto/aesni_mb/aesni_mb_pmd_private.h:61:3: error: subscripted value is neither array nor pointer nor vector
   [IMB_AUTH_KASUMI_UIA1]  = 16
   ^
../drivers/crypto/aesni_mb/aesni_mb_pmd_private.h:96:3: error: subscripted value is neither array nor pointer nor vector
   [IMB_AUTH_SNOW3G_UIA2_BITLEN] = 4
   ^
../drivers/crypto/aesni_mb/aesni_mb_pmd_private.h:97:3: error: subscripted value is neither array nor pointer nor vector
   [IMB_AUTH_KASUMI_UIA1]  = 4
   ^
../drivers/crypto/aesni_mb/aesni_mb_pmd_private.h:95:32: error: initialization of ‘unsigned int’ from ‘const unsigned int *’ makes integer from pointer without a cast [-Werror=int-conversion]
   [IMB_AUTH_ZUC_EIA3_BITLEN] = 4
                                ^
../drivers/crypto/aesni_mb/aesni_mb_pmd_private.h:95:32: note: (near initialization for ‘auth_truncated_digest_byte_lengths[20]’)
../drivers/crypto/aesni_mb/aesni_mb_pmd_private.h:95:32: error: initializer element is not constant
../drivers/crypto/aesni_mb/aesni_mb_pmd_private.h:95:32: note: (near initialization for ‘auth_truncated_digest_byte_lengths[20]’)
../drivers/crypto/aesni_mb/aesni_mb_pmd_private.h:133:3: error: subscripted value is neither array nor pointer nor vector
   [IMB_AUTH_SNOW3G_UIA2_BITLEN] = 4
   ^
../drivers/crypto/aesni_mb/aesni_mb_pmd_private.h:134:3: error: subscripted value is neither array nor pointer nor vector
   [IMB_AUTH_KASUMI_UIA1]  = 4
   ^
../drivers/crypto/aesni_mb/aesni_mb_pmd_private.h:132:32: error: initialization of ‘unsigned int’ from ‘const unsigned int *’ makes integer from pointer without a cast [-Werror=int-conversion]
   [IMB_AUTH_ZUC_EIA3_BITLEN] = 4
                                ^
../drivers/crypto/aesni_mb/aesni_mb_pmd_private.h:132:32: note: (near initialization for ‘auth_digest_byte_lengths[20]’)
../drivers/crypto/aesni_mb/aesni_mb_pmd_private.h:132:32: error: initializer element is not constant
../drivers/crypto/aesni_mb/aesni_mb_pmd_private.h:132:32: note: (near initialization for ‘auth_digest_byte_lengths[20]’)
cc1: all warnings being treated as errors
[1757/2578] Compiling C object 'drivers/a715181@@rte_rawdev_skeleton at sta/meson-generated_.._rte_rawdev_skeleton.pmd.c.o'.
[1758/2578] Linking static target drivers/libtmp_rte_pmd_aesni_gcm.a.
[1759/2578] Compiling C object 'drivers/a715181@@rte_rawdev_skeleton at sha/meson-generated_.._rte_rawdev_skeleton.pmd.c.o'.
[1760/2578] Generating rte_rawdev_octeontx2_ep.sym_chk with a meson_exe.py custom command.
ninja: build stopped: subcommand failed




*Build Failed #7:
OS: FC32-64
Target: x86_64-gcc-static
FAILED: drivers/a715181@@tmp_rte_pmd_aesni_mb at sta/crypto_aesni_mb_rte_aesni_mb_pmd.c.o 
gcc -Idrivers/a715181@@tmp_rte_pmd_aesni_mb at sta -Idrivers -I../drivers -Idrivers/crypto/aesni_mb -I../drivers/crypto/aesni_mb -Ilib/librte_cryptodev -I../lib/librte_cryptodev -I. -I../ -Iconfig -I../config -Ilib/librte_eal/include -I../lib/librte_eal/include -Ilib/librte_eal/linux/include -I../lib/librte_eal/linux/include -Ilib/librte_eal/x86/include -I../lib/librte_eal/x86/include -Ilib/librte_eal/common -I../lib/librte_eal/common -Ilib/librte_eal -I../lib/librte_eal -Ilib/librte_kvargs -I../lib/librte_kvargs -Ilib/librte_telemetry/../librte_metrics -I../lib/librte_telemetry/../librte_metrics -Ilib/librte_telemetry -I../lib/librte_telemetry -Ilib/librte_mbuf -I../lib/librte_mbuf -Ilib/librte_mempool -I../lib/librte_mempool -Ilib/librte_ring -I../lib/librte_ring -Idrivers/bus/vdev -I../drivers/bus/vdev -Ilib/librte_net -I../lib/librte_net -Ilib/librte_security -I../lib/librte_security -fdiagnostics-color=always -pipe -D_FILE_OFFSET_BITS=64 -Wall -Winvalid-pch -Werror -O3 -include rte_config.h -Wextra -Wcast-qual -Wdeprecated -Wformat-nonliteral -Wformat-security -Wmissing-declarations -Wmissing-prototypes -Wnested-externs -Wold-style-definition -Wpointer-arith -Wsign-compare -Wstrict-prototypes -Wundef -Wwrite-strings -Wno-address-of-packed-member -Wno-packed-not-aligned -Wno-missing-field-initializers -Wno-zero-length-bounds -D_GNU_SOURCE -fPIC -march=native -DALLOW_EXPERIMENTAL_API -DALLOW_INTERNAL_API -Wno-format-truncation -MD -MQ 'drivers/a715181@@tmp_rte_pmd_aesni_mb at sta/crypto_aesni_mb_rte_aesni_mb_pmd.c.o' -MF 'drivers/a715181@@tmp_rte_pmd_aesni_mb at sta/crypto_aesni_mb_rte_aesni_mb_pmd.c.o.d' -o 'drivers/a715181@@tmp_rte_pmd_aesni_mb at sta/crypto_aesni_mb_rte_aesni_mb_pmd.c.o' -c ../drivers/crypto/aesni_mb/rte_aesni_mb_pmd.c
In file included from ../drivers/crypto/aesni_mb/rte_aesni_mb_pmd.c:17:
../drivers/crypto/aesni_mb/aesni_mb_pmd_private.h:60:3: error: subscripted value is neither array nor pointer nor vector
   60 |   [IMB_AUTH_SNOW3G_UIA2_BITLEN] = 16
      |   ^
../drivers/crypto/aesni_mb/aesni_mb_pmd_private.h:61:3: error: subscripted value is neither array nor pointer nor vector
   61 |   [IMB_AUTH_KASUMI_UIA1]  = 16
      |   ^
../drivers/crypto/aesni_mb/aesni_mb_pmd_private.h:96:3: error: subscripted value is neither array nor pointer nor vector
   96 |   [IMB_AUTH_SNOW3G_UIA2_BITLEN] = 4
      |   ^
../drivers/crypto/aesni_mb/aesni_mb_pmd_private.h:97:3: error: subscripted value is neither array nor pointer nor vector
   97 |   [IMB_AUTH_KASUMI_UIA1]  = 4
      |   ^
../drivers/crypto/aesni_mb/aesni_mb_pmd_private.h:95:32: error: initialization of ‘unsigned int’ from ‘const unsigned int *’ makes integer from pointer without a cast [-Werror=int-conversion]
   95 |   [IMB_AUTH_ZUC_EIA3_BITLEN] = 4
      |                                ^
../drivers/crypto/aesni_mb/aesni_mb_pmd_private.h:95:32: note: (near initialization for ‘auth_truncated_digest_byte_lengths[20]’)
../drivers/crypto/aesni_mb/aesni_mb_pmd_private.h:95:32: error: initializer element is not constant
../drivers/crypto/aesni_mb/aesni_mb_pmd_private.h:95:32: note: (near initialization for ‘auth_truncated_digest_byte_lengths[20]’)
../drivers/crypto/aesni_mb/aesni_mb_pmd_private.h:133:3: error: subscripted value is neither array nor pointer nor vector
  133 |   [IMB_AUTH_SNOW3G_UIA2_BITLEN] = 4
      |   ^
../drivers/crypto/aesni_mb/aesni_mb_pmd_private.h:134:3: error: subscripted value is neither array nor pointer nor vector
  134 |   [IMB_AUTH_KASUMI_UIA1]  = 4
      |   ^
../drivers/crypto/aesni_mb/aesni_mb_pmd_private.h:132:32: error: initialization of ‘unsigned int’ from ‘const unsigned int *’ makes integer from pointer without a cast [-Werror=int-conversion]
  132 |   [IMB_AUTH_ZUC_EIA3_BITLEN] = 4
      |                                ^
../drivers/crypto/aesni_mb/aesni_mb_pmd_private.h:132:32: note: (near initialization for ‘auth_digest_byte_lengths[20]’)
../drivers/crypto/aesni_mb/aesni_mb_pmd_private.h:132:32: error: initializer element is not constant
../drivers/crypto/aesni_mb/aesni_mb_pmd_private.h:132:32: note: (near initialization for ‘auth_digest_byte_lengths[20]’)
cc1: all warnings being treated as errors
[1752/2579] Generating rte_rawdev_skeleton.pmd.c with a custom command.
[1753/2579] Generating rte_pmd_caam_jr_mingw with a custom command.
[1754/2579] Generating rte_rawdev_octeontx2_ep.sym_chk with a meson_exe.py custom command.
[1755/2579] Generating rte_pmd_vmxnet3.sym_chk with a meson_exe.py custom command.
[1756/2579] Generating rte_rawdev_ntb.sym_chk with a meson_exe.py custom command.
[1757/2579] Generating rte_pmd_virtio.sym_chk with a meson_exe.py custom command.
[1758/2579] Generating rte_rawdev_octeontx2_dma.sym_chk with a meson_exe.py custom command.
[1759/2579] Compiling C object 'drivers/a715181@@tmp_rte_pmd_aesni_mb at sta/crypto_aesni_mb_rte_aesni_mb_pmd_ops.c.o'.
FAILED: drivers/a715181@@tmp_rte_pmd_aesni_mb at sta/crypto_aesni_mb_rte_aesni_mb_pmd_ops.c.o 
gcc -Idrivers/a715181@@tmp_rte_pmd_aesni_mb at sta -Idrivers -I../drivers -Idrivers/crypto/aesni_mb -I../drivers/crypto/aesni_mb -Ilib/librte_cryptodev -I../lib/librte_cryptodev -I. -I../ -Iconfig -I../config -Ilib/librte_eal/include -I../lib/librte_eal/include -Ilib/librte_eal/linux/include -I../lib/librte_eal/linux/include -Ilib/librte_eal/x86/include -I../lib/librte_eal/x86/include -Ilib/librte_eal/common -I../lib/librte_eal/common -Ilib/librte_eal -I../lib/librte_eal -Ilib/librte_kvargs -I../lib/librte_kvargs -Ilib/librte_telemetry/../librte_metrics -I../lib/librte_telemetry/../librte_metrics -Ilib/librte_telemetry -I../lib/librte_telemetry -Ilib/librte_mbuf -I../lib/librte_mbuf -Ilib/librte_mempool -I../lib/librte_mempool -Ilib/librte_ring -I../lib/librte_ring -Idrivers/bus/vdev -I../drivers/bus/vdev -Ilib/librte_net -I../lib/librte_net -Ilib/librte_security -I../lib/librte_security -fdiagnostics-color=always -pipe -D_FILE_OFFSET_BITS=64 -Wall -Winvalid-pch -Werror -O3 -include rte_config.h -Wextra -Wcast-qual -Wdeprecated -Wformat-nonliteral -Wformat-security -Wmissing-declarations -Wmissing-prototypes -Wnested-externs -Wold-style-definition -Wpointer-arith -Wsign-compare -Wstrict-prototypes -Wundef -Wwrite-strings -Wno-address-of-packed-member -Wno-packed-not-aligned -Wno-missing-field-initializers -Wno-zero-length-bounds -D_GNU_SOURCE -fPIC -march=native -DALLOW_EXPERIMENTAL_API -DALLOW_INTERNAL_API -Wno-format-truncation -MD -MQ 'drivers/a715181@@tmp_rte_pmd_aesni_mb at sta/crypto_aesni_mb_rte_aesni_mb_pmd_ops.c.o' -MF 'drivers/a715181@@tmp_rte_pmd_aesni_mb at sta/crypto_aesni_mb_rte_aesni_mb_pmd_ops.c.o.d' -o 'drivers/a715181@@tmp_rte_pmd_aesni_mb at sta/crypto_aesni_mb_rte_aesni_mb_pmd_ops.c.o' -c ../drivers/crypto/aesni_mb/rte_aesni_mb_pmd_ops.c
In file included from ../drivers/crypto/aesni_mb/rte_aesni_mb_pmd_ops.c:13:
../drivers/crypto/aesni_mb/aesni_mb_pmd_private.h:60:3: error: subscripted value is neither array nor pointer nor vector
   60 |   [IMB_AUTH_SNOW3G_UIA2_BITLEN] = 16
      |   ^
../drivers/crypto/aesni_mb/aesni_mb_pmd_private.h:61:3: error: subscripted value is neither array nor pointer nor vector
   61 |   [IMB_AUTH_KASUMI_UIA1]  = 16
      |   ^
../drivers/crypto/aesni_mb/aesni_mb_pmd_private.h:96:3: error: subscripted value is neither array nor pointer nor vector
   96 |   [IMB_AUTH_SNOW3G_UIA2_BITLEN] = 4
      |   ^
../drivers/crypto/aesni_mb/aesni_mb_pmd_private.h:97:3: error: subscripted value is neither array nor pointer nor vector
   97 |   [IMB_AUTH_KASUMI_UIA1]  = 4
      |   ^
../drivers/crypto/aesni_mb/aesni_mb_pmd_private.h:95:32: error: initialization of ‘unsigned int’ from ‘const unsigned int *’ makes integer from pointer without a cast [-Werror=int-conversion]
   95 |   [IMB_AUTH_ZUC_EIA3_BITLEN] = 4
      |                                ^
../drivers/crypto/aesni_mb/aesni_mb_pmd_private.h:95:32: note: (near initialization for ‘auth_truncated_digest_byte_lengths[20]’)
../drivers/crypto/aesni_mb/aesni_mb_pmd_private.h:95:32: error: initializer element is not constant
../drivers/crypto/aesni_mb/aesni_mb_pmd_private.h:95:32: note: (near initialization for ‘auth_truncated_digest_byte_lengths[20]’)
../drivers/crypto/aesni_mb/aesni_mb_pmd_private.h:133:3: error: subscripted value is neither array nor pointer nor vector
  133 |   [IMB_AUTH_SNOW3G_UIA2_BITLEN] = 4
      |   ^
../drivers/crypto/aesni_mb/aesni_mb_pmd_private.h:134:3: error: subscripted value is neither array nor pointer nor vector
  134 |   [IMB_AUTH_KASUMI_UIA1]  = 4
      |   ^
../drivers/crypto/aesni_mb/aesni_mb_pmd_private.h:132:32: error: initialization of ‘unsigned int’ from ‘const unsigned int *’ makes integer from pointer without a cast [-Werror=int-conversion]
  132 |   [IMB_AUTH_ZUC_EIA3_BITLEN] = 4
      |                                ^
../drivers/crypto/aesni_mb/aesni_mb_pmd_private.h:132:32: note: (near initialization for ‘auth_digest_byte_lengths[20]’)
../drivers/crypto/aesni_mb/aesni_mb_pmd_private.h:132:32: error: initializer element is not constant
../drivers/crypto/aesni_mb/aesni_mb_pmd_private.h:132:32: note: (near initialization for ‘auth_digest_byte_lengths[20]’)
cc1: all warnings being treated as errors
[1760/2579] Generating rte_rawdev_dpaa2_qdma.sym_chk with a meson_exe.py custom command.
[1761/2579] Compiling C object 'drivers/a715181@@tmp_rte_pmd_caam_jr at sta/crypto_caam_jr_caam_jr_capabilities.c.o'.
[1762/2579] Compiling C object 'drivers/a715181@@tmp_rte_pmd_aesni_gcm at sta/crypto_aesni_gcm_aesni_gcm_pmd.c.o'.
ninja: build stopped: subcommand failed




*Build Failed #8:
OS: FC32-64
Target: x86_64-clang-static
FAILED: drivers/a715181@@tmp_rte_pmd_aesni_mb at sta/crypto_aesni_mb_rte_aesni_mb_pmd.c.o 
clang -Idrivers/a715181@@tmp_rte_pmd_aesni_mb at sta -Idrivers -I../drivers -Idrivers/crypto/aesni_mb -I../drivers/crypto/aesni_mb -Ilib/librte_cryptodev -I../lib/librte_cryptodev -I. -I../ -Iconfig -I../config -Ilib/librte_eal/include -I../lib/librte_eal/include -Ilib/librte_eal/linux/include -I../lib/librte_eal/linux/include -Ilib/librte_eal/x86/include -I../lib/librte_eal/x86/include -Ilib/librte_eal/common -I../lib/librte_eal/common -Ilib/librte_eal -I../lib/librte_eal -Ilib/librte_kvargs -I../lib/librte_kvargs -Ilib/librte_telemetry/../librte_metrics -I../lib/librte_telemetry/../librte_metrics -Ilib/librte_telemetry -I../lib/librte_telemetry -Ilib/librte_mbuf -I../lib/librte_mbuf -Ilib/librte_mempool -I../lib/librte_mempool -Ilib/librte_ring -I../lib/librte_ring -Idrivers/bus/vdev -I../drivers/bus/vdev -Ilib/librte_net -I../lib/librte_net -Ilib/librte_security -I../lib/librte_security -Xclang -fcolor-diagnostics -pipe -D_FILE_OFFSET_BITS=64 -Wall -Winvalid-pch -Werror -O3 -include rte_config.h -Wextra -Wcast-qual -Wdeprecated -Wformat-nonliteral -Wformat-security -Wmissing-declarations -Wmissing-prototypes -Wnested-externs -Wold-style-definition -Wpointer-arith -Wsign-compare -Wstrict-prototypes -Wundef -Wwrite-strings -Wno-address-of-packed-member -Wno-missing-field-initializers -D_GNU_SOURCE -fPIC -march=native -DALLOW_EXPERIMENTAL_API -DALLOW_INTERNAL_API -MD -MQ 'drivers/a715181@@tmp_rte_pmd_aesni_mb at sta/crypto_aesni_mb_rte_aesni_mb_pmd.c.o' -MF 'drivers/a715181@@tmp_rte_pmd_aesni_mb at sta/crypto_aesni_mb_rte_aesni_mb_pmd.c.o.d' -o 'drivers/a715181@@tmp_rte_pmd_aesni_mb at sta/crypto_aesni_mb_rte_aesni_mb_pmd.c.o' -c ../drivers/crypto/aesni_mb/rte_aesni_mb_pmd.c
In file included from ../drivers/crypto/aesni_mb/rte_aesni_mb_pmd.c:17:
../drivers/crypto/aesni_mb/aesni_mb_pmd_private.h:60:3: error: subscripted value is not an array, pointer, or vector
                [IMB_AUTH_SNOW3G_UIA2_BITLEN]   = 16
                ^~~~~~~~~~~~~~~~~~~~~~~~~~~~
../drivers/crypto/aesni_mb/aesni_mb_pmd_private.h:61:3: error: subscripted value is not an array, pointer, or vector
                [IMB_AUTH_KASUMI_UIA1]          = 16
                ^~~~~~~~~~~~~~~~~~~~~
../drivers/crypto/aesni_mb/aesni_mb_pmd_private.h:96:3: error: subscripted value is not an array, pointer, or vector
                [IMB_AUTH_SNOW3G_UIA2_BITLEN]   = 4
                ^~~~~~~~~~~~~~~~~~~~~~~~~~~~
../drivers/crypto/aesni_mb/aesni_mb_pmd_private.h:97:3: error: subscripted value is not an array, pointer, or vector
                [IMB_AUTH_KASUMI_UIA1]          = 4
                ^~~~~~~~~~~~~~~~~~~~~
../drivers/crypto/aesni_mb/aesni_mb_pmd_private.h:133:3: error: subscripted value is not an array, pointer, or vector
                [IMB_AUTH_SNOW3G_UIA2_BITLEN]   = 4
                ^~~~~~~~~~~~~~~~~~~~~~~~~~~~
../drivers/crypto/aesni_mb/aesni_mb_pmd_private.h:134:3: error: subscripted value is not an array, pointer, or vector
                [IMB_AUTH_KASUMI_UIA1]          = 4
                ^~~~~~~~~~~~~~~~~~~~~
6 errors generated.
[1760/2579] Compiling C object 'drivers/a715181@@rte_rawdev_octeontx2_ep at sta/meson-generated_.._rte_rawdev_octeontx2_ep.pmd.c.o'.
[1761/2579] Compiling C object 'drivers/a715181@@rte_rawdev_octeontx2_ep at sha/meson-generated_.._rte_rawdev_octeontx2_ep.pmd.c.o'.
[1762/2579] Generating rte_rawdev_ntb.sym_chk with a meson_exe.py custom command.
[1763/2579] Generating rte_rawdev_skeleton.sym_chk with a meson_exe.py custom command.
[1764/2579] Compiling C object 'drivers/a715181@@tmp_rte_pmd_aesni_mb at sta/crypto_aesni_mb_rte_aesni_mb_pmd_ops.c.o'.
FAILED: drivers/a715181@@tmp_rte_pmd_aesni_mb at sta/crypto_aesni_mb_rte_aesni_mb_pmd_ops.c.o 
clang -Idrivers/a715181@@tmp_rte_pmd_aesni_mb at sta -Idrivers -I../drivers -Idrivers/crypto/aesni_mb -I../drivers/crypto/aesni_mb -Ilib/librte_cryptodev -I../lib/librte_cryptodev -I. -I../ -Iconfig -I../config -Ilib/librte_eal/include -I../lib/librte_eal/include -Ilib/librte_eal/linux/include -I../lib/librte_eal/linux/include -Ilib/librte_eal/x86/include -I../lib/librte_eal/x86/include -Ilib/librte_eal/common -I../lib/librte_eal/common -Ilib/librte_eal -I../lib/librte_eal -Ilib/librte_kvargs -I../lib/librte_kvargs -Ilib/librte_telemetry/../librte_metrics -I../lib/librte_telemetry/../librte_metrics -Ilib/librte_telemetry -I../lib/librte_telemetry -Ilib/librte_mbuf -I../lib/librte_mbuf -Ilib/librte_mempool -I../lib/librte_mempool -Ilib/librte_ring -I../lib/librte_ring -Idrivers/bus/vdev -I../drivers/bus/vdev -Ilib/librte_net -I../lib/librte_net -Ilib/librte_security -I../lib/librte_security -Xclang -fcolor-diagnostics -pipe -D_FILE_OFFSET_BITS=64 -Wall -Winvalid-pch -Werror -O3 -include rte_config.h -Wextra -Wcast-qual -Wdeprecated -Wformat-nonliteral -Wformat-security -Wmissing-declarations -Wmissing-prototypes -Wnested-externs -Wold-style-definition -Wpointer-arith -Wsign-compare -Wstrict-prototypes -Wundef -Wwrite-strings -Wno-address-of-packed-member -Wno-missing-field-initializers -D_GNU_SOURCE -fPIC -march=native -DALLOW_EXPERIMENTAL_API -DALLOW_INTERNAL_API -MD -MQ 'drivers/a715181@@tmp_rte_pmd_aesni_mb at sta/crypto_aesni_mb_rte_aesni_mb_pmd_ops.c.o' -MF 'drivers/a715181@@tmp_rte_pmd_aesni_mb at sta/crypto_aesni_mb_rte_aesni_mb_pmd_ops.c.o.d' -o 'drivers/a715181@@tmp_rte_pmd_aesni_mb at sta/crypto_aesni_mb_rte_aesni_mb_pmd_ops.c.o' -c ../drivers/crypto/aesni_mb/rte_aesni_mb_pmd_ops.c
In file included from ../drivers/crypto/aesni_mb/rte_aesni_mb_pmd_ops.c:13:
../drivers/crypto/aesni_mb/aesni_mb_pmd_private.h:60:3: error: subscripted value is not an array, pointer, or vector
                [IMB_AUTH_SNOW3G_UIA2_BITLEN]   = 16
                ^~~~~~~~~~~~~~~~~~~~~~~~~~~~
../drivers/crypto/aesni_mb/aesni_mb_pmd_private.h:61:3: error: subscripted value is not an array, pointer, or vector
                [IMB_AUTH_KASUMI_UIA1]          = 16
                ^~~~~~~~~~~~~~~~~~~~~
../drivers/crypto/aesni_mb/aesni_mb_pmd_private.h:96:3: error: subscripted value is not an array, pointer, or vector
                [IMB_AUTH_SNOW3G_UIA2_BITLEN]   = 4
                ^~~~~~~~~~~~~~~~~~~~~~~~~~~~
../drivers/crypto/aesni_mb/aesni_mb_pmd_private.h:97:3: error: subscripted value is not an array, pointer, or vector
                [IMB_AUTH_KASUMI_UIA1]          = 4
                ^~~~~~~~~~~~~~~~~~~~~
../drivers/crypto/aesni_mb/aesni_mb_pmd_private.h:133:3: error: subscripted value is not an array, pointer, or vector
                [IMB_AUTH_SNOW3G_UIA2_BITLEN]   = 4
                ^~~~~~~~~~~~~~~~~~~~~~~~~~~~
../drivers/crypto/aesni_mb/aesni_mb_pmd_private.h:134:3: error: subscripted value is not an array, pointer, or vector
                [IMB_AUTH_KASUMI_UIA1]          = 4
                ^~~~~~~~~~~~~~~~~~~~~
6 errors generated.
[1765/2579] Compiling C object 'drivers/a715181@@tmp_rte_pmd_caam_jr at sta/crypto_caam_jr_caam_jr_capabilities.c.o'.
[1766/2579] Compiling C object 'drivers/a715181@@tmp_rte_pmd_caam_jr at sta/crypto_caam_jr_caam_jr_hw.c.o'.
[1767/2579] Compiling C object 'drivers/a715181@@tmp_rte_pmd_caam_jr at sta/crypto_caam_jr_caam_jr_uio.c.o'.
[1768/2579] Compiling C object 'drivers/a715181@@tmp_rte_pmd_aesni_gcm at sta/crypto_aesni_gcm_aesni_gcm_pmd.c.o'.
ninja: build stopped: subcommand failed




*Build Failed #9:
OS: RHEL82-64
Target: x86_64-gcc-static
FAILED: drivers/a715181@@tmp_rte_pmd_aesni_mb at sta/crypto_aesni_mb_rte_aesni_mb_pmd.c.o 
gcc -Idrivers/a715181@@tmp_rte_pmd_aesni_mb at sta -Idrivers -I../drivers -Idrivers/crypto/aesni_mb -I../drivers/crypto/aesni_mb -Ilib/librte_cryptodev -I../lib/librte_cryptodev -I. -I../ -Iconfig -I../config -Ilib/librte_eal/include -I../lib/librte_eal/include -Ilib/librte_eal/linux/include -I../lib/librte_eal/linux/include -Ilib/librte_eal/x86/include -I../lib/librte_eal/x86/include -Ilib/librte_eal/common -I../lib/librte_eal/common -Ilib/librte_eal -I../lib/librte_eal -Ilib/librte_kvargs -I../lib/librte_kvargs -Ilib/librte_telemetry/../librte_metrics -I../lib/librte_telemetry/../librte_metrics -Ilib/librte_telemetry -I../lib/librte_telemetry -Ilib/librte_mbuf -I../lib/librte_mbuf -Ilib/librte_mempool -I../lib/librte_mempool -Ilib/librte_ring -I../lib/librte_ring -Idrivers/bus/vdev -I../drivers/bus/vdev -Ilib/librte_net -I../lib/librte_net -Ilib/librte_security -I../lib/librte_security -fdiagnostics-color=always -pipe -D_FILE_OFFSET_BITS=64 -Wall -Winvalid-pch -Werror -O3 -include rte_config.h -Wextra -Wcast-qual -Wdeprecated -Wformat-nonliteral -Wformat-security -Wmissing-declarations -Wmissing-prototypes -Wnested-externs -Wold-style-definition -Wpointer-arith -Wsign-compare -Wstrict-prototypes -Wundef -Wwrite-strings -Wno-packed-not-aligned -Wno-missing-field-initializers -D_GNU_SOURCE -fPIC -march=native -mno-avx512f -DALLOW_EXPERIMENTAL_API -DALLOW_INTERNAL_API -Wno-format-truncation -MD -MQ 'drivers/a715181@@tmp_rte_pmd_aesni_mb at sta/crypto_aesni_mb_rte_aesni_mb_pmd.c.o' -MF 'drivers/a715181@@tmp_rte_pmd_aesni_mb at sta/crypto_aesni_mb_rte_aesni_mb_pmd.c.o.d' -o 'drivers/a715181@@tmp_rte_pmd_aesni_mb at sta/crypto_aesni_mb_rte_aesni_mb_pmd.c.o' -c ../drivers/crypto/aesni_mb/rte_aesni_mb_pmd.c
In file included from ../drivers/crypto/aesni_mb/rte_aesni_mb_pmd.c:17:
../drivers/crypto/aesni_mb/aesni_mb_pmd_private.h:60:3: error: subscripted value is neither array nor pointer nor vector
   [IMB_AUTH_SNOW3G_UIA2_BITLEN] = 16
   ^
../drivers/crypto/aesni_mb/aesni_mb_pmd_private.h:61:3: error: subscripted value is neither array nor pointer nor vector
   [IMB_AUTH_KASUMI_UIA1]  = 16
   ^
../drivers/crypto/aesni_mb/aesni_mb_pmd_private.h:96:3: error: subscripted value is neither array nor pointer nor vector
   [IMB_AUTH_SNOW3G_UIA2_BITLEN] = 4
   ^
../drivers/crypto/aesni_mb/aesni_mb_pmd_private.h:97:3: error: subscripted value is neither array nor pointer nor vector
   [IMB_AUTH_KASUMI_UIA1]  = 4
   ^
../drivers/crypto/aesni_mb/aesni_mb_pmd_private.h:95:32: error: initialization of ‘unsigned int’ from ‘const unsigned int *’ makes integer from pointer without a cast [-Werror=int-conversion]
   [IMB_AUTH_ZUC_EIA3_BITLEN] = 4
                                ^
../drivers/crypto/aesni_mb/aesni_mb_pmd_private.h:95:32: note: (near initialization for ‘auth_truncated_digest_byte_lengths[20]’)
../drivers/crypto/aesni_mb/aesni_mb_pmd_private.h:95:32: error: initializer element is not constant
../drivers/crypto/aesni_mb/aesni_mb_pmd_private.h:95:32: note: (near initialization for ‘auth_truncated_digest_byte_lengths[20]’)
../drivers/crypto/aesni_mb/aesni_mb_pmd_private.h:133:3: error: subscripted value is neither array nor pointer nor vector
   [IMB_AUTH_SNOW3G_UIA2_BITLEN] = 4
   ^
../drivers/crypto/aesni_mb/aesni_mb_pmd_private.h:134:3: error: subscripted value is neither array nor pointer nor vector
   [IMB_AUTH_KASUMI_UIA1]  = 4
   ^
../drivers/crypto/aesni_mb/aesni_mb_pmd_private.h:132:32: error: initialization of ‘unsigned int’ from ‘const unsigned int *’ makes integer from pointer without a cast [-Werror=int-conversion]
   [IMB_AUTH_ZUC_EIA3_BITLEN] = 4
                                ^
../drivers/crypto/aesni_mb/aesni_mb_pmd_private.h:132:32: note: (near initialization for ‘auth_digest_byte_lengths[20]’)
../drivers/crypto/aesni_mb/aesni_mb_pmd_private.h:132:32: error: initializer element is not constant
../drivers/crypto/aesni_mb/aesni_mb_pmd_private.h:132:32: note: (near initialization for ‘auth_digest_byte_lengths[20]’)
cc1: all warnings being treated as errors
[1764/2578] Linking target drivers/librte_rawdev_octeontx2_dma.so.21.0.
[1765/2578] Linking target drivers/librte_rawdev_dpaa2_qdma.so.21.0.
[1766/2578] Compiling C object 'drivers/a715181@@tmp_rte_pmd_aesni_mb at sta/crypto_aesni_mb_rte_aesni_mb_pmd_ops.c.o'.
FAILED: drivers/a715181@@tmp_rte_pmd_aesni_mb at sta/crypto_aesni_mb_rte_aesni_mb_pmd_ops.c.o 
gcc -Idrivers/a715181@@tmp_rte_pmd_aesni_mb at sta -Idrivers -I../drivers -Idrivers/crypto/aesni_mb -I../drivers/crypto/aesni_mb -Ilib/librte_cryptodev -I../lib/librte_cryptodev -I. -I../ -Iconfig -I../config -Ilib/librte_eal/include -I../lib/librte_eal/include -Ilib/librte_eal/linux/include -I../lib/librte_eal/linux/include -Ilib/librte_eal/x86/include -I../lib/librte_eal/x86/include -Ilib/librte_eal/common -I../lib/librte_eal/common -Ilib/librte_eal -I../lib/librte_eal -Ilib/librte_kvargs -I../lib/librte_kvargs -Ilib/librte_telemetry/../librte_metrics -I../lib/librte_telemetry/../librte_metrics -Ilib/librte_telemetry -I../lib/librte_telemetry -Ilib/librte_mbuf -I../lib/librte_mbuf -Ilib/librte_mempool -I../lib/librte_mempool -Ilib/librte_ring -I../lib/librte_ring -Idrivers/bus/vdev -I../drivers/bus/vdev -Ilib/librte_net -I../lib/librte_net -Ilib/librte_security -I../lib/librte_security -fdiagnostics-color=always -pipe -D_FILE_OFFSET_BITS=64 -Wall -Winvalid-pch -Werror -O3 -include rte_config.h -Wextra -Wcast-qual -Wdeprecated -Wformat-nonliteral -Wformat-security -Wmissing-declarations -Wmissing-prototypes -Wnested-externs -Wold-style-definition -Wpointer-arith -Wsign-compare -Wstrict-prototypes -Wundef -Wwrite-strings -Wno-packed-not-aligned -Wno-missing-field-initializers -D_GNU_SOURCE -fPIC -march=native -mno-avx512f -DALLOW_EXPERIMENTAL_API -DALLOW_INTERNAL_API -Wno-format-truncation -MD -MQ 'drivers/a715181@@tmp_rte_pmd_aesni_mb at sta/crypto_aesni_mb_rte_aesni_mb_pmd_ops.c.o' -MF 'drivers/a715181@@tmp_rte_pmd_aesni_mb at sta/crypto_aesni_mb_rte_aesni_mb_pmd_ops.c.o.d' -o 'drivers/a715181@@tmp_rte_pmd_aesni_mb at sta/crypto_aesni_mb_rte_aesni_mb_pmd_ops.c.o' -c ../drivers/crypto/aesni_mb/rte_aesni_mb_pmd_ops.c
In file included from ../drivers/crypto/aesni_mb/rte_aesni_mb_pmd_ops.c:13:
../drivers/crypto/aesni_mb/aesni_mb_pmd_private.h:60:3: error: subscripted value is neither array nor pointer nor vector
   [IMB_AUTH_SNOW3G_UIA2_BITLEN] = 16
   ^
../drivers/crypto/aesni_mb/aesni_mb_pmd_private.h:61:3: error: subscripted value is neither array nor pointer nor vector
   [IMB_AUTH_KASUMI_UIA1]  = 16
   ^
../drivers/crypto/aesni_mb/aesni_mb_pmd_private.h:96:3: error: subscripted value is neither array nor pointer nor vector
   [IMB_AUTH_SNOW3G_UIA2_BITLEN] = 4
   ^
../drivers/crypto/aesni_mb/aesni_mb_pmd_private.h:97:3: error: subscripted value is neither array nor pointer nor vector
   [IMB_AUTH_KASUMI_UIA1]  = 4
   ^
../drivers/crypto/aesni_mb/aesni_mb_pmd_private.h:95:32: error: initialization of ‘unsigned int’ from ‘const unsigned int *’ makes integer from pointer without a cast [-Werror=int-conversion]
   [IMB_AUTH_ZUC_EIA3_BITLEN] = 4
                                ^
../drivers/crypto/aesni_mb/aesni_mb_pmd_private.h:95:32: note: (near initialization for ‘auth_truncated_digest_byte_lengths[20]’)
../drivers/crypto/aesni_mb/aesni_mb_pmd_private.h:95:32: error: initializer element is not constant
../drivers/crypto/aesni_mb/aesni_mb_pmd_private.h:95:32: note: (near initialization for ‘auth_truncated_digest_byte_lengths[20]’)
../drivers/crypto/aesni_mb/aesni_mb_pmd_private.h:133:3: error: subscripted value is neither array nor pointer nor vector
   [IMB_AUTH_SNOW3G_UIA2_BITLEN] = 4
   ^
../drivers/crypto/aesni_mb/aesni_mb_pmd_private.h:134:3: error: subscripted value is neither array nor pointer nor vector
   [IMB_AUTH_KASUMI_UIA1]  = 4
   ^
../drivers/crypto/aesni_mb/aesni_mb_pmd_private.h:132:32: error: initialization of ‘unsigned int’ from ‘const unsigned int *’ makes integer from pointer without a cast [-Werror=int-conversion]
   [IMB_AUTH_ZUC_EIA3_BITLEN] = 4
                                ^
../drivers/crypto/aesni_mb/aesni_mb_pmd_private.h:132:32: note: (near initialization for ‘auth_digest_byte_lengths[20]’)
../drivers/crypto/aesni_mb/aesni_mb_pmd_private.h:132:32: error: initializer element is not constant
../drivers/crypto/aesni_mb/aesni_mb_pmd_private.h:132:32: note: (near initialization for ‘auth_digest_byte_lengths[20]’)
cc1: all warnings being treated as errors
[1767/2578] Generating rte_rawdev_octeontx2_ep.sym_chk with a meson_exe.py custom command.
[1768/2578] Generating rte_rawdev_ntb.sym_chk with a meson_exe.py custom command.
[1769/2578] Generating rte_rawdev_skeleton.sym_chk with a meson_exe.py custom command.
[1770/2578] Compiling C object 'drivers/a715181@@tmp_rte_pmd_caam_jr at sta/crypto_caam_jr_caam_jr_capabilities.c.o'.
[1771/2578] Compiling C object 'drivers/a715181@@tmp_rte_pmd_aesni_gcm at sta/crypto_aesni_gcm_aesni_gcm_pmd.c.o'.
[1772/2578] Compiling C object 'drivers/a715181@@tmp_rte_pmd_caam_jr at sta/crypto_caam_jr_caam_jr_hw.c.o'.
ninja: build stopped: subcommand failed




*Build Failed #10:
OS: SUSE15-64
Target: x86_64-clang-static
FAILED: drivers/libtmp_rte_pmd_aesni_mb.a.p/crypto_aesni_mb_rte_aesni_mb_pmd.c.o 
clang -Idrivers/libtmp_rte_pmd_aesni_mb.a.p -Idrivers -I../drivers -Idrivers/crypto/aesni_mb -I../drivers/crypto/aesni_mb -Ilib/librte_cryptodev -I../lib/librte_cryptodev -I. -I.. -Iconfig -I../config -Ilib/librte_eal/include -I../lib/librte_eal/include -Ilib/librte_eal/linux/include -I../lib/librte_eal/linux/include -Ilib/librte_eal/x86/include -I../lib/librte_eal/x86/include -Ilib/librte_eal/common -I../lib/librte_eal/common -Ilib/librte_eal -I../lib/librte_eal -Ilib/librte_kvargs -I../lib/librte_kvargs -Ilib/librte_metrics -I../lib/librte_metrics -Ilib/librte_telemetry -I../lib/librte_telemetry -Ilib/librte_mbuf -I../lib/librte_mbuf -Ilib/librte_mempool -I../lib/librte_mempool -Ilib/librte_ring -I../lib/librte_ring -Idrivers/bus/vdev -I../drivers/bus/vdev -Ilib/librte_net -I../lib/librte_net -Ilib/librte_security -I../lib/librte_security -Xclang -fcolor-diagnostics -pipe -D_FILE_OFFSET_BITS=64 -Wall -Winvalid-pch -Werror -O3 -include rte_config.h -Wextra -Wcast-qual -Wdeprecated -Wformat-nonliteral -Wformat-security -Wmissing-declarations -Wmissing-prototypes -Wnested-externs -Wold-style-definition -Wpointer-arith -Wsign-compare -Wstrict-prototypes -Wundef -Wwrite-strings -Wno-address-of-packed-member -Wno-missing-field-initializers -D_GNU_SOURCE -fPIC -march=native -DALLOW_EXPERIMENTAL_API -DALLOW_INTERNAL_API -MD -MQ drivers/libtmp_rte_pmd_aesni_mb.a.p/crypto_aesni_mb_rte_aesni_mb_pmd.c.o -MF drivers/libtmp_rte_pmd_aesni_mb.a.p/crypto_aesni_mb_rte_aesni_mb_pmd.c.o.d -o drivers/libtmp_rte_pmd_aesni_mb.a.p/crypto_aesni_mb_rte_aesni_mb_pmd.c.o -c ../drivers/crypto/aesni_mb/rte_aesni_mb_pmd.c
In file included from ../drivers/crypto/aesni_mb/rte_aesni_mb_pmd.c:17:
../drivers/crypto/aesni_mb/aesni_mb_pmd_private.h:247:4: error: unknown type name 'snow3g_key_schedule_t'
                        snow3g_key_schedule_t pKeySched_snow3g_cipher;
                        ^
../drivers/crypto/aesni_mb/aesni_mb_pmd_private.h:249:4: error: unknown type name 'kasumi_key_sched_t'; did you mean 'des_keysched_t'?
                        kasumi_key_sched_t pKeySched_kasumi_cipher;
                        ^~~~~~~~~~~~~~~~~~
                        des_keysched_t
/usr/include/intel-ipsec-mb.h:633:15: note: 'des_keysched_t' declared here
typedef int (*des_keysched_t)(uint64_t *, const void *);
              ^
In file included from ../drivers/crypto/aesni_mb/rte_aesni_mb_pmd.c:17:
../drivers/crypto/aesni_mb/aesni_mb_pmd_private.h:292:4: error: unknown type name 'snow3g_key_schedule_t'
                        snow3g_key_schedule_t pKeySched_snow3g_auth;
                        ^
../drivers/crypto/aesni_mb/aesni_mb_pmd_private.h:294:4: error: unknown type name 'kasumi_key_sched_t'; did you mean 'des_keysched_t'?
                        kasumi_key_sched_t pKeySched_kasumi_auth;
                        ^~~~~~~~~~~~~~~~~~
                        des_keysched_t
/usr/include/intel-ipsec-mb.h:633:15: note: 'des_keysched_t' declared here
typedef int (*des_keysched_t)(uint64_t *, const void *);
              ^
../drivers/crypto/aesni_mb/rte_aesni_mb_pmd.c:172:16: error: no member named 'xcbc' in 'struct aesni_mb_session::(anonymous at ../drivers/crypto/aesni_mb/aesni_mb_pmd_private.h:255:2)'
                                sess->auth.xcbc.k1_expanded,
                                ~~~~~~~~~~ ^
/usr/include/intel-ipsec-mb.h:898:39: note: expanded from macro 'IMB_AES_XCBC_KEYEXP'
        ((_mgr)->xcbc_keyexp((_key), (_k1_exp), (_k2), (_k3)))
                                      ^~~~~~~
../drivers/crypto/aesni_mb/rte_aesni_mb_pmd.c:173:16: error: no member named 'xcbc' in 'struct aesni_mb_session::(anonymous at ../drivers/crypto/aesni_mb/aesni_mb_pmd_private.h:255:2)'
                                sess->auth.xcbc.k2, sess->auth.xcbc.k3);
                                ~~~~~~~~~~ ^
/usr/include/intel-ipsec-mb.h:898:50: note: expanded from macro 'IMB_AES_XCBC_KEYEXP'
        ((_mgr)->xcbc_keyexp((_key), (_k1_exp), (_k2), (_k3)))
                                                 ^~~
../drivers/crypto/aesni_mb/rte_aesni_mb_pmd.c:173:36: error: no member named 'xcbc' in 'struct aesni_mb_session::(anonymous at ../drivers/crypto/aesni_mb/aesni_mb_pmd_private.h:255:2)'
                                sess->auth.xcbc.k2, sess->auth.xcbc.k3);
                                                    ~~~~~~~~~~ ^
/usr/include/intel-ipsec-mb.h:898:57: note: expanded from macro 'IMB_AES_XCBC_KEYEXP'
        ((_mgr)->xcbc_keyexp((_key), (_k1_exp), (_k2), (_k3)))
                                                        ^~~
../drivers/crypto/aesni_mb/rte_aesni_mb_pmd.c:202:16: error: no member named 'cmac' in 'struct aesni_mb_session::(anonymous at ../drivers/crypto/aesni_mb/aesni_mb_pmd_private.h:255:2)'
                                sess->auth.cmac.expkey, dust);
                                ~~~~~~~~~~ ^
/usr/include/intel-ipsec-mb.h:888:38: note: expanded from macro 'IMB_AES_KEYEXP_128'
        ((_mgr)->keyexp_128((_raw), (_enc), (_dec)))
                                     ^~~~
../drivers/crypto/aesni_mb/rte_aesni_mb_pmd.c:203:50: error: no member named 'cmac' in 'struct aesni_mb_session::(anonymous at ../drivers/crypto/aesni_mb/aesni_mb_pmd_private.h:255:2)'
                IMB_AES_CMAC_SUBKEY_GEN_128(mb_mgr, sess->auth.cmac.expkey,
                                                    ~~~~~~~~~~ ^
/usr/include/intel-ipsec-mb.h:895:39: note: expanded from macro 'IMB_AES_CMAC_SUBKEY_GEN_128'
        ((_mgr)->cmac_subkey_gen_128((_key_exp), (_k1), (_k2)))
                                      ^~~~~~~~
../drivers/crypto/aesni_mb/rte_aesni_mb_pmd.c:204:16: error: no member named 'cmac' in 'struct aesni_mb_session::(anonymous at ../drivers/crypto/aesni_mb/aesni_mb_pmd_private.h:255:2)'
                                sess->auth.cmac.skey1, sess->auth.cmac.skey2);
                                ~~~~~~~~~~ ^
/usr/include/intel-ipsec-mb.h:895:51: note: expanded from macro 'IMB_AES_CMAC_SUBKEY_GEN_128'
        ((_mgr)->cmac_subkey_gen_128((_key_exp), (_k1), (_k2)))
                                                  ^~~
../drivers/crypto/aesni_mb/rte_aesni_mb_pmd.c:204:39: error: no member named 'cmac' in 'struct aesni_mb_session::(anonymous at ../drivers/crypto/aesni_mb/aesni_mb_pmd_private.h:255:2)'
                                sess->auth.cmac.skey1, sess->auth.cmac.skey2);
                                                       ~~~~~~~~~~ ^
/usr/include/intel-ipsec-mb.h:895:58: note: expanded from macro 'IMB_AES_CMAC_SUBKEY_GEN_128'
        ((_mgr)->cmac_subkey_gen_128((_key_exp), (_k1), (_k2)))
                                                         ^~~
../drivers/crypto/aesni_mb/rte_aesni_mb_pmd.c:235:19: error: no member named 'gcm_key' in 'struct aesni_mb_session::(anonymous at ../drivers/crypto/aesni_mb/aesni_mb_pmd_private.h:216:2)'
                                &sess->cipher.gcm_key);
                                 ~~~~~~~~~~~~ ^
/usr/include/intel-ipsec-mb.h:1001:41: note: expanded from macro 'IMB_AES128_GCM_PRE'
        ((_mgr)->gcm128_pre((_key_in), (_key_exp)))
                                        ^~~~~~~~
../drivers/crypto/aesni_mb/rte_aesni_mb_pmd.c:240:19: error: no member named 'gcm_key' in 'struct aesni_mb_session::(anonymous at ../drivers/crypto/aesni_mb/aesni_mb_pmd_private.h:216:2)'
                                &sess->cipher.gcm_key);
                                 ~~~~~~~~~~~~ ^
/usr/include/intel-ipsec-mb.h:1003:41: note: expanded from macro 'IMB_AES192_GCM_PRE'
        ((_mgr)->gcm192_pre((_key_in), (_key_exp)))
                                        ^~~~~~~~
../drivers/crypto/aesni_mb/rte_aesni_mb_pmd.c:245:19: error: no member named 'gcm_key' in 'struct aesni_mb_session::(anonymous at ../drivers/crypto/aesni_mb/aesni_mb_pmd_private.h:216:2)'
                                &sess->cipher.gcm_key);
                                 ~~~~~~~~~~~~ ^
/usr/include/intel-ipsec-mb.h:1005:41: note: expanded from macro 'IMB_AES256_GCM_PRE'
        ((_mgr)->gcm256_pre((_key_in), (_key_exp)))
                                        ^~~~~~~~
../drivers/crypto/aesni_mb/rte_aesni_mb_pmd.c:406:15: error: no member named 'pads' in 'struct aesni_mb_session::(anonymous at ../drivers/crypto/aesni_mb/aesni_mb_pmd_private.h:255:2)'
                        sess->auth.pads.inner, sess->auth.pads.outer,
                        ~~~~~~~~~~ ^
../drivers/crypto/aesni_mb/rte_aesni_mb_pmd.c:406:38: error: no member named 'pads' in 'struct aesni_mb_session::(anonymous at ../drivers/crypto/aesni_mb/aesni_mb_pmd_private.h:255:2)'
                        sess->auth.pads.inner, sess->auth.pads.outer,
                                               ~~~~~~~~~~ ^
../drivers/crypto/aesni_mb/rte_aesni_mb_pmd.c:412:15: error: no member named 'pads' in 'struct aesni_mb_session::(anonymous at ../drivers/crypto/aesni_mb/aesni_mb_pmd_private.h:255:2)'
                        sess->auth.pads.inner, sess->auth.pads.outer,
                        ~~~~~~~~~~ ^
../drivers/crypto/aesni_mb/rte_aesni_mb_pmd.c:412:38: error: no member named 'pads' in 'struct aesni_mb_session::(anonymous at ../drivers/crypto/aesni_mb/aesni_mb_pmd_private.h:255:2)'
                        sess->auth.pads.inner, sess->auth.pads.outer,
                                               ~~~~~~~~~~ ^
../drivers/crypto/aesni_mb/rte_aesni_mb_pmd.c:512:19: error: no member named 'expanded_aes_keys' in 'struct aesni_mb_session::(anonymous at ../drivers/crypto/aesni_mb/aesni_mb_pmd_private.h:216:2)'
                                        sess->cipher.expanded_aes_keys.encode,
                                        ~~~~~~~~~~~~ ^
/usr/include/intel-ipsec-mb.h:888:38: note: expanded from macro 'IMB_AES_KEYEXP_128'
        ((_mgr)->keyexp_128((_raw), (_enc), (_dec)))
                                     ^~~~
fatal error: too many errors emitted, stopping now [-ferror-limit=]
20 errors generated.
[1756/2547] Compiling C object drivers/libtmp_rte_rawdev_skeleton.a.p/raw_skeleton_skeleton_rawdev.c.o
[1757/2547] Compiling C object drivers/libtmp_rte_pmd_aesni_mb.a.p/crypto_aesni_mb_rte_aesni_mb_pmd_ops.c.o
FAILED: drivers/libtmp_rte_pmd_aesni_mb.a.p/crypto_aesni_mb_rte_aesni_mb_pmd_ops.c.o 
clang -Idrivers/libtmp_rte_pmd_aesni_mb.a.p -Idrivers -I../drivers -Idrivers/crypto/aesni_mb -I../drivers/crypto/aesni_mb -Ilib/librte_cryptodev -I../lib/librte_cryptodev -I. -I.. -Iconfig -I../config -Ilib/librte_eal/include -I../lib/librte_eal/include -Ilib/librte_eal/linux/include -I../lib/librte_eal/linux/include -Ilib/librte_eal/x86/include -I../lib/librte_eal/x86/include -Ilib/librte_eal/common -I../lib/librte_eal/common -Ilib/librte_eal -I../lib/librte_eal -Ilib/librte_kvargs -I../lib/librte_kvargs -Ilib/librte_metrics -I../lib/librte_metrics -Ilib/librte_telemetry -I../lib/librte_telemetry -Ilib/librte_mbuf -I../lib/librte_mbuf -Ilib/librte_mempool -I../lib/librte_mempool -Ilib/librte_ring -I../lib/librte_ring -Idrivers/bus/vdev -I../drivers/bus/vdev -Ilib/librte_net -I../lib/librte_net -Ilib/librte_security -I../lib/librte_security -Xclang -fcolor-diagnostics -pipe -D_FILE_OFFSET_BITS=64 -Wall -Winvalid-pch -Werror -O3 -include rte_config.h -Wextra -Wcast-qual -Wdeprecated -Wformat-nonliteral -Wformat-security -Wmissing-declarations -Wmissing-prototypes -Wnested-externs -Wold-style-definition -Wpointer-arith -Wsign-compare -Wstrict-prototypes -Wundef -Wwrite-strings -Wno-address-of-packed-member -Wno-missing-field-initializers -D_GNU_SOURCE -fPIC -march=native -DALLOW_EXPERIMENTAL_API -DALLOW_INTERNAL_API -MD -MQ drivers/libtmp_rte_pmd_aesni_mb.a.p/crypto_aesni_mb_rte_aesni_mb_pmd_ops.c.o -MF drivers/libtmp_rte_pmd_aesni_mb.a.p/crypto_aesni_mb_rte_aesni_mb_pmd_ops.c.o.d -o drivers/libtmp_rte_pmd_aesni_mb.a.p/crypto_aesni_mb_rte_aesni_mb_pmd_ops.c.o -c ../drivers/crypto/aesni_mb/rte_aesni_mb_pmd_ops.c
In file included from ../drivers/crypto/aesni_mb/rte_aesni_mb_pmd_ops.c:13:
../drivers/crypto/aesni_mb/aesni_mb_pmd_private.h:247:4: error: unknown type name 'snow3g_key_schedule_t'
                        snow3g_key_schedule_t pKeySched_snow3g_cipher;
                        ^
../drivers/crypto/aesni_mb/aesni_mb_pmd_private.h:249:4: error: unknown type name 'kasumi_key_sched_t'; did you mean 'des_keysched_t'?
                        kasumi_key_sched_t pKeySched_kasumi_cipher;
                        ^~~~~~~~~~~~~~~~~~
                        des_keysched_t
/usr/include/intel-ipsec-mb.h:633:15: note: 'des_keysched_t' declared here
typedef int (*des_keysched_t)(uint64_t *, const void *);
              ^
In file included from ../drivers/crypto/aesni_mb/rte_aesni_mb_pmd_ops.c:13:
../drivers/crypto/aesni_mb/aesni_mb_pmd_private.h:292:4: error: unknown type name 'snow3g_key_schedule_t'
                        snow3g_key_schedule_t pKeySched_snow3g_auth;
                        ^
../drivers/crypto/aesni_mb/aesni_mb_pmd_private.h:294:4: error: unknown type name 'kasumi_key_sched_t'; did you mean 'des_keysched_t'?
                        kasumi_key_sched_t pKeySched_kasumi_auth;
                        ^~~~~~~~~~~~~~~~~~
                        des_keysched_t
/usr/include/intel-ipsec-mb.h:633:15: note: 'des_keysched_t' declared here
typedef int (*des_keysched_t)(uint64_t *, const void *);
              ^
4 errors generated.
[1758/2547] Compiling C object drivers/libtmp_rte_pmd_aesni_gcm.a.p/crypto_aesni_gcm_aesni_gcm_pmd_ops.c.o
[1759/2547] Generating rte_rawdev_ntb.sym_chk with a meson_exe.py custom command
[1760/2547] Generating rte_rawdev_octeontx2_ep.sym_chk with a meson_exe.py custom command
[1761/2547] Compiling C object drivers/libtmp_rte_pmd_caam_jr.a.p/crypto_caam_jr_caam_jr_capabilities.c.o
[1762/2547] Compiling C object drivers/libtmp_rte_pmd_aesni_gcm.a.p/crypto_aesni_gcm_aesni_gcm_pmd.c.o
[1763/2547] Compiling C object drivers/libtmp_rte_pmd_caam_jr.a.p/crypto_caam_jr_caam_jr_hw.c.o
[1764/2547] Compiling C object drivers/libtmp_rte_pmd_caam_jr.a.p/crypto_caam_jr_caam_jr.c.o
ninja: build stopped: subcommand failed




*Build Failed #11:
OS: SUSE15-64
Target: x86_64-gcc-static
FAILED: drivers/a715181@@tmp_rte_pmd_aesni_mb at sta/crypto_aesni_mb_rte_aesni_mb_pmd.c.o 
gcc -Idrivers/a715181@@tmp_rte_pmd_aesni_mb at sta -Idrivers -I../drivers -Idrivers/crypto/aesni_mb -I../drivers/crypto/aesni_mb -Ilib/librte_cryptodev -I../lib/librte_cryptodev -I. -I.. -Iconfig -I../config -Ilib/librte_eal/include -I../lib/librte_eal/include -Ilib/librte_eal/linux/include -I../lib/librte_eal/linux/include -Ilib/librte_eal/x86/include -I../lib/librte_eal/x86/include -Ilib/librte_eal/common -I../lib/librte_eal/common -Ilib/librte_eal -I../lib/librte_eal -Ilib/librte_kvargs -I../lib/librte_kvargs -Ilib/librte_metrics -I../lib/librte_metrics -Ilib/librte_telemetry -I../lib/librte_telemetry -Ilib/librte_mbuf -I../lib/librte_mbuf -Ilib/librte_mempool -I../lib/librte_mempool -Ilib/librte_ring -I../lib/librte_ring -Idrivers/bus/vdev -I../drivers/bus/vdev -Ilib/librte_net -I../lib/librte_net -Ilib/librte_security -I../lib/librte_security -fdiagnostics-color=always -pipe -D_FILE_OFFSET_BITS=64 -Wall -Winvalid-pch -Werror -O3 -include rte_config.h -Wextra -Wcast-qual -Wdeprecated -Wformat-nonliteral -Wformat-security -Wmissing-declarations -Wmissing-prototypes -Wnested-externs -Wold-style-definition -Wpointer-arith -Wsign-compare -Wstrict-prototypes -Wundef -Wwrite-strings -Wno-missing-field-initializers -D_GNU_SOURCE -fPIC -march=native -DALLOW_EXPERIMENTAL_API -DALLOW_INTERNAL_API -Wno-format-truncation -MD -MQ 'drivers/a715181@@tmp_rte_pmd_aesni_mb at sta/crypto_aesni_mb_rte_aesni_mb_pmd.c.o' -MF 'drivers/a715181@@tmp_rte_pmd_aesni_mb at sta/crypto_aesni_mb_rte_aesni_mb_pmd.c.o.d' -o 'drivers/a715181@@tmp_rte_pmd_aesni_mb at sta/crypto_aesni_mb_rte_aesni_mb_pmd.c.o' -c ../drivers/crypto/aesni_mb/rte_aesni_mb_pmd.c
In file included from ../drivers/crypto/aesni_mb/rte_aesni_mb_pmd.c:17:0:
../drivers/crypto/aesni_mb/aesni_mb_pmd_private.h:247:4: error: unknown type name ‘snow3g_key_schedule_t’
    snow3g_key_schedule_t pKeySched_snow3g_cipher;
    ^~~~~~~~~~~~~~~~~~~~~
../drivers/crypto/aesni_mb/aesni_mb_pmd_private.h:249:4: error: unknown type name ‘kasumi_key_sched_t’
    kasumi_key_sched_t pKeySched_kasumi_cipher;
    ^~~~~~~~~~~~~~~~~~
../drivers/crypto/aesni_mb/aesni_mb_pmd_private.h:292:4: error: unknown type name ‘snow3g_key_schedule_t’
    snow3g_key_schedule_t pKeySched_snow3g_auth;
    ^~~~~~~~~~~~~~~~~~~~~
../drivers/crypto/aesni_mb/aesni_mb_pmd_private.h:294:4: error: unknown type name ‘kasumi_key_sched_t’
    kasumi_key_sched_t pKeySched_kasumi_auth;
    ^~~~~~~~~~~~~~~~~~
[1761/2547] Generating rte_rawdev_ntb.sym_chk with a meson_exe.py custom command
[1762/2547] Compiling C object 'drivers/a715181@@tmp_rte_pmd_aesni_mb at sta/crypto_aesni_mb_rte_aesni_mb_pmd_ops.c.o'
FAILED: drivers/a715181@@tmp_rte_pmd_aesni_mb at sta/crypto_aesni_mb_rte_aesni_mb_pmd_ops.c.o 
gcc -Idrivers/a715181@@tmp_rte_pmd_aesni_mb at sta -Idrivers -I../drivers -Idrivers/crypto/aesni_mb -I../drivers/crypto/aesni_mb -Ilib/librte_cryptodev -I../lib/librte_cryptodev -I. -I.. -Iconfig -I../config -Ilib/librte_eal/include -I../lib/librte_eal/include -Ilib/librte_eal/linux/include -I../lib/librte_eal/linux/include -Ilib/librte_eal/x86/include -I../lib/librte_eal/x86/include -Ilib/librte_eal/common -I../lib/librte_eal/common -Ilib/librte_eal -I../lib/librte_eal -Ilib/librte_kvargs -I../lib/librte_kvargs -Ilib/librte_metrics -I../lib/librte_metrics -Ilib/librte_telemetry -I../lib/librte_telemetry -Ilib/librte_mbuf -I../lib/librte_mbuf -Ilib/librte_mempool -I../lib/librte_mempool -Ilib/librte_ring -I../lib/librte_ring -Idrivers/bus/vdev -I../drivers/bus/vdev -Ilib/librte_net -I../lib/librte_net -Ilib/librte_security -I../lib/librte_security -fdiagnostics-color=always -pipe -D_FILE_OFFSET_BITS=64 -Wall -Winvalid-pch -Werror -O3 -include rte_config.h -Wextra -Wcast-qual -Wdeprecated -Wformat-nonliteral -Wformat-security -Wmissing-declarations -Wmissing-prototypes -Wnested-externs -Wold-style-definition -Wpointer-arith -Wsign-compare -Wstrict-prototypes -Wundef -Wwrite-strings -Wno-missing-field-initializers -D_GNU_SOURCE -fPIC -march=native -DALLOW_EXPERIMENTAL_API -DALLOW_INTERNAL_API -Wno-format-truncation -MD -MQ 'drivers/a715181@@tmp_rte_pmd_aesni_mb at sta/crypto_aesni_mb_rte_aesni_mb_pmd_ops.c.o' -MF 'drivers/a715181@@tmp_rte_pmd_aesni_mb at sta/crypto_aesni_mb_rte_aesni_mb_pmd_ops.c.o.d' -o 'drivers/a715181@@tmp_rte_pmd_aesni_mb at sta/crypto_aesni_mb_rte_aesni_mb_pmd_ops.c.o' -c ../drivers/crypto/aesni_mb/rte_aesni_mb_pmd_ops.c
In file included from ../drivers/crypto/aesni_mb/rte_aesni_mb_pmd_ops.c:13:0:
../drivers/crypto/aesni_mb/aesni_mb_pmd_private.h:247:4: error: unknown type name ‘snow3g_key_schedule_t’
    snow3g_key_schedule_t pKeySched_snow3g_cipher;
    ^~~~~~~~~~~~~~~~~~~~~
../drivers/crypto/aesni_mb/aesni_mb_pmd_private.h:249:4: error: unknown type name ‘kasumi_key_sched_t’
    kasumi_key_sched_t pKeySched_kasumi_cipher;
    ^~~~~~~~~~~~~~~~~~
../drivers/crypto/aesni_mb/aesni_mb_pmd_private.h:292:4: error: unknown type name ‘snow3g_key_schedule_t’
    snow3g_key_schedule_t pKeySched_snow3g_auth;
    ^~~~~~~~~~~~~~~~~~~~~
../drivers/crypto/aesni_mb/aesni_mb_pmd_private.h:294:4: error: unknown type name ‘kasumi_key_sched_t’
    kasumi_key_sched_t pKeySched_kasumi_auth;
    ^~~~~~~~~~~~~~~~~~
[1763/2547] Generating rte_rawdev_dpaa2_qdma.sym_chk with a meson_exe.py custom command
[1764/2547] Generating rte_rawdev_octeontx2_ep.sym_chk with a meson_exe.py custom command
[1765/2547] Compiling C object 'drivers/a715181@@tmp_rte_pmd_caam_jr at sta/crypto_caam_jr_caam_jr_capabilities.c.o'
[1766/2547] Generating rte_rawdev_skeleton.sym_chk with a meson_exe.py custom command
[1767/2547] Compiling C object 'drivers/a715181@@tmp_rte_pmd_caam_jr at sta/crypto_caam_jr_caam_jr_hw.c.o'
[1768/2547] Compiling C object 'drivers/a715181@@tmp_rte_pmd_caam_jr at sta/crypto_caam_jr_caam_jr_uio.c.o'
[1769/2547] Compiling C object 'drivers/a715181@@tmp_rte_pmd_aesni_gcm at sta/crypto_aesni_gcm_aesni_gcm_pmd.c.o'
ninja: build stopped: subcommand failed




*Build Failed #12:
OS: UB1804-64
Target: x86_64-gcc-static
FAILED: drivers/a715181@@tmp_rte_pmd_aesni_mb at sta/crypto_aesni_mb_rte_aesni_mb_pmd.c.o 
gcc -Idrivers/a715181@@tmp_rte_pmd_aesni_mb at sta -Idrivers -I../drivers -Idrivers/crypto/aesni_mb -I../drivers/crypto/aesni_mb -Ilib/librte_cryptodev -I../lib/librte_cryptodev -I. -I../ -Iconfig -I../config -Ilib/librte_eal/include -I../lib/librte_eal/include -Ilib/librte_eal/linux/include -I../lib/librte_eal/linux/include -Ilib/librte_eal/x86/include -I../lib/librte_eal/x86/include -Ilib/librte_eal/common -I../lib/librte_eal/common -Ilib/librte_eal -I../lib/librte_eal -Ilib/librte_kvargs -I../lib/librte_kvargs -Ilib/librte_telemetry/../librte_metrics -I../lib/librte_telemetry/../librte_metrics -Ilib/librte_telemetry -I../lib/librte_telemetry -Ilib/librte_mbuf -I../lib/librte_mbuf -Ilib/librte_mempool -I../lib/librte_mempool -Ilib/librte_ring -I../lib/librte_ring -Idrivers/bus/vdev -I../drivers/bus/vdev -Ilib/librte_net -I../lib/librte_net -Ilib/librte_security -I../lib/librte_security -fdiagnostics-color=always -pipe -D_FILE_OFFSET_BITS=64 -Wall -Winvalid-pch -Werror -O3 -include rte_config.h -Wextra -Wcast-qual -Wdeprecated -Wformat-nonliteral -Wformat-security -Wmissing-declarations -Wmissing-prototypes -Wnested-externs -Wold-style-definition -Wpointer-arith -Wsign-compare -Wstrict-prototypes -Wundef -Wwrite-strings -Wno-packed-not-aligned -Wno-missing-field-initializers -D_GNU_SOURCE -fPIC -march=native -mno-avx512f -DALLOW_EXPERIMENTAL_API -DALLOW_INTERNAL_API -Wno-format-truncation -MD -MQ 'drivers/a715181@@tmp_rte_pmd_aesni_mb at sta/crypto_aesni_mb_rte_aesni_mb_pmd.c.o' -MF 'drivers/a715181@@tmp_rte_pmd_aesni_mb at sta/crypto_aesni_mb_rte_aesni_mb_pmd.c.o.d' -o 'drivers/a715181@@tmp_rte_pmd_aesni_mb at sta/crypto_aesni_mb_rte_aesni_mb_pmd.c.o' -c ../drivers/crypto/aesni_mb/rte_aesni_mb_pmd.c
In file included from ../drivers/crypto/aesni_mb/rte_aesni_mb_pmd.c:17:
../drivers/crypto/aesni_mb/aesni_mb_pmd_private.h:60:3: error: subscripted value is neither array nor pointer nor vector
   [IMB_AUTH_SNOW3G_UIA2_BITLEN] = 16
   ^
../drivers/crypto/aesni_mb/aesni_mb_pmd_private.h:61:3: error: subscripted value is neither array nor pointer nor vector
   [IMB_AUTH_KASUMI_UIA1]  = 16
   ^
../drivers/crypto/aesni_mb/aesni_mb_pmd_private.h:96:3: error: subscripted value is neither array nor pointer nor vector
   [IMB_AUTH_SNOW3G_UIA2_BITLEN] = 4
   ^
../drivers/crypto/aesni_mb/aesni_mb_pmd_private.h:97:3: error: subscripted value is neither array nor pointer nor vector
   [IMB_AUTH_KASUMI_UIA1]  = 4
   ^
../drivers/crypto/aesni_mb/aesni_mb_pmd_private.h:95:32: error: initialization of ‘unsigned int’ from ‘const unsigned int *’ makes integer from pointer without a cast [-Werror=int-conversion]
   [IMB_AUTH_ZUC_EIA3_BITLEN] = 4
                                ^
../drivers/crypto/aesni_mb/aesni_mb_pmd_private.h:95:32: note: (near initialization for ‘auth_truncated_digest_byte_lengths[20]’)
../drivers/crypto/aesni_mb/aesni_mb_pmd_private.h:95:32: error: initializer element is not constant
../drivers/crypto/aesni_mb/aesni_mb_pmd_private.h:95:32: note: (near initialization for ‘auth_truncated_digest_byte_lengths[20]’)
../drivers/crypto/aesni_mb/aesni_mb_pmd_private.h:133:3: error: subscripted value is neither array nor pointer nor vector
   [IMB_AUTH_SNOW3G_UIA2_BITLEN] = 4
   ^
../drivers/crypto/aesni_mb/aesni_mb_pmd_private.h:134:3: error: subscripted value is neither array nor pointer nor vector
   [IMB_AUTH_KASUMI_UIA1]  = 4
   ^
../drivers/crypto/aesni_mb/aesni_mb_pmd_private.h:132:32: error: initialization of ‘unsigned int’ from ‘const unsigned int *’ makes integer from pointer without a cast [-Werror=int-conversion]
   [IMB_AUTH_ZUC_EIA3_BITLEN] = 4
                                ^
../drivers/crypto/aesni_mb/aesni_mb_pmd_private.h:132:32: note: (near initialization for ‘auth_digest_byte_lengths[20]’)
../drivers/crypto/aesni_mb/aesni_mb_pmd_private.h:132:32: error: initializer element is not constant
../drivers/crypto/aesni_mb/aesni_mb_pmd_private.h:132:32: note: (near initialization for ‘auth_digest_byte_lengths[20]’)
cc1: all warnings being treated as errors
[1759/2567] Generating rte_rawdev_ntb.sym_chk with a meson_exe.py custom command.
[1760/2567] Compiling C object 'drivers/a715181@@tmp_rte_pmd_aesni_mb at sta/crypto_aesni_mb_rte_aesni_mb_pmd_ops.c.o'.
FAILED: drivers/a715181@@tmp_rte_pmd_aesni_mb at sta/crypto_aesni_mb_rte_aesni_mb_pmd_ops.c.o 
gcc -Idrivers/a715181@@tmp_rte_pmd_aesni_mb at sta -Idrivers -I../drivers -Idrivers/crypto/aesni_mb -I../drivers/crypto/aesni_mb -Ilib/librte_cryptodev -I../lib/librte_cryptodev -I. -I../ -Iconfig -I../config -Ilib/librte_eal/include -I../lib/librte_eal/include -Ilib/librte_eal/linux/include -I../lib/librte_eal/linux/include -Ilib/librte_eal/x86/include -I../lib/librte_eal/x86/include -Ilib/librte_eal/common -I../lib/librte_eal/common -Ilib/librte_eal -I../lib/librte_eal -Ilib/librte_kvargs -I../lib/librte_kvargs -Ilib/librte_telemetry/../librte_metrics -I../lib/librte_telemetry/../librte_metrics -Ilib/librte_telemetry -I../lib/librte_telemetry -Ilib/librte_mbuf -I../lib/librte_mbuf -Ilib/librte_mempool -I../lib/librte_mempool -Ilib/librte_ring -I../lib/librte_ring -Idrivers/bus/vdev -I../drivers/bus/vdev -Ilib/librte_net -I../lib/librte_net -Ilib/librte_security -I../lib/librte_security -fdiagnostics-color=always -pipe -D_FILE_OFFSET_BITS=64 -Wall -Winvalid-pch -Werror -O3 -include rte_config.h -Wextra -Wcast-qual -Wdeprecated -Wformat-nonliteral -Wformat-security -Wmissing-declarations -Wmissing-prototypes -Wnested-externs -Wold-style-definition -Wpointer-arith -Wsign-compare -Wstrict-prototypes -Wundef -Wwrite-strings -Wno-packed-not-aligned -Wno-missing-field-initializers -D_GNU_SOURCE -fPIC -march=native -mno-avx512f -DALLOW_EXPERIMENTAL_API -DALLOW_INTERNAL_API -Wno-format-truncation -MD -MQ 'drivers/a715181@@tmp_rte_pmd_aesni_mb at sta/crypto_aesni_mb_rte_aesni_mb_pmd_ops.c.o' -MF 'drivers/a715181@@tmp_rte_pmd_aesni_mb at sta/crypto_aesni_mb_rte_aesni_mb_pmd_ops.c.o.d' -o 'drivers/a715181@@tmp_rte_pmd_aesni_mb at sta/crypto_aesni_mb_rte_aesni_mb_pmd_ops.c.o' -c ../drivers/crypto/aesni_mb/rte_aesni_mb_pmd_ops.c
In file included from ../drivers/crypto/aesni_mb/rte_aesni_mb_pmd_ops.c:13:
../drivers/crypto/aesni_mb/aesni_mb_pmd_private.h:60:3: error: subscripted value is neither array nor pointer nor vector
   [IMB_AUTH_SNOW3G_UIA2_BITLEN] = 16
   ^
../drivers/crypto/aesni_mb/aesni_mb_pmd_private.h:61:3: error: subscripted value is neither array nor pointer nor vector
   [IMB_AUTH_KASUMI_UIA1]  = 16
   ^
../drivers/crypto/aesni_mb/aesni_mb_pmd_private.h:96:3: error: subscripted value is neither array nor pointer nor vector
   [IMB_AUTH_SNOW3G_UIA2_BITLEN] = 4
   ^
../drivers/crypto/aesni_mb/aesni_mb_pmd_private.h:97:3: error: subscripted value is neither array nor pointer nor vector
   [IMB_AUTH_KASUMI_UIA1]  = 4
   ^
../drivers/crypto/aesni_mb/aesni_mb_pmd_private.h:95:32: error: initialization of ‘unsigned int’ from ‘const unsigned int *’ makes integer from pointer without a cast [-Werror=int-conversion]
   [IMB_AUTH_ZUC_EIA3_BITLEN] = 4
                                ^
../drivers/crypto/aesni_mb/aesni_mb_pmd_private.h:95:32: note: (near initialization for ‘auth_truncated_digest_byte_lengths[20]’)
../drivers/crypto/aesni_mb/aesni_mb_pmd_private.h:95:32: error: initializer element is not constant
../drivers/crypto/aesni_mb/aesni_mb_pmd_private.h:95:32: note: (near initialization for ‘auth_truncated_digest_byte_lengths[20]’)
../drivers/crypto/aesni_mb/aesni_mb_pmd_private.h:133:3: error: subscripted value is neither array nor pointer nor vector
   [IMB_AUTH_SNOW3G_UIA2_BITLEN] = 4
   ^
../drivers/crypto/aesni_mb/aesni_mb_pmd_private.h:134:3: error: subscripted value is neither array nor pointer nor vector
   [IMB_AUTH_KASUMI_UIA1]  = 4
   ^
../drivers/crypto/aesni_mb/aesni_mb_pmd_private.h:132:32: error: initialization of ‘unsigned int’ from ‘const unsigned int *’ makes integer from pointer without a cast [-Werror=int-conversion]
   [IMB_AUTH_ZUC_EIA3_BITLEN] = 4
                                ^
../drivers/crypto/aesni_mb/aesni_mb_pmd_private.h:132:32: note: (near initialization for ‘auth_digest_byte_lengths[20]’)
../drivers/crypto/aesni_mb/aesni_mb_pmd_private.h:132:32: error: initializer element is not constant
../drivers/crypto/aesni_mb/aesni_mb_pmd_private.h:132:32: note: (near initialization for ‘auth_digest_byte_lengths[20]’)
cc1: all warnings being treated as errors
[1761/2567] Linking target drivers/librte_pmd_virtio.so.21.0.
[1762/2567] Generating rte_rawdev_octeontx2_ep.sym_chk with a meson_exe.py custom command.
[1763/2567] Compiling C object 'drivers/a715181@@tmp_rte_pmd_caam_jr at sta/crypto_caam_jr_caam_jr_capabilities.c.o'.
[1764/2567] Generating rte_rawdev_skeleton.sym_chk with a meson_exe.py custom command.
[1765/2567] Compiling C object 'drivers/a715181@@tmp_rte_pmd_caam_jr at sta/crypto_caam_jr_caam_jr_uio.c.o'.
[1766/2567] Compiling C object 'drivers/a715181@@tmp_rte_pmd_caam_jr at sta/crypto_caam_jr_caam_jr_hw.c.o'.
[1767/2567] Compiling C object 'drivers/a715181@@tmp_rte_pmd_aesni_gcm at sta/crypto_aesni_gcm_aesni_gcm_pmd.c.o'.
ninja: build stopped: subcommand failed




*Build Failed #13:
OS: UB2004-64
Target: x86_64-clang-static
FAILED: drivers/a715181@@tmp_rte_pmd_aesni_mb at sta/crypto_aesni_mb_rte_aesni_mb_pmd.c.o 
clang -Idrivers/a715181@@tmp_rte_pmd_aesni_mb at sta -Idrivers -I../drivers -Idrivers/crypto/aesni_mb -I../drivers/crypto/aesni_mb -Ilib/librte_cryptodev -I../lib/librte_cryptodev -I. -I../ -Iconfig -I../config -Ilib/librte_eal/include -I../lib/librte_eal/include -Ilib/librte_eal/linux/include -I../lib/librte_eal/linux/include -Ilib/librte_eal/x86/include -I../lib/librte_eal/x86/include -Ilib/librte_eal/common -I../lib/librte_eal/common -Ilib/librte_eal -I../lib/librte_eal -Ilib/librte_kvargs -I../lib/librte_kvargs -Ilib/librte_telemetry/../librte_metrics -I../lib/librte_telemetry/../librte_metrics -Ilib/librte_telemetry -I../lib/librte_telemetry -Ilib/librte_mbuf -I../lib/librte_mbuf -Ilib/librte_mempool -I../lib/librte_mempool -Ilib/librte_ring -I../lib/librte_ring -Idrivers/bus/vdev -I../drivers/bus/vdev -Ilib/librte_net -I../lib/librte_net -Ilib/librte_security -I../lib/librte_security -Xclang -fcolor-diagnostics -pipe -D_FILE_OFFSET_BITS=64 -Wall -Winvalid-pch -Werror -O3 -include rte_config.h -Wextra -Wcast-qual -Wdeprecated -Wformat-nonliteral -Wformat-security -Wmissing-declarations -Wmissing-prototypes -Wnested-externs -Wold-style-definition -Wpointer-arith -Wsign-compare -Wstrict-prototypes -Wundef -Wwrite-strings -Wno-address-of-packed-member -Wno-missing-field-initializers -D_GNU_SOURCE -fPIC -march=native -DALLOW_EXPERIMENTAL_API -DALLOW_INTERNAL_API -MD -MQ 'drivers/a715181@@tmp_rte_pmd_aesni_mb at sta/crypto_aesni_mb_rte_aesni_mb_pmd.c.o' -MF 'drivers/a715181@@tmp_rte_pmd_aesni_mb at sta/crypto_aesni_mb_rte_aesni_mb_pmd.c.o.d' -o 'drivers/a715181@@tmp_rte_pmd_aesni_mb at sta/crypto_aesni_mb_rte_aesni_mb_pmd.c.o' -c ../drivers/crypto/aesni_mb/rte_aesni_mb_pmd.c
In file included from ../drivers/crypto/aesni_mb/rte_aesni_mb_pmd.c:17:
../drivers/crypto/aesni_mb/aesni_mb_pmd_private.h:60:3: error: subscripted value is not an array, pointer, or vector
                [IMB_AUTH_SNOW3G_UIA2_BITLEN]   = 16
                ^~~~~~~~~~~~~~~~~~~~~~~~~~~~
../drivers/crypto/aesni_mb/aesni_mb_pmd_private.h:61:3: error: subscripted value is not an array, pointer, or vector
                [IMB_AUTH_KASUMI_UIA1]          = 16
                ^~~~~~~~~~~~~~~~~~~~~
../drivers/crypto/aesni_mb/aesni_mb_pmd_private.h:96:3: error: subscripted value is not an array, pointer, or vector
                [IMB_AUTH_SNOW3G_UIA2_BITLEN]   = 4
                ^~~~~~~~~~~~~~~~~~~~~~~~~~~~
../drivers/crypto/aesni_mb/aesni_mb_pmd_private.h:97:3: error: subscripted value is not an array, pointer, or vector
                [IMB_AUTH_KASUMI_UIA1]          = 4
                ^~~~~~~~~~~~~~~~~~~~~
../drivers/crypto/aesni_mb/aesni_mb_pmd_private.h:133:3: error: subscripted value is not an array, pointer, or vector
                [IMB_AUTH_SNOW3G_UIA2_BITLEN]   = 4
                ^~~~~~~~~~~~~~~~~~~~~~~~~~~~
../drivers/crypto/aesni_mb/aesni_mb_pmd_private.h:134:3: error: subscripted value is not an array, pointer, or vector
                [IMB_AUTH_KASUMI_UIA1]          = 4
                ^~~~~~~~~~~~~~~~~~~~~
6 errors generated.
[1772/2569] Linking target drivers/librte_rawdev_octeontx2_ep.so.21.0.
[1773/2569] Compiling C object 'drivers/a715181@@tmp_rte_pmd_aesni_mb at sta/crypto_aesni_mb_rte_aesni_mb_pmd_ops.c.o'.
FAILED: drivers/a715181@@tmp_rte_pmd_aesni_mb at sta/crypto_aesni_mb_rte_aesni_mb_pmd_ops.c.o 
clang -Idrivers/a715181@@tmp_rte_pmd_aesni_mb at sta -Idrivers -I../drivers -Idrivers/crypto/aesni_mb -I../drivers/crypto/aesni_mb -Ilib/librte_cryptodev -I../lib/librte_cryptodev -I. -I../ -Iconfig -I../config -Ilib/librte_eal/include -I../lib/librte_eal/include -Ilib/librte_eal/linux/include -I../lib/librte_eal/linux/include -Ilib/librte_eal/x86/include -I../lib/librte_eal/x86/include -Ilib/librte_eal/common -I../lib/librte_eal/common -Ilib/librte_eal -I../lib/librte_eal -Ilib/librte_kvargs -I../lib/librte_kvargs -Ilib/librte_telemetry/../librte_metrics -I../lib/librte_telemetry/../librte_metrics -Ilib/librte_telemetry -I../lib/librte_telemetry -Ilib/librte_mbuf -I../lib/librte_mbuf -Ilib/librte_mempool -I../lib/librte_mempool -Ilib/librte_ring -I../lib/librte_ring -Idrivers/bus/vdev -I../drivers/bus/vdev -Ilib/librte_net -I../lib/librte_net -Ilib/librte_security -I../lib/librte_security -Xclang -fcolor-diagnostics -pipe -D_FILE_OFFSET_BITS=64 -Wall -Winvalid-pch -Werror -O3 -include rte_config.h -Wextra -Wcast-qual -Wdeprecated -Wformat-nonliteral -Wformat-security -Wmissing-declarations -Wmissing-prototypes -Wnested-externs -Wold-style-definition -Wpointer-arith -Wsign-compare -Wstrict-prototypes -Wundef -Wwrite-strings -Wno-address-of-packed-member -Wno-missing-field-initializers -D_GNU_SOURCE -fPIC -march=native -DALLOW_EXPERIMENTAL_API -DALLOW_INTERNAL_API -MD -MQ 'drivers/a715181@@tmp_rte_pmd_aesni_mb at sta/crypto_aesni_mb_rte_aesni_mb_pmd_ops.c.o' -MF 'drivers/a715181@@tmp_rte_pmd_aesni_mb at sta/crypto_aesni_mb_rte_aesni_mb_pmd_ops.c.o.d' -o 'drivers/a715181@@tmp_rte_pmd_aesni_mb at sta/crypto_aesni_mb_rte_aesni_mb_pmd_ops.c.o' -c ../drivers/crypto/aesni_mb/rte_aesni_mb_pmd_ops.c
In file included from ../drivers/crypto/aesni_mb/rte_aesni_mb_pmd_ops.c:13:
../drivers/crypto/aesni_mb/aesni_mb_pmd_private.h:60:3: error: subscripted value is not an array, pointer, or vector
                [IMB_AUTH_SNOW3G_UIA2_BITLEN]   = 16
                ^~~~~~~~~~~~~~~~~~~~~~~~~~~~
../drivers/crypto/aesni_mb/aesni_mb_pmd_private.h:61:3: error: subscripted value is not an array, pointer, or vector
                [IMB_AUTH_KASUMI_UIA1]          = 16
                ^~~~~~~~~~~~~~~~~~~~~
../drivers/crypto/aesni_mb/aesni_mb_pmd_private.h:96:3: error: subscripted value is not an array, pointer, or vector
                [IMB_AUTH_SNOW3G_UIA2_BITLEN]   = 4
                ^~~~~~~~~~~~~~~~~~~~~~~~~~~~
../drivers/crypto/aesni_mb/aesni_mb_pmd_private.h:97:3: error: subscripted value is not an array, pointer, or vector
                [IMB_AUTH_KASUMI_UIA1]          = 4
                ^~~~~~~~~~~~~~~~~~~~~
../drivers/crypto/aesni_mb/aesni_mb_pmd_private.h:133:3: error: subscripted value is not an array, pointer, or vector
                [IMB_AUTH_SNOW3G_UIA2_BITLEN]   = 4
                ^~~~~~~~~~~~~~~~~~~~~~~~~~~~
../drivers/crypto/aesni_mb/aesni_mb_pmd_private.h:134:3: error: subscripted value is not an array, pointer, or vector
                [IMB_AUTH_KASUMI_UIA1]          = 4
                ^~~~~~~~~~~~~~~~~~~~~
6 errors generated.
[1774/2569] Compiling C object 'drivers/a715181@@tmp_rte_pmd_ccp at sta/crypto_ccp_ccp_pci.c.o'.
[1775/2569] Compiling C object 'drivers/a715181@@tmp_rte_pmd_caam_jr at sta/crypto_caam_jr_caam_jr_capabilities.c.o'.
[1776/2569] Generating rte_rawdev_skeleton.sym_chk with a meson_exe.py custom command.
[1777/2569] Compiling C object 'drivers/a715181@@tmp_rte_pmd_caam_jr at sta/crypto_caam_jr_caam_jr_uio.c.o'.
[1778/2569] Compiling C object 'drivers/a715181@@tmp_rte_pmd_caam_jr at sta/crypto_caam_jr_caam_jr_hw.c.o'.
[1779/2569] Compiling C object 'drivers/a715181@@tmp_rte_pmd_aesni_gcm at sta/crypto_aesni_gcm_aesni_gcm_pmd.c.o'.
[1780/2569] Compiling C object 'drivers/a715181@@tmp_rte_pmd_caam_jr at sta/crypto_caam_jr_caam_jr.c.o'.
ninja: build stopped: subcommand failed




*Build Failed #14:
OS: UB2004-64
Target: x86_64-gcc-static
FAILED: drivers/a715181@@tmp_rte_pmd_aesni_mb at sta/crypto_aesni_mb_rte_aesni_mb_pmd.c.o 
gcc -Idrivers/a715181@@tmp_rte_pmd_aesni_mb at sta -Idrivers -I../drivers -Idrivers/crypto/aesni_mb -I../drivers/crypto/aesni_mb -Ilib/librte_cryptodev -I../lib/librte_cryptodev -I. -I../ -Iconfig -I../config -Ilib/librte_eal/include -I../lib/librte_eal/include -Ilib/librte_eal/linux/include -I../lib/librte_eal/linux/include -Ilib/librte_eal/x86/include -I../lib/librte_eal/x86/include -Ilib/librte_eal/common -I../lib/librte_eal/common -Ilib/librte_eal -I../lib/librte_eal -Ilib/librte_kvargs -I../lib/librte_kvargs -Ilib/librte_telemetry/../librte_metrics -I../lib/librte_telemetry/../librte_metrics -Ilib/librte_telemetry -I../lib/librte_telemetry -Ilib/librte_mbuf -I../lib/librte_mbuf -Ilib/librte_mempool -I../lib/librte_mempool -Ilib/librte_ring -I../lib/librte_ring -Idrivers/bus/vdev -I../drivers/bus/vdev -Ilib/librte_net -I../lib/librte_net -Ilib/librte_security -I../lib/librte_security -fdiagnostics-color=always -pipe -D_FILE_OFFSET_BITS=64 -Wall -Winvalid-pch -Werror -O3 -include rte_config.h -Wextra -Wcast-qual -Wdeprecated -Wformat-nonliteral -Wformat-security -Wmissing-declarations -Wmissing-prototypes -Wnested-externs -Wold-style-definition -Wpointer-arith -Wsign-compare -Wstrict-prototypes -Wundef -Wwrite-strings -Wno-address-of-packed-member -Wno-packed-not-aligned -Wno-missing-field-initializers -Wno-zero-length-bounds -D_GNU_SOURCE -fPIC -march=native -DALLOW_EXPERIMENTAL_API -DALLOW_INTERNAL_API -Wno-format-truncation -MD -MQ 'drivers/a715181@@tmp_rte_pmd_aesni_mb at sta/crypto_aesni_mb_rte_aesni_mb_pmd.c.o' -MF 'drivers/a715181@@tmp_rte_pmd_aesni_mb at sta/crypto_aesni_mb_rte_aesni_mb_pmd.c.o.d' -o 'drivers/a715181@@tmp_rte_pmd_aesni_mb at sta/crypto_aesni_mb_rte_aesni_mb_pmd.c.o' -c ../drivers/crypto/aesni_mb/rte_aesni_mb_pmd.c
In file included from ../drivers/crypto/aesni_mb/rte_aesni_mb_pmd.c:17:
../drivers/crypto/aesni_mb/aesni_mb_pmd_private.h:60:3: error: subscripted value is neither array nor pointer nor vector
   60 |   [IMB_AUTH_SNOW3G_UIA2_BITLEN] = 16
      |   ^
../drivers/crypto/aesni_mb/aesni_mb_pmd_private.h:61:3: error: subscripted value is neither array nor pointer nor vector
   61 |   [IMB_AUTH_KASUMI_UIA1]  = 16
      |   ^
../drivers/crypto/aesni_mb/aesni_mb_pmd_private.h:96:3: error: subscripted value is neither array nor pointer nor vector
   96 |   [IMB_AUTH_SNOW3G_UIA2_BITLEN] = 4
      |   ^
../drivers/crypto/aesni_mb/aesni_mb_pmd_private.h:97:3: error: subscripted value is neither array nor pointer nor vector
   97 |   [IMB_AUTH_KASUMI_UIA1]  = 4
      |   ^
../drivers/crypto/aesni_mb/aesni_mb_pmd_private.h:95:32: error: initialization of ‘unsigned int’ from ‘const unsigned int *’ makes integer from pointer without a cast [-Werror=int-conversion]
   95 |   [IMB_AUTH_ZUC_EIA3_BITLEN] = 4
      |                                ^
../drivers/crypto/aesni_mb/aesni_mb_pmd_private.h:95:32: note: (near initialization for ‘auth_truncated_digest_byte_lengths[20]’)
../drivers/crypto/aesni_mb/aesni_mb_pmd_private.h:95:32: error: initializer element is not constant
../drivers/crypto/aesni_mb/aesni_mb_pmd_private.h:95:32: note: (near initialization for ‘auth_truncated_digest_byte_lengths[20]’)
../drivers/crypto/aesni_mb/aesni_mb_pmd_private.h:133:3: error: subscripted value is neither array nor pointer nor vector
  133 |   [IMB_AUTH_SNOW3G_UIA2_BITLEN] = 4
      |   ^
../drivers/crypto/aesni_mb/aesni_mb_pmd_private.h:134:3: error: subscripted value is neither array nor pointer nor vector
  134 |   [IMB_AUTH_KASUMI_UIA1]  = 4
      |   ^
../drivers/crypto/aesni_mb/aesni_mb_pmd_private.h:132:32: error: initialization of ‘unsigned int’ from ‘const unsigned int *’ makes integer from pointer without a cast [-Werror=int-conversion]
  132 |   [IMB_AUTH_ZUC_EIA3_BITLEN] = 4
      |                                ^
../drivers/crypto/aesni_mb/aesni_mb_pmd_private.h:132:32: note: (near initialization for ‘auth_digest_byte_lengths[20]’)
../drivers/crypto/aesni_mb/aesni_mb_pmd_private.h:132:32: error: initializer element is not constant
../drivers/crypto/aesni_mb/aesni_mb_pmd_private.h:132:32: note: (near initialization for ‘auth_digest_byte_lengths[20]’)
cc1: all warnings being treated as errors
[1770/2569] Compiling C object 'drivers/a715181@@tmp_rte_pmd_aesni_mb at sta/crypto_aesni_mb_rte_aesni_mb_pmd_ops.c.o'.
FAILED: drivers/a715181@@tmp_rte_pmd_aesni_mb at sta/crypto_aesni_mb_rte_aesni_mb_pmd_ops.c.o 
gcc -Idrivers/a715181@@tmp_rte_pmd_aesni_mb at sta -Idrivers -I../drivers -Idrivers/crypto/aesni_mb -I../drivers/crypto/aesni_mb -Ilib/librte_cryptodev -I../lib/librte_cryptodev -I. -I../ -Iconfig -I../config -Ilib/librte_eal/include -I../lib/librte_eal/include -Ilib/librte_eal/linux/include -I../lib/librte_eal/linux/include -Ilib/librte_eal/x86/include -I../lib/librte_eal/x86/include -Ilib/librte_eal/common -I../lib/librte_eal/common -Ilib/librte_eal -I../lib/librte_eal -Ilib/librte_kvargs -I../lib/librte_kvargs -Ilib/librte_telemetry/../librte_metrics -I../lib/librte_telemetry/../librte_metrics -Ilib/librte_telemetry -I../lib/librte_telemetry -Ilib/librte_mbuf -I../lib/librte_mbuf -Ilib/librte_mempool -I../lib/librte_mempool -Ilib/librte_ring -I../lib/librte_ring -Idrivers/bus/vdev -I../drivers/bus/vdev -Ilib/librte_net -I../lib/librte_net -Ilib/librte_security -I../lib/librte_security -fdiagnostics-color=always -pipe -D_FILE_OFFSET_BITS=64 -Wall -Winvalid-pch -Werror -O3 -include rte_config.h -Wextra -Wcast-qual -Wdeprecated -Wformat-nonliteral -Wformat-security -Wmissing-declarations -Wmissing-prototypes -Wnested-externs -Wold-style-definition -Wpointer-arith -Wsign-compare -Wstrict-prototypes -Wundef -Wwrite-strings -Wno-address-of-packed-member -Wno-packed-not-aligned -Wno-missing-field-initializers -Wno-zero-length-bounds -D_GNU_SOURCE -fPIC -march=native -DALLOW_EXPERIMENTAL_API -DALLOW_INTERNAL_API -Wno-format-truncation -MD -MQ 'drivers/a715181@@tmp_rte_pmd_aesni_mb at sta/crypto_aesni_mb_rte_aesni_mb_pmd_ops.c.o' -MF 'drivers/a715181@@tmp_rte_pmd_aesni_mb at sta/crypto_aesni_mb_rte_aesni_mb_pmd_ops.c.o.d' -o 'drivers/a715181@@tmp_rte_pmd_aesni_mb at sta/crypto_aesni_mb_rte_aesni_mb_pmd_ops.c.o' -c ../drivers/crypto/aesni_mb/rte_aesni_mb_pmd_ops.c
In file included from ../drivers/crypto/aesni_mb/rte_aesni_mb_pmd_ops.c:13:
../drivers/crypto/aesni_mb/aesni_mb_pmd_private.h:60:3: error: subscripted value is neither array nor pointer nor vector
   60 |   [IMB_AUTH_SNOW3G_UIA2_BITLEN] = 16
      |   ^
../drivers/crypto/aesni_mb/aesni_mb_pmd_private.h:61:3: error: subscripted value is neither array nor pointer nor vector
   61 |   [IMB_AUTH_KASUMI_UIA1]  = 16
      |   ^
../drivers/crypto/aesni_mb/aesni_mb_pmd_private.h:96:3: error: subscripted value is neither array nor pointer nor vector
   96 |   [IMB_AUTH_SNOW3G_UIA2_BITLEN] = 4
      |   ^
../drivers/crypto/aesni_mb/aesni_mb_pmd_private.h:97:3: error: subscripted value is neither array nor pointer nor vector
   97 |   [IMB_AUTH_KASUMI_UIA1]  = 4
      |   ^
../drivers/crypto/aesni_mb/aesni_mb_pmd_private.h:95:32: error: initialization of ‘unsigned int’ from ‘const unsigned int *’ makes integer from pointer without a cast [-Werror=int-conversion]
   95 |   [IMB_AUTH_ZUC_EIA3_BITLEN] = 4
      |                                ^
../drivers/crypto/aesni_mb/aesni_mb_pmd_private.h:95:32: note: (near initialization for ‘auth_truncated_digest_byte_lengths[20]’)
../drivers/crypto/aesni_mb/aesni_mb_pmd_private.h:95:32: error: initializer element is not constant
../drivers/crypto/aesni_mb/aesni_mb_pmd_private.h:95:32: note: (near initialization for ‘auth_truncated_digest_byte_lengths[20]’)
../drivers/crypto/aesni_mb/aesni_mb_pmd_private.h:133:3: error: subscripted value is neither array nor pointer nor vector
  133 |   [IMB_AUTH_SNOW3G_UIA2_BITLEN] = 4
      |   ^
../drivers/crypto/aesni_mb/aesni_mb_pmd_private.h:134:3: error: subscripted value is neither array nor pointer nor vector
  134 |   [IMB_AUTH_KASUMI_UIA1]  = 4
      |   ^
../drivers/crypto/aesni_mb/aesni_mb_pmd_private.h:132:32: error: initialization of ‘unsigned int’ from ‘const unsigned int *’ makes integer from pointer without a cast [-Werror=int-conversion]
  132 |   [IMB_AUTH_ZUC_EIA3_BITLEN] = 4
      |                                ^
../drivers/crypto/aesni_mb/aesni_mb_pmd_private.h:132:32: note: (near initialization for ‘auth_digest_byte_lengths[20]’)
../drivers/crypto/aesni_mb/aesni_mb_pmd_private.h:132:32: error: initializer element is not constant
../drivers/crypto/aesni_mb/aesni_mb_pmd_private.h:132:32: note: (near initialization for ‘auth_digest_byte_lengths[20]’)
cc1: all warnings being treated as errors
[1771/2569] Compiling C object 'drivers/a715181@@rte_rawdev_skeleton at sha/meson-generated_.._rte_rawdev_skeleton.pmd.c.o'.
[1772/2569] Generating rte_rawdev_octeontx2_ep.sym_chk with a meson_exe.py custom command.
[1773/2569] Generating rte_rawdev_ntb.sym_chk with a meson_exe.py custom command.
[1774/2569] Generating rte_rawdev_skeleton.sym_chk with a meson_exe.py custom command.
[1775/2569] Compiling C object 'drivers/a715181@@tmp_rte_pmd_caam_jr at sta/crypto_caam_jr_caam_jr_capabilities.c.o'.
[1776/2569] Compiling C object 'drivers/a715181@@tmp_rte_pmd_caam_jr at sta/crypto_caam_jr_caam_jr_hw.c.o'.
[1777/2569] Compiling C object 'drivers/a715181@@tmp_rte_pmd_caam_jr at sta/crypto_caam_jr_caam_jr_uio.c.o'.
[1778/2569] Compiling C object 'drivers/a715181@@tmp_rte_pmd_aesni_gcm at sta/crypto_aesni_gcm_aesni_gcm_pmd.c.o'.
ninja: build stopped: subcommand failed




*Build Failed #15:
OS: UB2004-64
Target: x86_64-icc-static
FAILED: drivers/a715181@@tmp_rte_pmd_aesni_mb at sta/crypto_aesni_mb_rte_aesni_mb_pmd.c.o 
icc -Idrivers/a715181@@tmp_rte_pmd_aesni_mb at sta -Idrivers -I../drivers -Idrivers/crypto/aesni_mb -I../drivers/crypto/aesni_mb -Ilib/librte_cryptodev -I../lib/librte_cryptodev -I. -I../ -Iconfig -I../config -Ilib/librte_eal/include -I../lib/librte_eal/include -Ilib/librte_eal/linux/include -I../lib/librte_eal/linux/include -Ilib/librte_eal/x86/include -I../lib/librte_eal/x86/include -Ilib/librte_eal/common -I../lib/librte_eal/common -Ilib/librte_eal -I../lib/librte_eal -Ilib/librte_kvargs -I../lib/librte_kvargs -Ilib/librte_telemetry/../librte_metrics -I../lib/librte_telemetry/../librte_metrics -Ilib/librte_telemetry -I../lib/librte_telemetry -Ilib/librte_mbuf -I../lib/librte_mbuf -Ilib/librte_mempool -I../lib/librte_mempool -Ilib/librte_ring -I../lib/librte_ring -Idrivers/bus/vdev -I../drivers/bus/vdev -Ilib/librte_net -I../lib/librte_net -Ilib/librte_security -I../lib/librte_security -pipe -D_FILE_OFFSET_BITS=64 -Wall -w3 -diag-disable:remark -Werror -O3 -include rte_config.h -Wextra -Wcast-qual -Wdeprecated -Wformat-security -Wmissing-declarations -Wmissing-prototypes -Wold-style-definition -Wpointer-arith -Wsign-compare -Wstrict-prototypes -Wundef -Wwrite-strings -Wno-missing-field-initializers -diag-disable=188 -diag-disable=2203 -diag-disable=2279 -diag-disable=2557 -diag-disable=3179 -diag-disable=3656 -D_GNU_SOURCE -fPIC -march=native -DALLOW_EXPERIMENTAL_API -DALLOW_INTERNAL_API -MD -MQ 'drivers/a715181@@tmp_rte_pmd_aesni_mb at sta/crypto_aesni_mb_rte_aesni_mb_pmd.c.o' -MF 'drivers/a715181@@tmp_rte_pmd_aesni_mb at sta/crypto_aesni_mb_rte_aesni_mb_pmd.c.o.d' -o 'drivers/a715181@@tmp_rte_pmd_aesni_mb at sta/crypto_aesni_mb_rte_aesni_mb_pmd.c.o' -c ../drivers/crypto/aesni_mb/rte_aesni_mb_pmd.c
In file included from ../drivers/crypto/aesni_mb/rte_aesni_mb_pmd.c(17):
../drivers/crypto/aesni_mb/aesni_mb_pmd_private.h(60): error: expression must have pointer-to-object type
  		[IMB_AUTH_SNOW3G_UIA2_BITLEN]	= 16
  		 ^

In file included from ../drivers/crypto/aesni_mb/rte_aesni_mb_pmd.c(17):
../drivers/crypto/aesni_mb/aesni_mb_pmd_private.h(60): error: this operator is not allowed in a constant expression
  		[IMB_AUTH_SNOW3G_UIA2_BITLEN]	= 16
  		                             	^

In file included from ../drivers/crypto/aesni_mb/rte_aesni_mb_pmd.c(17):
../drivers/crypto/aesni_mb/aesni_mb_pmd_private.h(61): error: expression must have pointer-to-object type
  		[IMB_AUTH_KASUMI_UIA1]		= 16
  		 ^

In file included from ../drivers/crypto/aesni_mb/rte_aesni_mb_pmd.c(17):
../drivers/crypto/aesni_mb/aesni_mb_pmd_private.h(61): error: this operator is not allowed in a constant expression
  		[IMB_AUTH_KASUMI_UIA1]		= 16
  		                      		^

In file included from ../drivers/crypto/aesni_mb/rte_aesni_mb_pmd.c(17):
../drivers/crypto/aesni_mb/aesni_mb_pmd_private.h(96): error: expression must have pointer-to-object type
  		[IMB_AUTH_SNOW3G_UIA2_BITLEN]	= 4
  		 ^

In file included from ../drivers/crypto/aesni_mb/rte_aesni_mb_pmd.c(17):
../drivers/crypto/aesni_mb/aesni_mb_pmd_private.h(96): error: this operator is not allowed in a constant expression
  		[IMB_AUTH_SNOW3G_UIA2_BITLEN]	= 4
  		                             	^

In file included from ../drivers/crypto/aesni_mb/rte_aesni_mb_pmd.c(17):
../drivers/crypto/aesni_mb/aesni_mb_pmd_private.h(97): error: expression must have pointer-to-object type
  		[IMB_AUTH_KASUMI_UIA1]		= 4
  		 ^

In file included from ../drivers/crypto/aesni_mb/rte_aesni_mb_pmd.c(17):
../drivers/crypto/aesni_mb/aesni_mb_pmd_private.h(97): error: this operator is not allowed in a constant expression
  		[IMB_AUTH_KASUMI_UIA1]		= 4
  		                      		^

In file included from ../drivers/crypto/aesni_mb/rte_aesni_mb_pmd.c(17):
../drivers/crypto/aesni_mb/aesni_mb_pmd_private.h(133): error: expression must have pointer-to-object type
  		[IMB_AUTH_SNOW3G_UIA2_BITLEN]	= 4
  		 ^

In file included from ../drivers/crypto/aesni_mb/rte_aesni_mb_pmd.c(17):
../drivers/crypto/aesni_mb/aesni_mb_pmd_private.h(133): error: this operator is not allowed in a constant expression
  		[IMB_AUTH_SNOW3G_UIA2_BITLEN]	= 4
  		                             	^

In file included from ../drivers/crypto/aesni_mb/rte_aesni_mb_pmd.c(17):
../drivers/crypto/aesni_mb/aesni_mb_pmd_private.h(134): error: expression must have pointer-to-object type
  		[IMB_AUTH_KASUMI_UIA1]		= 4
  		 ^

In file included from ../drivers/crypto/aesni_mb/rte_aesni_mb_pmd.c(17):
../drivers/crypto/aesni_mb/aesni_mb_pmd_private.h(134): error: this operator is not allowed in a constant expression
  		[IMB_AUTH_KASUMI_UIA1]		= 4
  		                      		^

compilation aborted for ../drivers/crypto/aesni_mb/rte_aesni_mb_pmd.c (code 2)
[1734/2569] Compiling C object 'drivers/a715181@@rte_rawdev_skeleton at sta/meson-generated_.._rte_rawdev_skeleton.pmd.c.o'.
[1735/2569] Compiling C object 'drivers/a715181@@tmp_rte_pmd_aesni_mb at sta/crypto_aesni_mb_rte_aesni_mb_pmd_ops.c.o'.
FAILED: drivers/a715181@@tmp_rte_pmd_aesni_mb at sta/crypto_aesni_mb_rte_aesni_mb_pmd_ops.c.o 
icc -Idrivers/a715181@@tmp_rte_pmd_aesni_mb at sta -Idrivers -I../drivers -Idrivers/crypto/aesni_mb -I../drivers/crypto/aesni_mb -Ilib/librte_cryptodev -I../lib/librte_cryptodev -I. -I../ -Iconfig -I../config -Ilib/librte_eal/include -I../lib/librte_eal/include -Ilib/librte_eal/linux/include -I../lib/librte_eal/linux/include -Ilib/librte_eal/x86/include -I../lib/librte_eal/x86/include -Ilib/librte_eal/common -I../lib/librte_eal/common -Ilib/librte_eal -I../lib/librte_eal -Ilib/librte_kvargs -I../lib/librte_kvargs -Ilib/librte_telemetry/../librte_metrics -I../lib/librte_telemetry/../librte_metrics -Ilib/librte_telemetry -I../lib/librte_telemetry -Ilib/librte_mbuf -I../lib/librte_mbuf -Ilib/librte_mempool -I../lib/librte_mempool -Ilib/librte_ring -I../lib/librte_ring -Idrivers/bus/vdev -I../drivers/bus/vdev -Ilib/librte_net -I../lib/librte_net -Ilib/librte_security -I../lib/librte_security -pipe -D_FILE_OFFSET_BITS=64 -Wall -w3 -diag-disable:remark -Werror -O3 -include rte_config.h -Wextra -Wcast-qual -Wdeprecated -Wformat-security -Wmissing-declarations -Wmissing-prototypes -Wold-style-definition -Wpointer-arith -Wsign-compare -Wstrict-prototypes -Wundef -Wwrite-strings -Wno-missing-field-initializers -diag-disable=188 -diag-disable=2203 -diag-disable=2279 -diag-disable=2557 -diag-disable=3179 -diag-disable=3656 -D_GNU_SOURCE -fPIC -march=native -DALLOW_EXPERIMENTAL_API -DALLOW_INTERNAL_API -MD -MQ 'drivers/a715181@@tmp_rte_pmd_aesni_mb at sta/crypto_aesni_mb_rte_aesni_mb_pmd_ops.c.o' -MF 'drivers/a715181@@tmp_rte_pmd_aesni_mb at sta/crypto_aesni_mb_rte_aesni_mb_pmd_ops.c.o.d' -o 'drivers/a715181@@tmp_rte_pmd_aesni_mb at sta/crypto_aesni_mb_rte_aesni_mb_pmd_ops.c.o' -c ../drivers/crypto/aesni_mb/rte_aesni_mb_pmd_ops.c
In file included from ../drivers/crypto/aesni_mb/rte_aesni_mb_pmd_ops.c(13):
../drivers/crypto/aesni_mb/aesni_mb_pmd_private.h(60): error: expression must have pointer-to-object type
  		[IMB_AUTH_SNOW3G_UIA2_BITLEN]	= 16
  		 ^

In file included from ../drivers/crypto/aesni_mb/rte_aesni_mb_pmd_ops.c(13):
../drivers/crypto/aesni_mb/aesni_mb_pmd_private.h(60): error: this operator is not allowed in a constant expression
  		[IMB_AUTH_SNOW3G_UIA2_BITLEN]	= 16
  		                             	^

In file included from ../drivers/crypto/aesni_mb/rte_aesni_mb_pmd_ops.c(13):
../drivers/crypto/aesni_mb/aesni_mb_pmd_private.h(61): error: expression must have pointer-to-object type
  		[IMB_AUTH_KASUMI_UIA1]		= 16
  		 ^

In file included from ../drivers/crypto/aesni_mb/rte_aesni_mb_pmd_ops.c(13):
../drivers/crypto/aesni_mb/aesni_mb_pmd_private.h(61): error: this operator is not allowed in a constant expression
  		[IMB_AUTH_KASUMI_UIA1]		= 16
  		                      		^

In file included from ../drivers/crypto/aesni_mb/rte_aesni_mb_pmd_ops.c(13):
../drivers/crypto/aesni_mb/aesni_mb_pmd_private.h(96): error: expression must have pointer-to-object type
  		[IMB_AUTH_SNOW3G_UIA2_BITLEN]	= 4
  		 ^

In file included from ../drivers/crypto/aesni_mb/rte_aesni_mb_pmd_ops.c(13):
../drivers/crypto/aesni_mb/aesni_mb_pmd_private.h(96): error: this operator is not allowed in a constant expression
  		[IMB_AUTH_SNOW3G_UIA2_BITLEN]	= 4
  		                             	^

In file included from ../drivers/crypto/aesni_mb/rte_aesni_mb_pmd_ops.c(13):
../drivers/crypto/aesni_mb/aesni_mb_pmd_private.h(97): error: expression must have pointer-to-object type
  		[IMB_AUTH_KASUMI_UIA1]		= 4
  		 ^

In file included from ../drivers/crypto/aesni_mb/rte_aesni_mb_pmd_ops.c(13):
../drivers/crypto/aesni_mb/aesni_mb_pmd_private.h(97): error: this operator is not allowed in a constant expression
  		[IMB_AUTH_KASUMI_UIA1]		= 4
  		                      		^

In file included from ../drivers/crypto/aesni_mb/rte_aesni_mb_pmd_ops.c(13):
../drivers/crypto/aesni_mb/aesni_mb_pmd_private.h(133): error: expression must have pointer-to-object type
  		[IMB_AUTH_SNOW3G_UIA2_BITLEN]	= 4
  		 ^

In file included from ../drivers/crypto/aesni_mb/rte_aesni_mb_pmd_ops.c(13):
../drivers/crypto/aesni_mb/aesni_mb_pmd_private.h(133): error: this operator is not allowed in a constant expression
  		[IMB_AUTH_SNOW3G_UIA2_BITLEN]	= 4
  		                             	^

In file included from ../drivers/crypto/aesni_mb/rte_aesni_mb_pmd_ops.c(13):
../drivers/crypto/aesni_mb/aesni_mb_pmd_private.h(134): error: expression must have pointer-to-object type
  		[IMB_AUTH_KASUMI_UIA1]		= 4
  		 ^

In file included from ../drivers/crypto/aesni_mb/rte_aesni_mb_pmd_ops.c(13):
../drivers/crypto/aesni_mb/aesni_mb_pmd_private.h(134): error: this operator is not allowed in a constant expression
  		[IMB_AUTH_KASUMI_UIA1]		= 4
  		                      		^

compilation aborted for ../drivers/crypto/aesni_mb/rte_aesni_mb_pmd_ops.c (code 2)
[1736/2569] Linking target drivers/librte_rawdev_octeontx2_dma.so.21.0.
[1737/2569] Compiling C object 'drivers/a715181@@rte_rawdev_skeleton at sha/meson-generated_.._rte_rawdev_skeleton.pmd.c.o'.
[1738/2569] Generating rte_rawdev_octeontx2_ep.sym_chk with a meson_exe.py custom command.
[1739/2569] Linking target drivers/librte_pmd_vmxnet3.so.21.0.
[1740/2569] Compiling C object 'drivers/a715181@@tmp_rte_rawdev_ntb at sta/raw_ntb_ntb.c.o'.
[1741/2569] Compiling C object 'drivers/a715181@@tmp_rte_pmd_aesni_gcm at sta/crypto_aesni_gcm_aesni_gcm_pmd.c.o'.
[1742/2569] Compiling C object 'drivers/a715181@@tmp_rte_pmd_octeontx2 at sta/net_octeontx2_otx2_tx.c.o'.
ninja: build stopped: subcommand failed




*Build Failed #16:
OS: UB2004-64
Target: x86_64-gcc-doc
FAILED: drivers/a715181@@tmp_rte_pmd_aesni_mb at sta/crypto_aesni_mb_rte_aesni_mb_pmd.c.o 
gcc -Idrivers/a715181@@tmp_rte_pmd_aesni_mb at sta -Idrivers -I../drivers -Idrivers/crypto/aesni_mb -I../drivers/crypto/aesni_mb -Ilib/librte_cryptodev -I../lib/librte_cryptodev -I. -I../ -Iconfig -I../config -Ilib/librte_eal/include -I../lib/librte_eal/include -Ilib/librte_eal/linux/include -I../lib/librte_eal/linux/include -Ilib/librte_eal/x86/include -I../lib/librte_eal/x86/include -Ilib/librte_eal/common -I../lib/librte_eal/common -Ilib/librte_eal -I../lib/librte_eal -Ilib/librte_kvargs -I../lib/librte_kvargs -Ilib/librte_telemetry/../librte_metrics -I../lib/librte_telemetry/../librte_metrics -Ilib/librte_telemetry -I../lib/librte_telemetry -Ilib/librte_mbuf -I../lib/librte_mbuf -Ilib/librte_mempool -I../lib/librte_mempool -Ilib/librte_ring -I../lib/librte_ring -Idrivers/bus/vdev -I../drivers/bus/vdev -Ilib/librte_net -I../lib/librte_net -Ilib/librte_security -I../lib/librte_security -fdiagnostics-color=always -pipe -D_FILE_OFFSET_BITS=64 -Wall -Winvalid-pch -Werror -O3 -include rte_config.h -Wextra -Wcast-qual -Wdeprecated -Wformat-nonliteral -Wformat-security -Wmissing-declarations -Wmissing-prototypes -Wnested-externs -Wold-style-definition -Wpointer-arith -Wsign-compare -Wstrict-prototypes -Wundef -Wwrite-strings -Wno-address-of-packed-member -Wno-packed-not-aligned -Wno-missing-field-initializers -D_GNU_SOURCE -fPIC -march=native -DALLOW_EXPERIMENTAL_API -DALLOW_INTERNAL_API -Wno-format-truncation -MD -MQ 'drivers/a715181@@tmp_rte_pmd_aesni_mb at sta/crypto_aesni_mb_rte_aesni_mb_pmd.c.o' -MF 'drivers/a715181@@tmp_rte_pmd_aesni_mb at sta/crypto_aesni_mb_rte_aesni_mb_pmd.c.o.d' -o 'drivers/a715181@@tmp_rte_pmd_aesni_mb at sta/crypto_aesni_mb_rte_aesni_mb_pmd.c.o' -c ../drivers/crypto/aesni_mb/rte_aesni_mb_pmd.c
In file included from ../drivers/crypto/aesni_mb/rte_aesni_mb_pmd.c:17:
../drivers/crypto/aesni_mb/aesni_mb_pmd_private.h:60:3: error: subscripted value is neither array nor pointer nor vector
   60 |   [IMB_AUTH_SNOW3G_UIA2_BITLEN] = 16
      |   ^
../drivers/crypto/aesni_mb/aesni_mb_pmd_private.h:61:3: error: subscripted value is neither array nor pointer nor vector
   61 |   [IMB_AUTH_KASUMI_UIA1]  = 16
      |   ^
../drivers/crypto/aesni_mb/aesni_mb_pmd_private.h:96:3: error: subscripted value is neither array nor pointer nor vector
   96 |   [IMB_AUTH_SNOW3G_UIA2_BITLEN] = 4
      |   ^
../drivers/crypto/aesni_mb/aesni_mb_pmd_private.h:97:3: error: subscripted value is neither array nor pointer nor vector
   97 |   [IMB_AUTH_KASUMI_UIA1]  = 4
      |   ^
../drivers/crypto/aesni_mb/aesni_mb_pmd_private.h:95:32: error: initialization of ‘unsigned int’ from ‘const unsigned int *’ makes integer from pointer without a cast [-Werror=int-conversion]
   95 |   [IMB_AUTH_ZUC_EIA3_BITLEN] = 4
      |                                ^
../drivers/crypto/aesni_mb/aesni_mb_pmd_private.h:95:32: note: (near initialization for ‘auth_truncated_digest_byte_lengths[20]’)
../drivers/crypto/aesni_mb/aesni_mb_pmd_private.h:95:32: error: initializer element is not constant
../drivers/crypto/aesni_mb/aesni_mb_pmd_private.h:95:32: note: (near initialization for ‘auth_truncated_digest_byte_lengths[20]’)
../drivers/crypto/aesni_mb/aesni_mb_pmd_private.h:133:3: error: subscripted value is neither array nor pointer nor vector
  133 |   [IMB_AUTH_SNOW3G_UIA2_BITLEN] = 4
      |   ^
../drivers/crypto/aesni_mb/aesni_mb_pmd_private.h:134:3: error: subscripted value is neither array nor pointer nor vector
  134 |   [IMB_AUTH_KASUMI_UIA1]  = 4
      |   ^
../drivers/crypto/aesni_mb/aesni_mb_pmd_private.h:132:32: error: initialization of ‘unsigned int’ from ‘const unsigned int *’ makes integer from pointer without a cast [-Werror=int-conversion]
  132 |   [IMB_AUTH_ZUC_EIA3_BITLEN] = 4
      |                                ^
../drivers/crypto/aesni_mb/aesni_mb_pmd_private.h:132:32: note: (near initialization for ‘auth_digest_byte_lengths[20]’)
../drivers/crypto/aesni_mb/aesni_mb_pmd_private.h:132:32: error: initializer element is not constant
../drivers/crypto/aesni_mb/aesni_mb_pmd_private.h:132:32: note: (near initialization for ‘auth_digest_byte_lengths[20]’)
cc1: all warnings being treated as errors
[1802/2428] Compiling C object 'drivers/a715181@@rte_rawdev_skeleton at sta/meson-generated_.._rte_rawdev_skeleton.pmd.c.o'.
[1803/2428] Generating rte_rawdev_octeontx2_dma.sym_chk with a meson_exe.py custom command.
[1804/2428] Generating rte_rawdev_octeontx2_ep.sym_chk with a meson_exe.py custom command.
[1805/2428] Compiling C object 'drivers/a715181@@tmp_rte_rawdev_ntb at sta/raw_ntb_ntb.c.o'.
[1806/2428] Compiling C object 'drivers/a715181@@tmp_rte_pmd_aesni_mb at sta/crypto_aesni_mb_rte_aesni_mb_pmd_ops.c.o'.
FAILED: drivers/a715181@@tmp_rte_pmd_aesni_mb at sta/crypto_aesni_mb_rte_aesni_mb_pmd_ops.c.o 
gcc -Idrivers/a715181@@tmp_rte_pmd_aesni_mb at sta -Idrivers -I../drivers -Idrivers/crypto/aesni_mb -I../drivers/crypto/aesni_mb -Ilib/librte_cryptodev -I../lib/librte_cryptodev -I. -I../ -Iconfig -I../config -Ilib/librte_eal/include -I../lib/librte_eal/include -Ilib/librte_eal/linux/include -I../lib/librte_eal/linux/include -Ilib/librte_eal/x86/include -I../lib/librte_eal/x86/include -Ilib/librte_eal/common -I../lib/librte_eal/common -Ilib/librte_eal -I../lib/librte_eal -Ilib/librte_kvargs -I../lib/librte_kvargs -Ilib/librte_telemetry/../librte_metrics -I../lib/librte_telemetry/../librte_metrics -Ilib/librte_telemetry -I../lib/librte_telemetry -Ilib/librte_mbuf -I../lib/librte_mbuf -Ilib/librte_mempool -I../lib/librte_mempool -Ilib/librte_ring -I../lib/librte_ring -Idrivers/bus/vdev -I../drivers/bus/vdev -Ilib/librte_net -I../lib/librte_net -Ilib/librte_security -I../lib/librte_security -fdiagnostics-color=always -pipe -D_FILE_OFFSET_BITS=64 -Wall -Winvalid-pch -Werror -O3 -include rte_config.h -Wextra -Wcast-qual -Wdeprecated -Wformat-nonliteral -Wformat-security -Wmissing-declarations -Wmissing-prototypes -Wnested-externs -Wold-style-definition -Wpointer-arith -Wsign-compare -Wstrict-prototypes -Wundef -Wwrite-strings -Wno-address-of-packed-member -Wno-packed-not-aligned -Wno-missing-field-initializers -D_GNU_SOURCE -fPIC -march=native -DALLOW_EXPERIMENTAL_API -DALLOW_INTERNAL_API -Wno-format-truncation -MD -MQ 'drivers/a715181@@tmp_rte_pmd_aesni_mb at sta/crypto_aesni_mb_rte_aesni_mb_pmd_ops.c.o' -MF 'drivers/a715181@@tmp_rte_pmd_aesni_mb at sta/crypto_aesni_mb_rte_aesni_mb_pmd_ops.c.o.d' -o 'drivers/a715181@@tmp_rte_pmd_aesni_mb at sta/crypto_aesni_mb_rte_aesni_mb_pmd_ops.c.o' -c ../drivers/crypto/aesni_mb/rte_aesni_mb_pmd_ops.c
In file included from ../drivers/crypto/aesni_mb/rte_aesni_mb_pmd_ops.c:13:
../drivers/crypto/aesni_mb/aesni_mb_pmd_private.h:60:3: error: subscripted value is neither array nor pointer nor vector
   60 |   [IMB_AUTH_SNOW3G_UIA2_BITLEN] = 16
      |   ^
../drivers/crypto/aesni_mb/aesni_mb_pmd_private.h:61:3: error: subscripted value is neither array nor pointer nor vector
   61 |   [IMB_AUTH_KASUMI_UIA1]  = 16
      |   ^
../drivers/crypto/aesni_mb/aesni_mb_pmd_private.h:96:3: error: subscripted value is neither array nor pointer nor vector
   96 |   [IMB_AUTH_SNOW3G_UIA2_BITLEN] = 4
      |   ^
../drivers/crypto/aesni_mb/aesni_mb_pmd_private.h:97:3: error: subscripted value is neither array nor pointer nor vector
   97 |   [IMB_AUTH_KASUMI_UIA1]  = 4
      |   ^
../drivers/crypto/aesni_mb/aesni_mb_pmd_private.h:95:32: error: initialization of ‘unsigned int’ from ‘const unsigned int *’ makes integer from pointer without a cast [-Werror=int-conversion]
   95 |   [IMB_AUTH_ZUC_EIA3_BITLEN] = 4
      |                                ^
../drivers/crypto/aesni_mb/aesni_mb_pmd_private.h:95:32: note: (near initialization for ‘auth_truncated_digest_byte_lengths[20]’)
../drivers/crypto/aesni_mb/aesni_mb_pmd_private.h:95:32: error: initializer element is not constant
../drivers/crypto/aesni_mb/aesni_mb_pmd_private.h:95:32: note: (near initialization for ‘auth_truncated_digest_byte_lengths[20]’)
../drivers/crypto/aesni_mb/aesni_mb_pmd_private.h:133:3: error: subscripted value is neither array nor pointer nor vector
  133 |   [IMB_AUTH_SNOW3G_UIA2_BITLEN] = 4
      |   ^
../drivers/crypto/aesni_mb/aesni_mb_pmd_private.h:134:3: error: subscripted value is neither array nor pointer nor vector
  134 |   [IMB_AUTH_KASUMI_UIA1]  = 4
      |   ^
../drivers/crypto/aesni_mb/aesni_mb_pmd_private.h:132:32: error: initialization of ‘unsigned int’ from ‘const unsigned int *’ makes integer from pointer without a cast [-Werror=int-conversion]
  132 |   [IMB_AUTH_ZUC_EIA3_BITLEN] = 4
      |                                ^
../drivers/crypto/aesni_mb/aesni_mb_pmd_private.h:132:32: note: (near initialization for ‘auth_digest_byte_lengths[20]’)
../drivers/crypto/aesni_mb/aesni_mb_pmd_private.h:132:32: error: initializer element is not constant
../drivers/crypto/aesni_mb/aesni_mb_pmd_private.h:132:32: note: (near initialization for ‘auth_digest_byte_lengths[20]’)
cc1: all warnings being treated as errors
[1807/2428] Compiling C object 'drivers/a715181@@tmp_rte_pmd_caam_jr at sta/crypto_caam_jr_caam_jr_capabilities.c.o'.
[1808/2428] Compiling C object 'drivers/a715181@@tmp_rte_pmd_caam_jr at sta/crypto_caam_jr_caam_jr_uio.c.o'.
[1809/2428] Compiling C object 'drivers/a715181@@tmp_rte_pmd_caam_jr at sta/crypto_caam_jr_caam_jr_hw.c.o'.
[1810/2428] Compiling C object 'drivers/a715181@@tmp_rte_pmd_aesni_gcm at sta/crypto_aesni_gcm_aesni_gcm_pmd.c.o'.
ninja: build stopped: subcommand failed


DPDK STV team


More information about the test-report mailing list