[dpdk-test-report] |FAILURE| pw77939-77941 [PATCH] [v2, 3/3] net/iavf: enable AVX512 for TX

dpdklab at iol.unh.edu dpdklab at iol.unh.edu
Thu Sep 17 04:18:18 CEST 2020


Test-Label: Performance-Testing
Test-Status: FAILURE
http://dpdk.org/patch/77939

_build patch failure_

Submitter: Wenzhuo Lu <wenzhuo.lu at intel.com>
Date: Thursday, September 17 2020 01:39:38 
Applied on: CommitID:0fb8897c676bb1c3fd6eef05e76618d2d182d48b
Apply patch set 77939-77941 failed:

[1/1196] Linking static target drivers/libtmp_rte_pmd_i40e.a.
[2/1196] Linking static target drivers/libtmp_rte_pmd_hns3.a.
[3/1196] Linking target drivers/librte_pmd_hinic.so.21.0.
[4/1196] Generating rte_pmd_i40e.pmd.c with a custom command.
[5/1196] Compiling C object 'drivers/a715181@@tmp_rte_pmd_iavf at sta/net_iavf_iavf_rxtx_vec_avx512.c.o'.
FAILED: drivers/a715181@@tmp_rte_pmd_iavf at sta/net_iavf_iavf_rxtx_vec_avx512.c.o 
cc -Idrivers/a715181@@tmp_rte_pmd_iavf at sta -Idrivers -I../drivers -Idrivers/net/iavf -I../drivers/net/iavf -Idrivers/net/iavf/../../common/iavf -I../drivers/net/iavf/../../common/iavf -Ilib/librte_ethdev -I../lib/librte_ethdev -I. -I../ -Iconfig -I../config -Ilib/librte_eal/include -I../lib/librte_eal/include -Ilib/librte_eal/linux/include -I../lib/librte_eal/linux/include -Ilib/librte_eal/x86/include -I../lib/librte_eal/x86/include -Ilib/librte_eal/common -I../lib/librte_eal/common -Ilib/librte_eal -I../lib/librte_eal -Ilib/librte_kvargs -I../lib/librte_kvargs -Ilib/librte_telemetry/../librte_metrics -I../lib/librte_telemetry/../librte_metrics -Ilib/librte_telemetry -I../lib/librte_telemetry -Ilib/librte_net -I../lib/librte_net -Ilib/librte_mbuf -I../lib/librte_mbuf -Ilib/librte_mempool -I../lib/librte_mempool -Ilib/librte_ring -I../lib/librte_ring -Ilib/librte_meter -I../lib/librte_meter -Idrivers/bus/pci -I../drivers/bus/pci -I../drivers/bus/pci/linux -Ilib/librte_pci -I../lib/librte_pci -Idrivers/bus/vdev -I../drivers/bus/vdev -Idrivers/common/iavf -I../drivers/common/iavf -fdiagnostics-color=always -pipe -D_FILE_OFFSET_BITS=64 -Wall -Winvalid-pch -O3 -include rte_config.h -Wextra -Wcast-qual -Wdeprecated -Wformat-nonliteral -Wformat-security -Wmissing-declarations -Wmissing-prototypes -Wnested-externs -Wold-style-definition -Wpointer-arith -Wsign-compare -Wstrict-prototypes -Wundef -Wwrite-strings -Wno-missing-field-initializers -D_GNU_SOURCE -fPIC -march=native -DALLOW_EXPERIMENTAL_API -DALLOW_INTERNAL_API -Wno-format-truncation -Wno-strict-aliasing -DCC_AVX2_SUPPORT -DCC_AVX512_SUPPORT -march=skylake-avx512 -MD -MQ 'drivers/a715181@@tmp_rte_pmd_iavf at sta/net_iavf_iavf_rxtx_vec_avx512.c.o' -MF 'drivers/a715181@@tmp_rte_pmd_iavf at sta/net_iavf_iavf_rxtx_vec_avx512.c.o.d' -o 'drivers/a715181@@tmp_rte_pmd_iavf at sta/net_iavf_iavf_rxtx_vec_avx512.c.o' -c ../drivers/net/iavf/iavf_rxtx_vec_avx512.c
../drivers/net/iavf/iavf_rxtx_vec_avx512.c: In function ‘_iavf_recv_raw_pkts_vec_avx512’:
../drivers/net/iavf/iavf_rxtx_vec_avx512.c:178:3: warning: implicit declaration of function ‘_mm512_set_epi16’; did you mean ‘_mm512_set1_epi16’? [-Wimplicit-function-declaration]
   _mm512_set_epi16
   ^~~~~~~~~~~~~~~~
   _mm512_set1_epi16
../drivers/net/iavf/iavf_rxtx_vec_avx512.c:178:3: warning: nested extern declaration of ‘_mm512_set_epi16’ [-Wnested-externs]
../drivers/net/iavf/iavf_rxtx_vec_avx512.c:178:3: error: incompatible types when initializing type ‘__m512i {aka const __vector(8) long long int}’ using type ‘int’
../drivers/net/iavf/iavf_rxtx_vec_avx512.c:214:3: warning: implicit declaration of function ‘_mm512_set_epi8’; did you mean ‘_mm512_set1_epi8’? [-Wimplicit-function-declaration]
   _mm512_set_epi8
   ^~~~~~~~~~~~~~~
   _mm512_set1_epi8
../drivers/net/iavf/iavf_rxtx_vec_avx512.c:214:3: warning: nested extern declaration of ‘_mm512_set_epi8’ [-Wnested-externs]
../drivers/net/iavf/iavf_rxtx_vec_avx512.c:214:3: error: incompatible types when initializing type ‘__m512i {aka const __vector(8) long long int}’ using type ‘int’
../drivers/net/iavf/iavf_rxtx_vec_avx512.c: In function ‘_iavf_recv_raw_pkts_vec_avx512_flex_rxd’:
../drivers/net/iavf/iavf_rxtx_vec_avx512.c:679:3: error: incompatible types when initializing type ‘__m512i {aka const __vector(8) long long int}’ using type ‘int’
   _mm512_set_epi16
   ^~~~~~~~~~~~~~~~
../drivers/net/iavf/iavf_rxtx_vec_avx512.c:715:3: error: incompatible types when initializing type ‘__m512i {aka const __vector(8) long long int}’ using type ‘int’
   _mm512_set_epi8
   ^~~~~~~~~~~~~~~
[6/1196] Compiling C object 'drivers/a715181@@rte_pmd_i40e at sta/meson-generated_.._rte_pmd_i40e.pmd.c.o'.
[7/1196] Compiling C object 'drivers/net/ice/base/39545a2@@ice_base at sta/ice_acl.c.o'.
[8/1196] Generating rte_pmd_hns3.pmd.c with a custom command.
[9/1196] Compiling C object 'drivers/a715181@@tmp_rte_pmd_ice at sta/net_ice_ice_dcf_parent.c.o'.
[10/1196] Compiling C object 'drivers/net/ice/base/39545a2@@ice_base at sta/ice_fdir.c.o'.
[11/1196] Compiling C object 'drivers/net/ice/base/39545a2@@ice_base at sta/ice_acl_ctrl.c.o'.
[12/1196] Compiling C object 'drivers/a715181@@tmp_rte_pmd_ice at sta/net_ice_ice_dcf_ethdev.c.o'.
[13/1196] Compiling C object 'drivers/a715181@@tmp_rte_pmd_ice at sta/net_ice_ice_generic_flow.c.o'.
[14/1196] Generating pipeline.sym_chk with a meson_exe.py custom command.
[15/1196] Compiling C object 'drivers/net/ice/base/39545a2@@ice_base at sta/ice_dcb.c.o'.
[16/1196] Compiling C object 'drivers/a715181@@tmp_rte_pmd_ice at sta/net_ice_ice_fdir_filter.c.o'.
[17/1196] Compiling C object 'drivers/a715181@@tmp_rte_pmd_ice at sta/net_ice_ice_rxtx_vec_avx2.c.o'.
[18/1196] Compiling C object 'drivers/a715181@@tmp_rte_pmd_ice at sta/net_ice_ice_switch_filter.c.o'.
[19/1196] Compiling C object 'drivers/a715181@@tmp_rte_pmd_ice at sta/net_ice_ice_ethdev.c.o'.
[20/1196] Compiling C object 'drivers/net/ice/base/39545a2@@ice_base at sta/ice_flex_pipe.c.o'.
[21/1196] Compiling C object 'drivers/net/ice/base/39545a2@@ice_base at sta/ice_flow.c.o'.
[22/1196] Compiling C object 'drivers/a715181@@tmp_rte_pmd_ice at sta/net_ice_ice_rxtx.c.o'.
ninja: build stopped: subcommand failed.

https://lab.dpdk.org/results/dashboard/patchsets/13124/

UNH-IOL DPDK Community Lab


More information about the test-report mailing list