[dpdk-test-report] |FAILURE| pw(78674) [RFC] app/testpmd: tx pkt clones parameter in flowgen

sys_stv at intel.com sys_stv at intel.com
Fri Sep 25 08:30:23 CEST 2020


Test-Label: Intel-compilation
Test-Status: FAILURE
http://dpdk.org/patch/78674

_Compilation issues_

Submitter: Igor Russkikh <irusskikh at marvell.com>
Date: 2020-09-24 11:34:14
Reply_mail: 20200924113414.483-1-irusskikh at marvell.com

DPDK git baseline: Repo:dpdk-next-net, CommitID: 1e056a9ce285656ce73f348816d7decfd273b241


Meson Build Summary: 21 Builds Done, 8 Successful, 13 Failures, 0 Blocked

+----------------+------------+--------------+------------+------------+-----------+----------+
| os             | gcc-static | clang-static | icc-static | gcc-shared | gcc-debug | document |
+----------------+------------+--------------+------------+------------+-----------+----------+
| CENTOS82-64    | FAIL       | pass         | pass       | FAIL       | FAIL      |          |
| RHEL82-64      | FAIL       |              |            |            |           |          |
| UB1804-64      | FAIL       |              |            |            |           |          |
| FC32-64        | FAIL       | pass         |            |            |           |          |
| UB2004-64      | FAIL       | pass         | pass       |            |           | FAIL     |
| WIN10-64       |            | pass         |            |            |           |          |
| UB2004-32      | FAIL       |              |            |            |           |          |
| FreeBSD1201-64 | FAIL       | pass         |            | FAIL       | FAIL      |          |
| SUSE15-64      | FAIL       | pass         |            |            |           |          |
+----------------+------------+--------------+------------+------------+-----------+----------+
Test environment and configuration as below:


OS: CENTOS82-64
	Kernel Version: 4.18.0-193.el8.x86_64
	CPU info: Intel(R) Xeon(R) Platinum 8280M CPU @ 2.70GHz
	GCC Version: gcc (GCC) 8.3.1 20191121 (Red Hat 8.3.1-5)
	Clang Version: 9.0.1 (Red Hat 9.0.1-2.module_el8.2.0+309+0c7b6b03)
	x86_64-native-linuxapp-gcc
	x86_64-native-linuxapp-clang
	x86_64-native-linuxapp-icc
	x86_64-native-linuxapp-gcc+shared
	x86_64-native-linuxapp-gcc+debug

OS: RHEL82-64
	Kernel Version: 4.18.0-193.el8.x86_64
	CPU info: Intel(R) Xeon(R) Platinum 8280M CPU @ 2.70GHz
	GCC Version: gcc (GCC) 8.3.1 20191121 (Red Hat 8.3.1-5)
	Clang Version: 8.0.1 (Red Hat 8.0.1-1.module_el8.1.0+215+a01033fb)
	x86_64-native-linuxapp-gcc

OS: UB1804-64
	Kernel Version: 5.3.0-59-generic
	CPU info: Intel(R) Xeon(R) Platinum 8180 CPU @ 2.50GHz
	GCC Version: gcc (Ubuntu 8.4.0-1ubuntu1~18.04) 8.4.0
	Clang Version: 6.0.0-1ubuntu2 (tags/RELEASE_600/final)
	x86_64-native-linuxapp-gcc

OS: FC32-64
	Kernel Version: 5.6.0-0.rc7.git0.2.fc32.x86_64
	CPU info: Intel(R) Xeon(R) Platinum 8280M CPU @ 2.70GHz
	GCC Version: gcc (GCC) 10.0.1 20200311 (Red Hat 10.0.1-0.9)
	Clang Version: 10.0.0 (Fedora 10.0.0-0.3.rc4.fc32)
	x86_64-native-linuxapp-gcc
	x86_64-native-linuxapp-clang

OS: UB2004-64
	Kernel Version: 5.4.0-26-generic
	CPU info: Intel(R) Xeon(R) Platinum 8180 CPU @ 2.50GHz
	GCC Version: gcc (Ubuntu 10-20200416-0ubuntu1) 10.0.1 20200416 (experimental) [master revision 3c3f12e2a76:dcee354ce56:44b326839d864fc10c459916abcc97f35a9ac3de]
	Clang Version: 10.0.0-4ubuntu1
	x86_64-native-linuxapp-clang
	x86_64-native-linuxapp-gcc
	x86_64-native-linuxapp-icc
	x86_64-native-linuxapp-doc

OS: WIN10-64
	Kernel Version: N/A
	CPU info: N/A
	GCC Version: N/A
	Clang Version: Clang 8.0.0
	x86_64-windows-clang

OS: UB2004-32
	Kernel Version: 5.4.0-26-generic
	CPU info: Intel(R) Xeon(R) Platinum 8180 CPU @ 2.50GHz
	GCC Version: gcc (Ubuntu 9.3.0-10ubuntu2) 9.3.0
	Clang Version: 10.0.0-4ubuntu1
	i686-native-linuxapp-gcc

OS: FreeBSD1201-64
	Kernel Version: 12.1-RELEASE
	CPU info: Intel(R) Xeon(R) CPU E5-2699 v3 @ 2.30GHz (2294.74-MHz K8-class CPU)
	GCC Version: gcc (FreeBSD Ports Collection) 9.2.0
	Clang Version: 8.0.1 (tags/RELEASE_801/final 366581) (based on LLVM 8.0.1)
	x86_64-native-bsdapp-gcc
	x86_64-native-bsdapp-clang
	x86_64-native-bsdapp-gcc+shared
	x86_64-native-bsdapp-gcc+debug

OS: SUSE15-64
	Kernel Version: 4.12.14-lp150.11-default
	CPU info: Intel(R) Xeon(R) CPU E5-2699 v4 @ 2.20GHz
	GCC Version: gcc (SUSE Linux) 7.3.1 20180323 [gcc-7-branch revision 258812]
	Clang Version: 5.0.1 (tags/RELEASE_501/final 312548)
	x86_64-native-linuxapp-clang
	x86_64-native-linuxapp-gcc



*Build Failed #1:
OS: CENTOS82-64
Target: x86_64-native-linuxapp-gcc
FAILED: app/a172ced@@dpdk-testpmd at exe/test-pmd_flowgen.c.o 
gcc -Iapp/a172ced@@dpdk-testpmd at exe -Iapp -I../app -Ilib/librte_ethdev -I../lib/librte_ethdev -I. -I../ -Iconfig -I../config -Ilib/librte_eal/include -I../lib/librte_eal/include -Ilib/librte_eal/linux/include -I../lib/librte_eal/linux/include -Ilib/librte_eal/x86/include -I../lib/librte_eal/x86/include -Ilib/librte_eal/common -I../lib/librte_eal/common -Ilib/librte_eal -I../lib/librte_eal -Ilib/librte_kvargs -I../lib/librte_kvargs -Ilib/librte_telemetry/../librte_metrics -I../lib/librte_telemetry/../librte_metrics -Ilib/librte_telemetry -I../lib/librte_telemetry -Ilib/librte_net -I../lib/librte_net -Ilib/librte_mbuf -I../lib/librte_mbuf -Ilib/librte_mempool -I../lib/librte_mempool -Ilib/librte_ring -I../lib/librte_ring -Ilib/librte_meter -I../lib/librte_meter -Ilib/librte_gro -I../lib/librte_gro -Ilib/librte_gso -I../lib/librte_gso -Ilib/librte_cmdline -I../lib/librte_cmdline -Ilib/librte_metrics -I../lib/librte_metrics -Idrivers/bus/pci -I../drivers/bus/pci -I../drivers/bus/pci/linux -Ilib/librte_pci -I../lib/librte_pci -Ilib/librte_bitratestats -I../lib/librte_bitratestats -Ilib/librte_pdump -I../lib/librte_pdump -Idrivers/net/bnxt -I../drivers/net/bnxt -I../drivers/net/bnxt/tf_ulp -I../drivers/net/bnxt/tf_core -Idrivers/bus/vdev -I../drivers/bus/vdev -Idrivers/net/i40e -I../drivers/net/i40e -Idrivers/net/i40e/base -I../drivers/net/i40e/base -Ilib/librte_hash -I../lib/librte_hash -Idrivers/net/ixgbe -I../drivers/net/ixgbe -Idrivers/net/ixgbe/base -I../drivers/net/ixgbe/base -Ilib/librte_security -I../lib/librte_security -Ilib/librte_cryptodev -I../lib/librte_cryptodev -Idrivers/bus/dpaa -I../drivers/bus/dpaa -I../drivers/bus/dpaa/include -I../drivers/bus/dpaa/base/qbman -Idrivers/common/dpaax -I../drivers/common/dpaax -I../drivers/common/dpaax/caamflib -Ilib/librte_eventdev -I../lib/librte_eventdev -Ilib/librte_timer -I../lib/librte_timer -Idrivers/mempool/dpaa -I../drivers/mempool/dpaa -Idrivers/net/dpaa -I../drivers/net/dpaa -Ilib/librte_bpf -I../lib/librte_bpf -fdiagnostics-color=always -pipe -D_FILE_OFFSET_BITS=64 -Wall -Winvalid-pch -Werror -O3 -include rte_config.h -Wextra -Wcast-qual -Wdeprecated -Wformat-nonliteral -Wformat-security -Wmissing-declarations -Wmissing-prototypes -Wnested-externs -Wold-style-definition -Wpointer-arith -Wsign-compare -Wstrict-prototypes -Wundef -Wwrite-strings -Wno-packed-not-aligned -Wno-missing-field-initializers -D_GNU_SOURCE -march=native -mno-avx512f -DALLOW_EXPERIMENTAL_API -Wno-deprecated-declarations -MD -MQ 'app/a172ced@@dpdk-testpmd at exe/test-pmd_flowgen.c.o' -MF 'app/a172ced@@dpdk-testpmd at exe/test-pmd_flowgen.c.o.d' -o 'app/a172ced@@dpdk-testpmd at exe/test-pmd_flowgen.c.o' -c ../app/test-pmd/flowgen.c
../app/test-pmd/flowgen.c: In function ‘pkt_burst_flow_gen’:
../app/test-pmd/flowgen.c:178:22: error: ‘pkt’ may be used uninitialized in this function [-Werror=maybe-uninitialized]
   pkts_burst[nb_pkt] = pkt;
   ~~~~~~~~~~~~~~~~~~~^~~~~
cc1: all warnings being treated as errors
[2231/2600] Compiling C object 'app/a172ced@@dpdk-testpmd at exe/test-pmd_parameters.c.o'.
[2232/2600] Compiling C object 'app/a172ced@@dpdk-testpmd at exe/test-pmd_rxonly.c.o'.
[2233/2600] Compiling C object 'app/a172ced@@dpdk-testpmd at exe/test-pmd_util.c.o'.
[2234/2600] Compiling C object 'app/a172ced@@dpdk-testpmd at exe/test-pmd_txonly.c.o'.
[2235/2600] Compiling C object 'app/a172ced@@dpdk-testpmd at exe/test-pmd_csumonly.c.o'.
[2236/2600] Compiling C object 'app/a172ced@@dpdk-testpmd at exe/test-pmd_noisy_vnf.c.o'.
[2237/2600] Compiling C object 'app/a172ced@@dpdk-testpmd at exe/test-pmd_testpmd.c.o'.
[2238/2600] Compiling C object 'drivers/a715181@@tmp_rte_pmd_octeontx2_event at sta/event_octeontx2_otx2_worker.c.o'.
[2239/2600] Compiling C object 'drivers/a715181@@tmp_rte_pmd_octeontx2_event at sta/event_octeontx2_otx2_worker_dual.c.o'.
ninja: build stopped: subcommand failed




*Build Failed #2:
OS: CENTOS82-64
Target: x86_64-native-linuxapp-gcc+shared
FAILED: app/a172ced@@dpdk-testpmd at exe/test-pmd_flowgen.c.o 
gcc -Iapp/a172ced@@dpdk-testpmd at exe -Iapp -I../app -Ilib/librte_ethdev -I../lib/librte_ethdev -I. -I../ -Iconfig -I../config -Ilib/librte_eal/include -I../lib/librte_eal/include -Ilib/librte_eal/linux/include -I../lib/librte_eal/linux/include -Ilib/librte_eal/x86/include -I../lib/librte_eal/x86/include -Ilib/librte_eal/common -I../lib/librte_eal/common -Ilib/librte_eal -I../lib/librte_eal -Ilib/librte_kvargs -I../lib/librte_kvargs -Ilib/librte_telemetry/../librte_metrics -I../lib/librte_telemetry/../librte_metrics -Ilib/librte_telemetry -I../lib/librte_telemetry -Ilib/librte_net -I../lib/librte_net -Ilib/librte_mbuf -I../lib/librte_mbuf -Ilib/librte_mempool -I../lib/librte_mempool -Ilib/librte_ring -I../lib/librte_ring -Ilib/librte_meter -I../lib/librte_meter -Ilib/librte_gro -I../lib/librte_gro -Ilib/librte_gso -I../lib/librte_gso -Ilib/librte_cmdline -I../lib/librte_cmdline -Ilib/librte_metrics -I../lib/librte_metrics -Idrivers/bus/pci -I../drivers/bus/pci -I../drivers/bus/pci/linux -Ilib/librte_pci -I../lib/librte_pci -Ilib/librte_bitratestats -I../lib/librte_bitratestats -Ilib/librte_pdump -I../lib/librte_pdump -Idrivers/net/bnxt -I../drivers/net/bnxt -I../drivers/net/bnxt/tf_ulp -I../drivers/net/bnxt/tf_core -Idrivers/bus/vdev -I../drivers/bus/vdev -Idrivers/net/i40e -I../drivers/net/i40e -Idrivers/net/i40e/base -I../drivers/net/i40e/base -Ilib/librte_hash -I../lib/librte_hash -Idrivers/net/ixgbe -I../drivers/net/ixgbe -Idrivers/net/ixgbe/base -I../drivers/net/ixgbe/base -Ilib/librte_security -I../lib/librte_security -Ilib/librte_cryptodev -I../lib/librte_cryptodev -Idrivers/bus/dpaa -I../drivers/bus/dpaa -I../drivers/bus/dpaa/include -I../drivers/bus/dpaa/base/qbman -Idrivers/common/dpaax -I../drivers/common/dpaax -I../drivers/common/dpaax/caamflib -Ilib/librte_eventdev -I../lib/librte_eventdev -Ilib/librte_timer -I../lib/librte_timer -Idrivers/mempool/dpaa -I../drivers/mempool/dpaa -Idrivers/net/dpaa -I../drivers/net/dpaa -Ilib/librte_bpf -I../lib/librte_bpf -fdiagnostics-color=always -pipe -D_FILE_OFFSET_BITS=64 -Wall -Winvalid-pch -Werror -O3 -include rte_config.h -Wextra -Wcast-qual -Wdeprecated -Wformat-nonliteral -Wformat-security -Wmissing-declarations -Wmissing-prototypes -Wnested-externs -Wold-style-definition -Wpointer-arith -Wsign-compare -Wstrict-prototypes -Wundef -Wwrite-strings -Wno-packed-not-aligned -Wno-missing-field-initializers -D_GNU_SOURCE -march=native -mno-avx512f -DALLOW_EXPERIMENTAL_API -Wno-deprecated-declarations -MD -MQ 'app/a172ced@@dpdk-testpmd at exe/test-pmd_flowgen.c.o' -MF 'app/a172ced@@dpdk-testpmd at exe/test-pmd_flowgen.c.o.d' -o 'app/a172ced@@dpdk-testpmd at exe/test-pmd_flowgen.c.o' -c ../app/test-pmd/flowgen.c
../app/test-pmd/flowgen.c: In function ‘pkt_burst_flow_gen’:
../app/test-pmd/flowgen.c:178:22: error: ‘pkt’ may be used uninitialized in this function [-Werror=maybe-uninitialized]
   pkts_burst[nb_pkt] = pkt;
   ~~~~~~~~~~~~~~~~~~~^~~~~
cc1: all warnings being treated as errors
[2258/2436] Compiling C object 'app/a172ced@@dpdk-testpmd at exe/test-pmd_cmdline.c.o'.
[2259/2436] Compiling C object 'app/a172ced@@dpdk-testpmd at exe/test-pmd_config.c.o'.
[2260/2436] Compiling C object 'app/a172ced@@dpdk-testpmd at exe/test-pmd_csumonly.c.o'.
[2261/2436] Compiling C object 'drivers/a715181@@tmp_rte_pmd_octeontx2_event at sta/event_octeontx2_otx2_worker_dual.c.o'.
[2262/2436] Compiling C object 'drivers/a715181@@tmp_rte_pmd_octeontx2_event at sta/event_octeontx2_otx2_worker.c.o'.
ninja: build stopped: subcommand failed




*Build Failed #3:
OS: CENTOS82-64
Target: x86_64-native-linuxapp-gcc+debug
FAILED: app/a172ced@@dpdk-testpmd at exe/test-pmd_flowgen.c.o 
gcc -Iapp/a172ced@@dpdk-testpmd at exe -Iapp -I../app -Ilib/librte_ethdev -I../lib/librte_ethdev -I. -I../ -Iconfig -I../config -Ilib/librte_eal/include -I../lib/librte_eal/include -Ilib/librte_eal/linux/include -I../lib/librte_eal/linux/include -Ilib/librte_eal/x86/include -I../lib/librte_eal/x86/include -Ilib/librte_eal/common -I../lib/librte_eal/common -Ilib/librte_eal -I../lib/librte_eal -Ilib/librte_kvargs -I../lib/librte_kvargs -Ilib/librte_telemetry/../librte_metrics -I../lib/librte_telemetry/../librte_metrics -Ilib/librte_telemetry -I../lib/librte_telemetry -Ilib/librte_net -I../lib/librte_net -Ilib/librte_mbuf -I../lib/librte_mbuf -Ilib/librte_mempool -I../lib/librte_mempool -Ilib/librte_ring -I../lib/librte_ring -Ilib/librte_meter -I../lib/librte_meter -Ilib/librte_gro -I../lib/librte_gro -Ilib/librte_gso -I../lib/librte_gso -Ilib/librte_cmdline -I../lib/librte_cmdline -Ilib/librte_metrics -I../lib/librte_metrics -Idrivers/bus/pci -I../drivers/bus/pci -I../drivers/bus/pci/linux -Ilib/librte_pci -I../lib/librte_pci -Ilib/librte_bitratestats -I../lib/librte_bitratestats -Ilib/librte_pdump -I../lib/librte_pdump -Idrivers/net/bnxt -I../drivers/net/bnxt -I../drivers/net/bnxt/tf_ulp -I../drivers/net/bnxt/tf_core -Idrivers/bus/vdev -I../drivers/bus/vdev -Idrivers/net/i40e -I../drivers/net/i40e -Idrivers/net/i40e/base -I../drivers/net/i40e/base -Ilib/librte_hash -I../lib/librte_hash -Idrivers/net/ixgbe -I../drivers/net/ixgbe -Idrivers/net/ixgbe/base -I../drivers/net/ixgbe/base -Ilib/librte_security -I../lib/librte_security -Ilib/librte_cryptodev -I../lib/librte_cryptodev -Idrivers/bus/dpaa -I../drivers/bus/dpaa -I../drivers/bus/dpaa/include -I../drivers/bus/dpaa/base/qbman -Idrivers/common/dpaax -I../drivers/common/dpaax -I../drivers/common/dpaax/caamflib -Ilib/librte_eventdev -I../lib/librte_eventdev -Ilib/librte_timer -I../lib/librte_timer -Idrivers/mempool/dpaa -I../drivers/mempool/dpaa -Idrivers/net/dpaa -I../drivers/net/dpaa -Ilib/librte_bpf -I../lib/librte_bpf -fdiagnostics-color=always -pipe -D_FILE_OFFSET_BITS=64 -Wall -Winvalid-pch -Werror -O2 -g -include rte_config.h -Wextra -Wcast-qual -Wdeprecated -Wformat-nonliteral -Wformat-security -Wmissing-declarations -Wmissing-prototypes -Wnested-externs -Wold-style-definition -Wpointer-arith -Wsign-compare -Wstrict-prototypes -Wundef -Wwrite-strings -Wno-packed-not-aligned -Wno-missing-field-initializers -D_GNU_SOURCE -march=native -mno-avx512f -DALLOW_EXPERIMENTAL_API -Wno-deprecated-declarations -MD -MQ 'app/a172ced@@dpdk-testpmd at exe/test-pmd_flowgen.c.o' -MF 'app/a172ced@@dpdk-testpmd at exe/test-pmd_flowgen.c.o.d' -o 'app/a172ced@@dpdk-testpmd at exe/test-pmd_flowgen.c.o' -c ../app/test-pmd/flowgen.c
../app/test-pmd/flowgen.c: In function ‘pkt_burst_flow_gen’:
../app/test-pmd/flowgen.c:178:22: error: ‘pkt’ may be used uninitialized in this function [-Werror=maybe-uninitialized]
   pkts_burst[nb_pkt] = pkt;
   ~~~~~~~~~~~~~~~~~~~^~~~~
cc1: all warnings being treated as errors
[2228/2600] Compiling C object 'app/a172ced@@dpdk-testpmd at exe/test-pmd_macswap.c.o'.
[2229/2600] Compiling C object 'app/a172ced@@dpdk-testpmd at exe/test-pmd_csumonly.c.o'.
[2230/2600] Compiling C object 'app/a172ced@@dpdk-testpmd at exe/test-pmd_noisy_vnf.c.o'.
[2231/2600] Compiling C object 'drivers/a715181@@tmp_rte_pmd_octeontx2_event at sta/event_octeontx2_otx2_worker.c.o'.
[2232/2600] Compiling C object 'drivers/a715181@@tmp_rte_pmd_octeontx2_event at sta/event_octeontx2_otx2_worker_dual.c.o'.
ninja: build stopped: subcommand failed




*Build Failed #4:
OS: FC32-64
Target: x86_64-native-linuxapp-gcc
FAILED: app/a172ced@@dpdk-testpmd at exe/test-pmd_flowgen.c.o 
gcc -Iapp/a172ced@@dpdk-testpmd at exe -Iapp -I../app -Ilib/librte_ethdev -I../lib/librte_ethdev -I. -I../ -Iconfig -I../config -Ilib/librte_eal/include -I../lib/librte_eal/include -Ilib/librte_eal/linux/include -I../lib/librte_eal/linux/include -Ilib/librte_eal/x86/include -I../lib/librte_eal/x86/include -Ilib/librte_eal/common -I../lib/librte_eal/common -Ilib/librte_eal -I../lib/librte_eal -Ilib/librte_kvargs -I../lib/librte_kvargs -Ilib/librte_telemetry/../librte_metrics -I../lib/librte_telemetry/../librte_metrics -Ilib/librte_telemetry -I../lib/librte_telemetry -Ilib/librte_net -I../lib/librte_net -Ilib/librte_mbuf -I../lib/librte_mbuf -Ilib/librte_mempool -I../lib/librte_mempool -Ilib/librte_ring -I../lib/librte_ring -Ilib/librte_meter -I../lib/librte_meter -Ilib/librte_gro -I../lib/librte_gro -Ilib/librte_gso -I../lib/librte_gso -Ilib/librte_cmdline -I../lib/librte_cmdline -Ilib/librte_metrics -I../lib/librte_metrics -Idrivers/bus/pci -I../drivers/bus/pci -I../drivers/bus/pci/linux -Ilib/librte_pci -I../lib/librte_pci -Ilib/librte_bitratestats -I../lib/librte_bitratestats -Ilib/librte_pdump -I../lib/librte_pdump -Idrivers/net/bnxt -I../drivers/net/bnxt -I../drivers/net/bnxt/tf_ulp -I../drivers/net/bnxt/tf_core -Idrivers/bus/vdev -I../drivers/bus/vdev -Idrivers/net/i40e -I../drivers/net/i40e -Idrivers/net/i40e/base -I../drivers/net/i40e/base -Ilib/librte_hash -I../lib/librte_hash -Idrivers/net/ixgbe -I../drivers/net/ixgbe -Idrivers/net/ixgbe/base -I../drivers/net/ixgbe/base -Ilib/librte_security -I../lib/librte_security -Ilib/librte_cryptodev -I../lib/librte_cryptodev -Idrivers/bus/dpaa -I../drivers/bus/dpaa -I../drivers/bus/dpaa/include -I../drivers/bus/dpaa/base/qbman -Idrivers/common/dpaax -I../drivers/common/dpaax -I../drivers/common/dpaax/caamflib -Ilib/librte_eventdev -I../lib/librte_eventdev -Ilib/librte_timer -I../lib/librte_timer -Idrivers/mempool/dpaa -I../drivers/mempool/dpaa -Idrivers/net/dpaa -I../drivers/net/dpaa -Ilib/librte_bpf -I../lib/librte_bpf -fdiagnostics-color=always -pipe -D_FILE_OFFSET_BITS=64 -Wall -Winvalid-pch -Werror -O3 -include rte_config.h -Wextra -Wcast-qual -Wdeprecated -Wformat-nonliteral -Wformat-security -Wmissing-declarations -Wmissing-prototypes -Wnested-externs -Wold-style-definition -Wpointer-arith -Wsign-compare -Wstrict-prototypes -Wundef -Wwrite-strings -Wno-address-of-packed-member -Wno-packed-not-aligned -Wno-missing-field-initializers -Wno-zero-length-bounds -D_GNU_SOURCE -march=native -DALLOW_EXPERIMENTAL_API -Wno-deprecated-declarations -MD -MQ 'app/a172ced@@dpdk-testpmd at exe/test-pmd_flowgen.c.o' -MF 'app/a172ced@@dpdk-testpmd at exe/test-pmd_flowgen.c.o.d' -o 'app/a172ced@@dpdk-testpmd at exe/test-pmd_flowgen.c.o' -c ../app/test-pmd/flowgen.c
../app/test-pmd/flowgen.c: In function ‘pkt_burst_flow_gen’:
../app/test-pmd/flowgen.c:178:22: error: ‘pkt’ may be used uninitialized in this function [-Werror=maybe-uninitialized]
  178 |   pkts_burst[nb_pkt] = pkt;
      |   ~~~~~~~~~~~~~~~~~~~^~~~~
cc1: all warnings being treated as errors
[2229/2601] Compiling C object 'app/a172ced@@dpdk-testpmd at exe/test-pmd_rxonly.c.o'.
[2230/2601] Compiling C object 'app/a172ced@@dpdk-testpmd at exe/test-pmd_util.c.o'.
[2231/2601] Compiling C object 'app/a172ced@@dpdk-testpmd at exe/test-pmd_bpf_cmd.c.o'.
[2232/2601] Compiling C object 'app/a172ced@@dpdk-testpmd at exe/test-pmd_parameters.c.o'.
[2233/2601] Compiling C object 'app/a172ced@@dpdk-testpmd at exe/test-pmd_cmdline_flow.c.o'.
[2234/2601] Compiling C object 'app/a172ced@@dpdk-testpmd at exe/test-pmd_txonly.c.o'.
[2235/2601] Compiling C object 'app/test/3062f5d@@dpdk-test at exe/test_acl.c.o'.
[2236/2601] Compiling C object 'app/a172ced@@dpdk-testpmd at exe/test-pmd_testpmd.c.o'.
[2237/2601] Compiling C object 'app/a172ced@@dpdk-testpmd at exe/test-pmd_noisy_vnf.c.o'.
[2238/2601] Compiling C object 'drivers/a715181@@tmp_rte_pmd_octeontx2_event at sta/event_octeontx2_otx2_worker.c.o'.
[2239/2601] Compiling C object 'drivers/a715181@@tmp_rte_pmd_octeontx2_event at sta/event_octeontx2_otx2_worker_dual.c.o'.
ninja: build stopped: subcommand failed




*Build Failed #5:
OS: FreeBSD1201-64
Target: x86_64-native-bsdapp-gcc
FAILED: app/dpdk-testpmd.p/test-pmd_flowgen.c.o 
gcc -Iapp/dpdk-testpmd.p -Iapp -I../app -Ilib/librte_ethdev -I../lib/librte_ethdev -I. -I.. -Iconfig -I../config -Ilib/librte_eal/include -I../lib/librte_eal/include -Ilib/librte_eal/freebsd/include -I../lib/librte_eal/freebsd/include -Ilib/librte_eal/x86/include -I../lib/librte_eal/x86/include -Ilib/librte_eal/common -I../lib/librte_eal/common -Ilib/librte_eal -I../lib/librte_eal -Ilib/librte_kvargs -I../lib/librte_kvargs -Ilib/librte_metrics -I../lib/librte_metrics -Ilib/librte_telemetry -I../lib/librte_telemetry -Ilib/librte_net -I../lib/librte_net -Ilib/librte_mbuf -I../lib/librte_mbuf -Ilib/librte_mempool -I../lib/librte_mempool -Ilib/librte_ring -I../lib/librte_ring -Ilib/librte_meter -I../lib/librte_meter -Ilib/librte_gro -I../lib/librte_gro -Ilib/librte_gso -I../lib/librte_gso -Ilib/librte_cmdline -I../lib/librte_cmdline -Idrivers/bus/pci -I../drivers/bus/pci -I../drivers/bus/pci/bsd -Ilib/librte_pci -I../lib/librte_pci -Ilib/librte_bitratestats -I../lib/librte_bitratestats -Ilib/librte_pdump -I../lib/librte_pdump -Idrivers/net/bnxt -I../drivers/net/bnxt -I../drivers/net/bnxt/tf_ulp -I../drivers/net/bnxt/tf_core -Idrivers/bus/vdev -I../drivers/bus/vdev -Idrivers/net/i40e -I../drivers/net/i40e -Idrivers/net/i40e/base -I../drivers/net/i40e/base -Ilib/librte_hash -I../lib/librte_hash -Idrivers/net/ixgbe -I../drivers/net/ixgbe -Idrivers/net/ixgbe/base -I../drivers/net/ixgbe/base -Ilib/librte_security -I../lib/librte_security -Ilib/librte_cryptodev -I../lib/librte_cryptodev -Ilib/librte_bpf -I../lib/librte_bpf -fdiagnostics-color=always -pipe -D_FILE_OFFSET_BITS=64 -Wall -Winvalid-pch -Werror -O3 -include rte_config.h -Wextra -Wcast-qual -Wdeprecated -Wformat-nonliteral -Wformat-security -Wmissing-declarations -Wmissing-prototypes -Wnested-externs -Wold-style-definition -Wpointer-arith -Wsign-compare -Wstrict-prototypes -Wundef -Wwrite-strings -Wno-address-of-packed-member -Wno-packed-not-aligned -Wno-missing-field-initializers -D_GNU_SOURCE -D__BSD_VISIBLE -march=native -mno-avx512f -DALLOW_EXPERIMENTAL_API -Wno-deprecated-declarations -MD -MQ app/dpdk-testpmd.p/test-pmd_flowgen.c.o -MF app/dpdk-testpmd.p/test-pmd_flowgen.c.o.d -o app/dpdk-testpmd.p/test-pmd_flowgen.c.o -c ../app/test-pmd/flowgen.c
../app/test-pmd/flowgen.c: In function 'pkt_burst_flow_gen':
../app/test-pmd/flowgen.c:178:22: error: 'pkt' may be used uninitialized in this function [-Werror=maybe-uninitialized]
  178 |   pkts_burst[nb_pkt] = pkt;
      |   ~~~~~~~~~~~~~~~~~~~^~~~~
cc1: all warnings being treated as errors
[1603/1937] Compiling C object app/dpdk-testpmd.p/test-pmd_csumonly.c.o
[1604/1937] Compiling C object app/dpdk-testpmd.p/test-pmd_config.c.o
[1605/1937] Compiling C object app/dpdk-testpmd.p/test-pmd_cmdline.c.o
[1606/1937] Compiling C object drivers/libtmp_rte_pmd_octeontx2_event.a.p/event_octeontx2_otx2_worker_dual.c.o
[1607/1937] Compiling C object drivers/libtmp_rte_pmd_octeontx2_event.a.p/event_octeontx2_otx2_worker.c.o
ninja: build stopped: subcommand failed




*Build Failed #6:
OS: FreeBSD1201-64
Target: x86_64-native-bsdapp-gcc+shared
FAILED: app/dpdk-testpmd.p/test-pmd_flowgen.c.o 
gcc -Iapp/dpdk-testpmd.p -Iapp -I../app -Ilib/librte_ethdev -I../lib/librte_ethdev -I. -I.. -Iconfig -I../config -Ilib/librte_eal/include -I../lib/librte_eal/include -Ilib/librte_eal/freebsd/include -I../lib/librte_eal/freebsd/include -Ilib/librte_eal/x86/include -I../lib/librte_eal/x86/include -Ilib/librte_eal/common -I../lib/librte_eal/common -Ilib/librte_eal -I../lib/librte_eal -Ilib/librte_kvargs -I../lib/librte_kvargs -Ilib/librte_metrics -I../lib/librte_metrics -Ilib/librte_telemetry -I../lib/librte_telemetry -Ilib/librte_net -I../lib/librte_net -Ilib/librte_mbuf -I../lib/librte_mbuf -Ilib/librte_mempool -I../lib/librte_mempool -Ilib/librte_ring -I../lib/librte_ring -Ilib/librte_meter -I../lib/librte_meter -Ilib/librte_gro -I../lib/librte_gro -Ilib/librte_gso -I../lib/librte_gso -Ilib/librte_cmdline -I../lib/librte_cmdline -Idrivers/bus/pci -I../drivers/bus/pci -I../drivers/bus/pci/bsd -Ilib/librte_pci -I../lib/librte_pci -Ilib/librte_bitratestats -I../lib/librte_bitratestats -Ilib/librte_pdump -I../lib/librte_pdump -Idrivers/net/bnxt -I../drivers/net/bnxt -I../drivers/net/bnxt/tf_ulp -I../drivers/net/bnxt/tf_core -Idrivers/bus/vdev -I../drivers/bus/vdev -Idrivers/net/i40e -I../drivers/net/i40e -Idrivers/net/i40e/base -I../drivers/net/i40e/base -Ilib/librte_hash -I../lib/librte_hash -Idrivers/net/ixgbe -I../drivers/net/ixgbe -Idrivers/net/ixgbe/base -I../drivers/net/ixgbe/base -Ilib/librte_security -I../lib/librte_security -Ilib/librte_cryptodev -I../lib/librte_cryptodev -Ilib/librte_bpf -I../lib/librte_bpf -fdiagnostics-color=always -pipe -D_FILE_OFFSET_BITS=64 -Wall -Winvalid-pch -Werror -O3 -include rte_config.h -Wextra -Wcast-qual -Wdeprecated -Wformat-nonliteral -Wformat-security -Wmissing-declarations -Wmissing-prototypes -Wnested-externs -Wold-style-definition -Wpointer-arith -Wsign-compare -Wstrict-prototypes -Wundef -Wwrite-strings -Wno-address-of-packed-member -Wno-packed-not-aligned -Wno-missing-field-initializers -D_GNU_SOURCE -D__BSD_VISIBLE -march=native -mno-avx512f -DALLOW_EXPERIMENTAL_API -Wno-deprecated-declarations -MD -MQ app/dpdk-testpmd.p/test-pmd_flowgen.c.o -MF app/dpdk-testpmd.p/test-pmd_flowgen.c.o.d -o app/dpdk-testpmd.p/test-pmd_flowgen.c.o -c ../app/test-pmd/flowgen.c
../app/test-pmd/flowgen.c: In function 'pkt_burst_flow_gen':
../app/test-pmd/flowgen.c:178:22: error: 'pkt' may be used uninitialized in this function [-Werror=maybe-uninitialized]
  178 |   pkts_burst[nb_pkt] = pkt;
      |   ~~~~~~~~~~~~~~~~~~~^~~~~
cc1: all warnings being treated as errors
[1641/1817] Compiling C object app/dpdk-testpmd.p/test-pmd_csumonly.c.o
[1642/1817] Compiling C object app/dpdk-testpmd.p/test-pmd_config.c.o
[1643/1817] Compiling C object app/dpdk-testpmd.p/test-pmd_cmdline.c.o
[1644/1817] Compiling C object drivers/libtmp_rte_pmd_octeontx2_event.a.p/event_octeontx2_otx2_worker.c.o
[1645/1817] Compiling C object drivers/libtmp_rte_pmd_octeontx2_event.a.p/event_octeontx2_otx2_worker_dual.c.o
ninja: build stopped: subcommand failed




*Build Failed #7:
OS: FreeBSD1201-64
Target: x86_64-native-bsdapp-gcc+debug
FAILED: app/dpdk-testpmd.p/test-pmd_flowgen.c.o 
gcc -Iapp/dpdk-testpmd.p -Iapp -I../app -Ilib/librte_ethdev -I../lib/librte_ethdev -I. -I.. -Iconfig -I../config -Ilib/librte_eal/include -I../lib/librte_eal/include -Ilib/librte_eal/freebsd/include -I../lib/librte_eal/freebsd/include -Ilib/librte_eal/x86/include -I../lib/librte_eal/x86/include -Ilib/librte_eal/common -I../lib/librte_eal/common -Ilib/librte_eal -I../lib/librte_eal -Ilib/librte_kvargs -I../lib/librte_kvargs -Ilib/librte_metrics -I../lib/librte_metrics -Ilib/librte_telemetry -I../lib/librte_telemetry -Ilib/librte_net -I../lib/librte_net -Ilib/librte_mbuf -I../lib/librte_mbuf -Ilib/librte_mempool -I../lib/librte_mempool -Ilib/librte_ring -I../lib/librte_ring -Ilib/librte_meter -I../lib/librte_meter -Ilib/librte_gro -I../lib/librte_gro -Ilib/librte_gso -I../lib/librte_gso -Ilib/librte_cmdline -I../lib/librte_cmdline -Idrivers/bus/pci -I../drivers/bus/pci -I../drivers/bus/pci/bsd -Ilib/librte_pci -I../lib/librte_pci -Ilib/librte_bitratestats -I../lib/librte_bitratestats -Ilib/librte_pdump -I../lib/librte_pdump -Idrivers/net/bnxt -I../drivers/net/bnxt -I../drivers/net/bnxt/tf_ulp -I../drivers/net/bnxt/tf_core -Idrivers/bus/vdev -I../drivers/bus/vdev -Idrivers/net/i40e -I../drivers/net/i40e -Idrivers/net/i40e/base -I../drivers/net/i40e/base -Ilib/librte_hash -I../lib/librte_hash -Idrivers/net/ixgbe -I../drivers/net/ixgbe -Idrivers/net/ixgbe/base -I../drivers/net/ixgbe/base -Ilib/librte_security -I../lib/librte_security -Ilib/librte_cryptodev -I../lib/librte_cryptodev -Ilib/librte_bpf -I../lib/librte_bpf -fdiagnostics-color=always -pipe -D_FILE_OFFSET_BITS=64 -Wall -Winvalid-pch -Werror -O2 -g -include rte_config.h -Wextra -Wcast-qual -Wdeprecated -Wformat-nonliteral -Wformat-security -Wmissing-declarations -Wmissing-prototypes -Wnested-externs -Wold-style-definition -Wpointer-arith -Wsign-compare -Wstrict-prototypes -Wundef -Wwrite-strings -Wno-address-of-packed-member -Wno-packed-not-aligned -Wno-missing-field-initializers -D_GNU_SOURCE -D__BSD_VISIBLE -march=native -mno-avx512f -DALLOW_EXPERIMENTAL_API -Wno-deprecated-declarations -MD -MQ app/dpdk-testpmd.p/test-pmd_flowgen.c.o -MF app/dpdk-testpmd.p/test-pmd_flowgen.c.o.d -o app/dpdk-testpmd.p/test-pmd_flowgen.c.o -c ../app/test-pmd/flowgen.c
../app/test-pmd/flowgen.c: In function 'pkt_burst_flow_gen':
../app/test-pmd/flowgen.c:178:22: error: 'pkt' may be used uninitialized in this function [-Werror=maybe-uninitialized]
  178 |   pkts_burst[nb_pkt] = pkt;
      |   ~~~~~~~~~~~~~~~~~~~^~~~~
cc1: all warnings being treated as errors
[1603/1937] Compiling C object app/dpdk-testpmd.p/test-pmd_csumonly.c.o
[1604/1937] Compiling C object app/dpdk-testpmd.p/test-pmd_config.c.o
[1605/1937] Compiling C object app/dpdk-testpmd.p/test-pmd_cmdline.c.o
[1606/1937] Compiling C object drivers/libtmp_rte_pmd_octeontx2_event.a.p/event_octeontx2_otx2_worker.c.o
[1607/1937] Compiling C object drivers/libtmp_rte_pmd_octeontx2_event.a.p/event_octeontx2_otx2_worker_dual.c.o
ninja: build stopped: subcommand failed




*Build Failed #8:
OS: RHEL82-64
Target: x86_64-native-linuxapp-gcc
FAILED: app/a172ced@@dpdk-testpmd at exe/test-pmd_flowgen.c.o 
gcc -Iapp/a172ced@@dpdk-testpmd at exe -Iapp -I../app -Ilib/librte_ethdev -I../lib/librte_ethdev -I. -I../ -Iconfig -I../config -Ilib/librte_eal/include -I../lib/librte_eal/include -Ilib/librte_eal/linux/include -I../lib/librte_eal/linux/include -Ilib/librte_eal/x86/include -I../lib/librte_eal/x86/include -Ilib/librte_eal/common -I../lib/librte_eal/common -Ilib/librte_eal -I../lib/librte_eal -Ilib/librte_kvargs -I../lib/librte_kvargs -Ilib/librte_telemetry/../librte_metrics -I../lib/librte_telemetry/../librte_metrics -Ilib/librte_telemetry -I../lib/librte_telemetry -Ilib/librte_net -I../lib/librte_net -Ilib/librte_mbuf -I../lib/librte_mbuf -Ilib/librte_mempool -I../lib/librte_mempool -Ilib/librte_ring -I../lib/librte_ring -Ilib/librte_meter -I../lib/librte_meter -Ilib/librte_gro -I../lib/librte_gro -Ilib/librte_gso -I../lib/librte_gso -Ilib/librte_cmdline -I../lib/librte_cmdline -Ilib/librte_metrics -I../lib/librte_metrics -Idrivers/bus/pci -I../drivers/bus/pci -I../drivers/bus/pci/linux -Ilib/librte_pci -I../lib/librte_pci -Ilib/librte_bitratestats -I../lib/librte_bitratestats -Ilib/librte_pdump -I../lib/librte_pdump -Idrivers/net/bnxt -I../drivers/net/bnxt -I../drivers/net/bnxt/tf_ulp -I../drivers/net/bnxt/tf_core -Idrivers/bus/vdev -I../drivers/bus/vdev -Idrivers/net/i40e -I../drivers/net/i40e -Idrivers/net/i40e/base -I../drivers/net/i40e/base -Ilib/librte_hash -I../lib/librte_hash -Idrivers/net/ixgbe -I../drivers/net/ixgbe -Idrivers/net/ixgbe/base -I../drivers/net/ixgbe/base -Ilib/librte_security -I../lib/librte_security -Ilib/librte_cryptodev -I../lib/librte_cryptodev -Idrivers/bus/dpaa -I../drivers/bus/dpaa -I../drivers/bus/dpaa/include -I../drivers/bus/dpaa/base/qbman -Idrivers/common/dpaax -I../drivers/common/dpaax -I../drivers/common/dpaax/caamflib -Ilib/librte_eventdev -I../lib/librte_eventdev -Ilib/librte_timer -I../lib/librte_timer -Idrivers/mempool/dpaa -I../drivers/mempool/dpaa -Idrivers/net/dpaa -I../drivers/net/dpaa -Ilib/librte_bpf -I../lib/librte_bpf -fdiagnostics-color=always -pipe -D_FILE_OFFSET_BITS=64 -Wall -Winvalid-pch -Werror -O3 -include rte_config.h -Wextra -Wcast-qual -Wdeprecated -Wformat-nonliteral -Wformat-security -Wmissing-declarations -Wmissing-prototypes -Wnested-externs -Wold-style-definition -Wpointer-arith -Wsign-compare -Wstrict-prototypes -Wundef -Wwrite-strings -Wno-packed-not-aligned -Wno-missing-field-initializers -D_GNU_SOURCE -march=native -mno-avx512f -DALLOW_EXPERIMENTAL_API -Wno-deprecated-declarations -MD -MQ 'app/a172ced@@dpdk-testpmd at exe/test-pmd_flowgen.c.o' -MF 'app/a172ced@@dpdk-testpmd at exe/test-pmd_flowgen.c.o.d' -o 'app/a172ced@@dpdk-testpmd at exe/test-pmd_flowgen.c.o' -c ../app/test-pmd/flowgen.c
../app/test-pmd/flowgen.c: In function ‘pkt_burst_flow_gen’:
../app/test-pmd/flowgen.c:178:22: error: ‘pkt’ may be used uninitialized in this function [-Werror=maybe-uninitialized]
   pkts_burst[nb_pkt] = pkt;
   ~~~~~~~~~~~~~~~~~~~^~~~~
cc1: all warnings being treated as errors
[2232/2600] Compiling C object 'app/a172ced@@dpdk-testpmd at exe/test-pmd_rxonly.c.o'.
[2233/2600] Compiling C object 'app/a172ced@@dpdk-testpmd at exe/test-pmd_parameters.c.o'.
[2234/2600] Compiling C object 'app/a172ced@@dpdk-testpmd at exe/test-pmd_bpf_cmd.c.o'.
[2235/2600] Compiling C object 'app/a172ced@@dpdk-testpmd at exe/test-pmd_util.c.o'.
[2236/2600] Compiling C object 'app/a172ced@@dpdk-testpmd at exe/test-pmd_txonly.c.o'.
[2237/2600] Compiling C object 'app/a172ced@@dpdk-testpmd at exe/test-pmd_noisy_vnf.c.o'.
[2238/2600] Compiling C object 'app/a172ced@@dpdk-testpmd at exe/test-pmd_testpmd.c.o'.
[2239/2600] Compiling C object 'drivers/a715181@@tmp_rte_pmd_octeontx2_event at sta/event_octeontx2_otx2_worker.c.o'.
[2240/2600] Compiling C object 'drivers/a715181@@tmp_rte_pmd_octeontx2_event at sta/event_octeontx2_otx2_worker_dual.c.o'.
ninja: build stopped: subcommand failed




*Build Failed #9:
OS: SUSE15-64
Target: x86_64-native-linuxapp-gcc
FAILED: app/a172ced@@dpdk-testpmd at exe/test-pmd_flowgen.c.o 
gcc -Iapp/a172ced@@dpdk-testpmd at exe -Iapp -I../app -Ilib/librte_ethdev -I../lib/librte_ethdev -I. -I.. -Iconfig -I../config -Ilib/librte_eal/include -I../lib/librte_eal/include -Ilib/librte_eal/linux/include -I../lib/librte_eal/linux/include -Ilib/librte_eal/x86/include -I../lib/librte_eal/x86/include -Ilib/librte_eal/common -I../lib/librte_eal/common -Ilib/librte_eal -I../lib/librte_eal -Ilib/librte_kvargs -I../lib/librte_kvargs -Ilib/librte_metrics -I../lib/librte_metrics -Ilib/librte_telemetry -I../lib/librte_telemetry -Ilib/librte_net -I../lib/librte_net -Ilib/librte_mbuf -I../lib/librte_mbuf -Ilib/librte_mempool -I../lib/librte_mempool -Ilib/librte_ring -I../lib/librte_ring -Ilib/librte_meter -I../lib/librte_meter -Ilib/librte_gro -I../lib/librte_gro -Ilib/librte_gso -I../lib/librte_gso -Ilib/librte_cmdline -I../lib/librte_cmdline -Idrivers/bus/pci -I../drivers/bus/pci -I../drivers/bus/pci/linux -Ilib/librte_pci -I../lib/librte_pci -Ilib/librte_bitratestats -I../lib/librte_bitratestats -Ilib/librte_pdump -I../lib/librte_pdump -Idrivers/net/bnxt -I../drivers/net/bnxt -I../drivers/net/bnxt/tf_ulp -I../drivers/net/bnxt/tf_core -Idrivers/bus/vdev -I../drivers/bus/vdev -Idrivers/net/i40e -I../drivers/net/i40e -Idrivers/net/i40e/base -I../drivers/net/i40e/base -Ilib/librte_hash -I../lib/librte_hash -Idrivers/net/ixgbe -I../drivers/net/ixgbe -Idrivers/net/ixgbe/base -I../drivers/net/ixgbe/base -Ilib/librte_security -I../lib/librte_security -Ilib/librte_cryptodev -I../lib/librte_cryptodev -Idrivers/bus/dpaa -I../drivers/bus/dpaa -I../drivers/bus/dpaa/include -I../drivers/bus/dpaa/base/qbman -Idrivers/common/dpaax -I../drivers/common/dpaax -I../drivers/common/dpaax/caamflib -Ilib/librte_eventdev -I../lib/librte_eventdev -Ilib/librte_timer -I../lib/librte_timer -Idrivers/mempool/dpaa -I../drivers/mempool/dpaa -Idrivers/net/dpaa -I../drivers/net/dpaa -Ilib/librte_bpf -I../lib/librte_bpf -fdiagnostics-color=always -pipe -D_FILE_OFFSET_BITS=64 -Wall -Winvalid-pch -Werror -O3 -include rte_config.h -Wextra -Wcast-qual -Wdeprecated -Wformat-nonliteral -Wformat-security -Wmissing-declarations -Wmissing-prototypes -Wnested-externs -Wold-style-definition -Wpointer-arith -Wsign-compare -Wstrict-prototypes -Wundef -Wwrite-strings -Wno-missing-field-initializers -D_GNU_SOURCE -march=native -DALLOW_EXPERIMENTAL_API -Wno-deprecated-declarations -MD -MQ 'app/a172ced@@dpdk-testpmd at exe/test-pmd_flowgen.c.o' -MF 'app/a172ced@@dpdk-testpmd at exe/test-pmd_flowgen.c.o.d' -o 'app/a172ced@@dpdk-testpmd at exe/test-pmd_flowgen.c.o' -c ../app/test-pmd/flowgen.c
../app/test-pmd/flowgen.c: In function ‘pkt_burst_flow_gen’:
../app/test-pmd/flowgen.c:178:22: error: ‘pkt’ may be used uninitialized in this function [-Werror=maybe-uninitialized]
   pkts_burst[nb_pkt] = pkt;
   ~~~~~~~~~~~~~~~~~~~^~~~~
cc1: all warnings being treated as errors
[2194/2569] Compiling C object 'app/a172ced@@dpdk-testpmd at exe/test-pmd_icmpecho.c.o'
[2195/2569] Compiling C object 'app/a172ced@@dpdk-testpmd at exe/test-pmd_ieee1588fwd.c.o'
[2196/2569] Compiling C object 'app/a172ced@@dpdk-testpmd at exe/test-pmd_testpmd.c.o'
[2197/2569] Compiling C object 'app/a172ced@@dpdk-testpmd at exe/test-pmd_config.c.o'
[2198/2569] Compiling C object 'app/a172ced@@dpdk-testpmd at exe/test-pmd_cmdline.c.o'
[2199/2569] Compiling C object 'app/a172ced@@dpdk-testpmd at exe/test-pmd_txonly.c.o'
[2200/2569] Compiling C object 'app/a172ced@@dpdk-testpmd at exe/test-pmd_noisy_vnf.c.o'
[2201/2569] Compiling C object 'drivers/a715181@@tmp_rte_pmd_octeontx2_event at sta/event_octeontx2_otx2_worker.c.o'
[2202/2569] Compiling C object 'drivers/a715181@@tmp_rte_pmd_octeontx2_event at sta/event_octeontx2_otx2_worker_dual.c.o'
ninja: build stopped: subcommand failed




*Build Failed #10:
OS: UB1804-64
Target: x86_64-native-linuxapp-gcc
FAILED: app/a172ced@@dpdk-testpmd at exe/test-pmd_flowgen.c.o 
gcc -Iapp/a172ced@@dpdk-testpmd at exe -Iapp -I../app -Ilib/librte_ethdev -I../lib/librte_ethdev -I. -I../ -Iconfig -I../config -Ilib/librte_eal/include -I../lib/librte_eal/include -Ilib/librte_eal/linux/include -I../lib/librte_eal/linux/include -Ilib/librte_eal/x86/include -I../lib/librte_eal/x86/include -Ilib/librte_eal/common -I../lib/librte_eal/common -Ilib/librte_eal -I../lib/librte_eal -Ilib/librte_kvargs -I../lib/librte_kvargs -Ilib/librte_telemetry/../librte_metrics -I../lib/librte_telemetry/../librte_metrics -Ilib/librte_telemetry -I../lib/librte_telemetry -Ilib/librte_net -I../lib/librte_net -Ilib/librte_mbuf -I../lib/librte_mbuf -Ilib/librte_mempool -I../lib/librte_mempool -Ilib/librte_ring -I../lib/librte_ring -Ilib/librte_meter -I../lib/librte_meter -Ilib/librte_gro -I../lib/librte_gro -Ilib/librte_gso -I../lib/librte_gso -Ilib/librte_cmdline -I../lib/librte_cmdline -Ilib/librte_metrics -I../lib/librte_metrics -Idrivers/bus/pci -I../drivers/bus/pci -I../drivers/bus/pci/linux -Ilib/librte_pci -I../lib/librte_pci -Ilib/librte_bitratestats -I../lib/librte_bitratestats -Ilib/librte_pdump -I../lib/librte_pdump -Idrivers/net/bnxt -I../drivers/net/bnxt -I../drivers/net/bnxt/tf_ulp -I../drivers/net/bnxt/tf_core -Idrivers/bus/vdev -I../drivers/bus/vdev -Idrivers/net/i40e -I../drivers/net/i40e -Idrivers/net/i40e/base -I../drivers/net/i40e/base -Ilib/librte_hash -I../lib/librte_hash -Idrivers/net/ixgbe -I../drivers/net/ixgbe -Idrivers/net/ixgbe/base -I../drivers/net/ixgbe/base -Ilib/librte_security -I../lib/librte_security -Ilib/librte_cryptodev -I../lib/librte_cryptodev -Idrivers/bus/dpaa -I../drivers/bus/dpaa -I../drivers/bus/dpaa/include -I../drivers/bus/dpaa/base/qbman -Idrivers/common/dpaax -I../drivers/common/dpaax -I../drivers/common/dpaax/caamflib -Ilib/librte_eventdev -I../lib/librte_eventdev -Ilib/librte_timer -I../lib/librte_timer -Idrivers/mempool/dpaa -I../drivers/mempool/dpaa -Idrivers/net/dpaa -I../drivers/net/dpaa -Ilib/librte_bpf -I../lib/librte_bpf -fdiagnostics-color=always -pipe -D_FILE_OFFSET_BITS=64 -Wall -Winvalid-pch -Werror -O3 -include rte_config.h -Wextra -Wcast-qual -Wdeprecated -Wformat-nonliteral -Wformat-security -Wmissing-declarations -Wmissing-prototypes -Wnested-externs -Wold-style-definition -Wpointer-arith -Wsign-compare -Wstrict-prototypes -Wundef -Wwrite-strings -Wno-packed-not-aligned -Wno-missing-field-initializers -D_GNU_SOURCE -march=native -mno-avx512f -DALLOW_EXPERIMENTAL_API -Wno-deprecated-declarations -MD -MQ 'app/a172ced@@dpdk-testpmd at exe/test-pmd_flowgen.c.o' -MF 'app/a172ced@@dpdk-testpmd at exe/test-pmd_flowgen.c.o.d' -o 'app/a172ced@@dpdk-testpmd at exe/test-pmd_flowgen.c.o' -c ../app/test-pmd/flowgen.c
../app/test-pmd/flowgen.c: In function ‘pkt_burst_flow_gen’:
../app/test-pmd/flowgen.c:178:22: error: ‘pkt’ may be used uninitialized in this function [-Werror=maybe-uninitialized]
   pkts_burst[nb_pkt] = pkt;
   ~~~~~~~~~~~~~~~~~~~^~~~~
cc1: all warnings being treated as errors
[2220/2589] Compiling C object 'app/a172ced@@dpdk-testpmd at exe/test-pmd_rxonly.c.o'.
[2221/2589] Compiling C object 'app/a172ced@@dpdk-testpmd at exe/test-pmd_config.c.o'.
[2222/2589] Compiling C object 'app/a172ced@@dpdk-testpmd at exe/test-pmd_parameters.c.o'.
[2223/2589] Compiling C object 'app/a172ced@@dpdk-testpmd at exe/test-pmd_txonly.c.o'.
[2224/2589] Compiling C object 'app/a172ced@@dpdk-testpmd at exe/test-pmd_noisy_vnf.c.o'.
[2225/2589] Compiling C object 'app/a172ced@@dpdk-testpmd at exe/test-pmd_cmdline.c.o'.
[2226/2589] Compiling C object 'app/a172ced@@dpdk-testpmd at exe/test-pmd_testpmd.c.o'.
[2227/2589] Compiling C object 'drivers/a715181@@tmp_rte_pmd_octeontx2_event at sta/event_octeontx2_otx2_worker.c.o'.
[2228/2589] Compiling C object 'drivers/a715181@@tmp_rte_pmd_octeontx2_event at sta/event_octeontx2_otx2_worker_dual.c.o'.
ninja: build stopped: subcommand failed




*Build Failed #11:
OS: UB2004-32
Target: i686-native-linuxapp-gcc
FAILED: app/a172ced@@dpdk-testpmd at exe/test-pmd_flowgen.c.o 
gcc -Iapp/a172ced@@dpdk-testpmd at exe -Iapp -I../app -Ilib/librte_ethdev -I../lib/librte_ethdev -I. -I../ -Iconfig -I../config -Ilib/librte_eal/include -I../lib/librte_eal/include -Ilib/librte_eal/linux/include -I../lib/librte_eal/linux/include -Ilib/librte_eal/x86/include -I../lib/librte_eal/x86/include -Ilib/librte_eal/common -I../lib/librte_eal/common -Ilib/librte_eal -I../lib/librte_eal -Ilib/librte_kvargs -I../lib/librte_kvargs -Ilib/librte_telemetry/../librte_metrics -I../lib/librte_telemetry/../librte_metrics -Ilib/librte_telemetry -I../lib/librte_telemetry -Ilib/librte_net -I../lib/librte_net -Ilib/librte_mbuf -I../lib/librte_mbuf -Ilib/librte_mempool -I../lib/librte_mempool -Ilib/librte_ring -I../lib/librte_ring -Ilib/librte_meter -I../lib/librte_meter -Ilib/librte_gro -I../lib/librte_gro -Ilib/librte_gso -I../lib/librte_gso -Ilib/librte_cmdline -I../lib/librte_cmdline -Ilib/librte_metrics -I../lib/librte_metrics -Idrivers/bus/pci -I../drivers/bus/pci -I../drivers/bus/pci/linux -Ilib/librte_pci -I../lib/librte_pci -Ilib/librte_bitratestats -I../lib/librte_bitratestats -Ilib/librte_pdump -I../lib/librte_pdump -Idrivers/net/bnxt -I../drivers/net/bnxt -I../drivers/net/bnxt/tf_ulp -I../drivers/net/bnxt/tf_core -Idrivers/bus/vdev -I../drivers/bus/vdev -Idrivers/net/i40e -I../drivers/net/i40e -Idrivers/net/i40e/base -I../drivers/net/i40e/base -Ilib/librte_hash -I../lib/librte_hash -Idrivers/net/ixgbe -I../drivers/net/ixgbe -Idrivers/net/ixgbe/base -I../drivers/net/ixgbe/base -Ilib/librte_security -I../lib/librte_security -Ilib/librte_cryptodev -I../lib/librte_cryptodev -Idrivers/bus/dpaa -I../drivers/bus/dpaa -I../drivers/bus/dpaa/include -I../drivers/bus/dpaa/base/qbman -Idrivers/common/dpaax -I../drivers/common/dpaax -I../drivers/common/dpaax/caamflib -Ilib/librte_eventdev -I../lib/librte_eventdev -Ilib/librte_timer -I../lib/librte_timer -Idrivers/mempool/dpaa -I../drivers/mempool/dpaa -Idrivers/net/dpaa -I../drivers/net/dpaa -Ilib/librte_bpf -I../lib/librte_bpf -fdiagnostics-color=always -pipe -D_FILE_OFFSET_BITS=64 -Wall -Winvalid-pch -Werror -O3 -include rte_config.h -Wextra -Wcast-qual -Wdeprecated -Wformat-nonliteral -Wformat-security -Wmissing-declarations -Wmissing-prototypes -Wnested-externs -Wold-style-definition -Wpointer-arith -Wsign-compare -Wstrict-prototypes -Wundef -Wwrite-strings -Wno-address-of-packed-member -Wno-packed-not-aligned -Wno-missing-field-initializers -Wno-pointer-to-int-cast -D_GNU_SOURCE -m32 -march=native -DALLOW_EXPERIMENTAL_API -Wno-deprecated-declarations -MD -MQ 'app/a172ced@@dpdk-testpmd at exe/test-pmd_flowgen.c.o' -MF 'app/a172ced@@dpdk-testpmd at exe/test-pmd_flowgen.c.o.d' -o 'app/a172ced@@dpdk-testpmd at exe/test-pmd_flowgen.c.o' -c ../app/test-pmd/flowgen.c
../app/test-pmd/flowgen.c: In function ‘pkt_burst_flow_gen’:
../app/test-pmd/flowgen.c:178:22: error: ‘pkt’ may be used uninitialized in this function [-Werror=maybe-uninitialized]
  178 |   pkts_burst[nb_pkt] = pkt;
      |   ~~~~~~~~~~~~~~~~~~~^~~~~
cc1: all warnings being treated as errors
[991/2338] Linking target drivers/librte_pmd_dpaa.so.21.0.
[992/2338] Compiling C object 'drivers/net/e1000/base/8e1fdff@@e1000_base at sta/e1000_ich8lan.c.o'.
[993/2338] Compiling C object 'app/a172ced@@dpdk-testpmd at exe/test-pmd_ieee1588fwd.c.o'.
[994/2338] Compiling C object 'app/a172ced@@dpdk-test-eventdev at exe/test-eventdev_parser.c.o'.
[995/2338] Compiling C object 'app/a172ced@@dpdk-test-flow-perf at exe/test-flow-perf_flow_gen.c.o'.
[996/2338] Compiling C object 'app/a172ced@@dpdk-test-eventdev at exe/test-eventdev_test_order_queue.c.o'.
[997/2338] Compiling C object 'drivers/a715181@@tmp_rte_pmd_dpaa2 at sta/net_dpaa2_dpaa2_flow.c.o'.
[998/2338] Compiling C object 'app/a172ced@@dpdk-testpmd at exe/test-pmd_csumonly.c.o'.
[999/2338] Compiling C object 'lib/76b5a35@@rte_pipeline at sta/librte_pipeline_rte_table_action.c.o'.
ninja: build stopped: subcommand failed




*Build Failed #12:
OS: UB2004-64
Target: x86_64-native-linuxapp-gcc
FAILED: app/a172ced@@dpdk-testpmd at exe/test-pmd_flowgen.c.o 
gcc -Iapp/a172ced@@dpdk-testpmd at exe -Iapp -I../app -Ilib/librte_ethdev -I../lib/librte_ethdev -I. -I../ -Iconfig -I../config -Ilib/librte_eal/include -I../lib/librte_eal/include -Ilib/librte_eal/linux/include -I../lib/librte_eal/linux/include -Ilib/librte_eal/x86/include -I../lib/librte_eal/x86/include -Ilib/librte_eal/common -I../lib/librte_eal/common -Ilib/librte_eal -I../lib/librte_eal -Ilib/librte_kvargs -I../lib/librte_kvargs -Ilib/librte_telemetry/../librte_metrics -I../lib/librte_telemetry/../librte_metrics -Ilib/librte_telemetry -I../lib/librte_telemetry -Ilib/librte_net -I../lib/librte_net -Ilib/librte_mbuf -I../lib/librte_mbuf -Ilib/librte_mempool -I../lib/librte_mempool -Ilib/librte_ring -I../lib/librte_ring -Ilib/librte_meter -I../lib/librte_meter -Ilib/librte_gro -I../lib/librte_gro -Ilib/librte_gso -I../lib/librte_gso -Ilib/librte_cmdline -I../lib/librte_cmdline -Ilib/librte_metrics -I../lib/librte_metrics -Idrivers/bus/pci -I../drivers/bus/pci -I../drivers/bus/pci/linux -Ilib/librte_pci -I../lib/librte_pci -Ilib/librte_bitratestats -I../lib/librte_bitratestats -Ilib/librte_pdump -I../lib/librte_pdump -Idrivers/net/bnxt -I../drivers/net/bnxt -I../drivers/net/bnxt/tf_ulp -I../drivers/net/bnxt/tf_core -Idrivers/bus/vdev -I../drivers/bus/vdev -Idrivers/net/i40e -I../drivers/net/i40e -Idrivers/net/i40e/base -I../drivers/net/i40e/base -Ilib/librte_hash -I../lib/librte_hash -Idrivers/net/ixgbe -I../drivers/net/ixgbe -Idrivers/net/ixgbe/base -I../drivers/net/ixgbe/base -Ilib/librte_security -I../lib/librte_security -Ilib/librte_cryptodev -I../lib/librte_cryptodev -Idrivers/bus/dpaa -I../drivers/bus/dpaa -I../drivers/bus/dpaa/include -I../drivers/bus/dpaa/base/qbman -Idrivers/common/dpaax -I../drivers/common/dpaax -I../drivers/common/dpaax/caamflib -Ilib/librte_eventdev -I../lib/librte_eventdev -Ilib/librte_timer -I../lib/librte_timer -Idrivers/mempool/dpaa -I../drivers/mempool/dpaa -Idrivers/net/dpaa -I../drivers/net/dpaa -Ilib/librte_bpf -I../lib/librte_bpf -fdiagnostics-color=always -pipe -D_FILE_OFFSET_BITS=64 -Wall -Winvalid-pch -Werror -O3 -include rte_config.h -Wextra -Wcast-qual -Wdeprecated -Wformat-nonliteral -Wformat-security -Wmissing-declarations -Wmissing-prototypes -Wnested-externs -Wold-style-definition -Wpointer-arith -Wsign-compare -Wstrict-prototypes -Wundef -Wwrite-strings -Wno-address-of-packed-member -Wno-packed-not-aligned -Wno-missing-field-initializers -Wno-zero-length-bounds -D_GNU_SOURCE -march=native -DALLOW_EXPERIMENTAL_API -Wno-deprecated-declarations -MD -MQ 'app/a172ced@@dpdk-testpmd at exe/test-pmd_flowgen.c.o' -MF 'app/a172ced@@dpdk-testpmd at exe/test-pmd_flowgen.c.o.d' -o 'app/a172ced@@dpdk-testpmd at exe/test-pmd_flowgen.c.o' -c ../app/test-pmd/flowgen.c
../app/test-pmd/flowgen.c: In function ‘pkt_burst_flow_gen’:
../app/test-pmd/flowgen.c:178:22: error: ‘pkt’ may be used uninitialized in this function [-Werror=maybe-uninitialized]
  178 |   pkts_burst[nb_pkt] = pkt;
      |   ~~~~~~~~~~~~~~~~~~~^~~~~
cc1: all warnings being treated as errors
[2219/2591] Compiling C object 'app/a172ced@@dpdk-testpmd at exe/test-pmd_util.c.o'.
[2220/2591] Compiling C object 'app/a172ced@@dpdk-testpmd at exe/test-pmd_rxonly.c.o'.
[2221/2591] Compiling C object 'app/a172ced@@dpdk-testpmd at exe/test-pmd_parameters.c.o'.
[2222/2591] Compiling C object 'app/a172ced@@dpdk-testpmd at exe/test-pmd_txonly.c.o'.
[2223/2591] Compiling C object 'app/a172ced@@dpdk-testpmd at exe/test-pmd_csumonly.c.o'.
[2224/2591] Compiling C object 'app/a172ced@@dpdk-testpmd at exe/test-pmd_noisy_vnf.c.o'.
[2225/2591] Compiling C object 'app/a172ced@@dpdk-testpmd at exe/test-pmd_testpmd.c.o'.
[2226/2591] Compiling C object 'drivers/a715181@@tmp_rte_pmd_octeontx2_event at sta/event_octeontx2_otx2_worker.c.o'.
[2227/2591] Compiling C object 'drivers/a715181@@tmp_rte_pmd_octeontx2_event at sta/event_octeontx2_otx2_worker_dual.c.o'.
ninja: build stopped: subcommand failed




*Build Failed #13:
OS: UB2004-64
Target: x86_64-native-linuxapp-doc
FAILED: app/a172ced@@dpdk-testpmd at exe/test-pmd_flowgen.c.o 
gcc -Iapp/a172ced@@dpdk-testpmd at exe -Iapp -I../app -Ilib/librte_ethdev -I../lib/librte_ethdev -I. -I../ -Iconfig -I../config -Ilib/librte_eal/include -I../lib/librte_eal/include -Ilib/librte_eal/linux/include -I../lib/librte_eal/linux/include -Ilib/librte_eal/x86/include -I../lib/librte_eal/x86/include -Ilib/librte_eal/common -I../lib/librte_eal/common -Ilib/librte_eal -I../lib/librte_eal -Ilib/librte_kvargs -I../lib/librte_kvargs -Ilib/librte_telemetry/../librte_metrics -I../lib/librte_telemetry/../librte_metrics -Ilib/librte_telemetry -I../lib/librte_telemetry -Ilib/librte_net -I../lib/librte_net -Ilib/librte_mbuf -I../lib/librte_mbuf -Ilib/librte_mempool -I../lib/librte_mempool -Ilib/librte_ring -I../lib/librte_ring -Ilib/librte_meter -I../lib/librte_meter -Ilib/librte_gro -I../lib/librte_gro -Ilib/librte_gso -I../lib/librte_gso -Ilib/librte_cmdline -I../lib/librte_cmdline -Ilib/librte_metrics -I../lib/librte_metrics -Idrivers/bus/pci -I../drivers/bus/pci -I../drivers/bus/pci/linux -Ilib/librte_pci -I../lib/librte_pci -Ilib/librte_bitratestats -I../lib/librte_bitratestats -Ilib/librte_pdump -I../lib/librte_pdump -Idrivers/net/bnxt -I../drivers/net/bnxt -I../drivers/net/bnxt/tf_ulp -I../drivers/net/bnxt/tf_core -Idrivers/bus/vdev -I../drivers/bus/vdev -Idrivers/net/i40e -I../drivers/net/i40e -Idrivers/net/i40e/base -I../drivers/net/i40e/base -Ilib/librte_hash -I../lib/librte_hash -Idrivers/net/ixgbe -I../drivers/net/ixgbe -Idrivers/net/ixgbe/base -I../drivers/net/ixgbe/base -Ilib/librte_security -I../lib/librte_security -Ilib/librte_cryptodev -I../lib/librte_cryptodev -Idrivers/bus/dpaa -I../drivers/bus/dpaa -I../drivers/bus/dpaa/include -I../drivers/bus/dpaa/base/qbman -Idrivers/common/dpaax -I../drivers/common/dpaax -I../drivers/common/dpaax/caamflib -Ilib/librte_eventdev -I../lib/librte_eventdev -Ilib/librte_timer -I../lib/librte_timer -Idrivers/mempool/dpaa -I../drivers/mempool/dpaa -Idrivers/net/dpaa -I../drivers/net/dpaa -Ilib/librte_bpf -I../lib/librte_bpf -fdiagnostics-color=always -pipe -D_FILE_OFFSET_BITS=64 -Wall -Winvalid-pch -Werror -O3 -include rte_config.h -Wextra -Wcast-qual -Wdeprecated -Wformat-nonliteral -Wformat-security -Wmissing-declarations -Wmissing-prototypes -Wnested-externs -Wold-style-definition -Wpointer-arith -Wsign-compare -Wstrict-prototypes -Wundef -Wwrite-strings -Wno-address-of-packed-member -Wno-packed-not-aligned -Wno-missing-field-initializers -D_GNU_SOURCE -march=native -DALLOW_EXPERIMENTAL_API -Wno-deprecated-declarations -MD -MQ 'app/a172ced@@dpdk-testpmd at exe/test-pmd_flowgen.c.o' -MF 'app/a172ced@@dpdk-testpmd at exe/test-pmd_flowgen.c.o.d' -o 'app/a172ced@@dpdk-testpmd at exe/test-pmd_flowgen.c.o' -c ../app/test-pmd/flowgen.c
../app/test-pmd/flowgen.c: In function ‘pkt_burst_flow_gen’:
../app/test-pmd/flowgen.c:178:22: error: ‘pkt’ may be used uninitialized in this function [-Werror=maybe-uninitialized]
  178 |   pkts_burst[nb_pkt] = pkt;
      |   ~~~~~~~~~~~~~~~~~~~^~~~~
cc1: all warnings being treated as errors
[2260/2450] Compiling C object 'app/a172ced@@dpdk-testpmd at exe/test-pmd_icmpecho.c.o'.
[2261/2450] Compiling C object 'app/a172ced@@dpdk-testpmd at exe/test-pmd_cmdline_flow.c.o'.
[2262/2450] Compiling C object 'app/a172ced@@dpdk-testpmd at exe/test-pmd_macswap.c.o'.
[2263/2450] Compiling C object 'app/a172ced@@dpdk-testpmd at exe/test-pmd_config.c.o'.
[2264/2450] Compiling C object 'app/a172ced@@dpdk-testpmd at exe/test-pmd_csumonly.c.o'.
[2265/2450] Compiling C object 'app/a172ced@@dpdk-testpmd at exe/test-pmd_noisy_vnf.c.o'.
[2266/2450] Compiling C object 'app/a172ced@@dpdk-testpmd at exe/test-pmd_cmdline.c.o'.
[2267/2450] Compiling C object 'drivers/a715181@@tmp_rte_pmd_octeontx2_event at sta/event_octeontx2_otx2_worker.c.o'.
[2268/2450] Compiling C object 'drivers/a715181@@tmp_rte_pmd_octeontx2_event at sta/event_octeontx2_otx2_worker_dual.c.o'.
ninja: build stopped: subcommand failed


DPDK STV team


More information about the test-report mailing list