[dpdk-test-report] |FAILURE| pw(78780) net/qede: enhance old ethdev close behavior

sys_stv at intel.com sys_stv at intel.com
Fri Sep 25 09:14:41 CEST 2020


Test-Label: Intel-compilation
Test-Status: FAILURE
http://dpdk.org/patch/78780

_Compilation issues_

Submitter: Rasesh Mody <rmody at marvell.com>
Date: 2020-09-25 04:17:44
Reply_mail: 20200925041744.17688-2-rmody at marvell.com

DPDK git baseline: Repo:dpdk-next-net-mrvl, CommitID: c1b2545ac02aa63eef20fad20709829f55d23885


Meson Build Summary: 21 Builds Done, 19 Successful, 2 Failures, 0 Blocked

+----------------+------------+--------------+------------+------------+-----------+----------+
| os             | gcc-static | clang-static | icc-static | gcc-shared | gcc-debug | document |
+----------------+------------+--------------+------------+------------+-----------+----------+
| CENTOS82-64    | pass       | pass         | FAIL       | pass       | pass      |          |
| RHEL82-64      | pass       |              |            |            |           |          |
| UB1804-64      | pass       |              |            |            |           |          |
| FC32-64        | pass       | pass         |            |            |           |          |
| UB2004-64      | pass       | pass         | FAIL       |            |           | pass     |
| WIN10-64       |            | pass         |            |            |           |          |
| UB2004-32      | pass       |              |            |            |           |          |
| FreeBSD1201-64 | pass       | pass         |            | pass       | pass      |          |
| SUSE15-64      | pass       | pass         |            |            |           |          |
+----------------+------------+--------------+------------+------------+-----------+----------+
Test environment and configuration as below:


OS: CENTOS82-64
	Kernel Version: 4.18.0-193.el8.x86_64
	CPU info: Intel(R) Xeon(R) Platinum 8280M CPU @ 2.70GHz
	GCC Version: gcc (GCC) 8.3.1 20191121 (Red Hat 8.3.1-5)
	Clang Version: 9.0.1 (Red Hat 9.0.1-2.module_el8.2.0+309+0c7b6b03)
	x86_64-native-linuxapp-gcc
	x86_64-native-linuxapp-clang
	x86_64-native-linuxapp-icc
	x86_64-native-linuxapp-gcc+shared
	x86_64-native-linuxapp-gcc+debug

OS: RHEL82-64
	Kernel Version: 4.18.0-193.el8.x86_64
	CPU info: Intel(R) Xeon(R) Platinum 8280M CPU @ 2.70GHz
	GCC Version: gcc (GCC) 8.3.1 20191121 (Red Hat 8.3.1-5)
	Clang Version: 8.0.1 (Red Hat 8.0.1-1.module_el8.1.0+215+a01033fb)
	x86_64-native-linuxapp-gcc

OS: UB1804-64
	Kernel Version: 5.3.0-59-generic
	CPU info: Intel(R) Xeon(R) Platinum 8180 CPU @ 2.50GHz
	GCC Version: gcc (Ubuntu 8.4.0-1ubuntu1~18.04) 8.4.0
	Clang Version: 6.0.0-1ubuntu2 (tags/RELEASE_600/final)
	x86_64-native-linuxapp-gcc

OS: FC32-64
	Kernel Version: 5.6.0-0.rc7.git0.2.fc32.x86_64
	CPU info: Intel(R) Xeon(R) Platinum 8280M CPU @ 2.70GHz
	GCC Version: gcc (GCC) 10.0.1 20200311 (Red Hat 10.0.1-0.9)
	Clang Version: 10.0.0 (Fedora 10.0.0-0.3.rc4.fc32)
	x86_64-native-linuxapp-gcc
	x86_64-native-linuxapp-clang

OS: UB2004-64
	Kernel Version: 5.4.0-26-generic
	CPU info: Intel(R) Xeon(R) Platinum 8180 CPU @ 2.50GHz
	GCC Version: gcc (Ubuntu 10-20200416-0ubuntu1) 10.0.1 20200416 (experimental) [master revision 3c3f12e2a76:dcee354ce56:44b326839d864fc10c459916abcc97f35a9ac3de]
	Clang Version: 10.0.0-4ubuntu1
	x86_64-native-linuxapp-clang
	x86_64-native-linuxapp-gcc
	x86_64-native-linuxapp-icc
	x86_64-native-linuxapp-doc

OS: WIN10-64
	Kernel Version: N/A
	CPU info: N/A
	GCC Version: N/A
	Clang Version: Clang 8.0.0
	x86_64-windows-clang

OS: UB2004-32
	Kernel Version: 5.4.0-26-generic
	CPU info: Intel(R) Xeon(R) Platinum 8180 CPU @ 2.50GHz
	GCC Version: gcc (Ubuntu 9.3.0-10ubuntu2) 9.3.0
	Clang Version: 10.0.0-4ubuntu1
	i686-native-linuxapp-gcc

OS: FreeBSD1201-64
	Kernel Version: 12.1-RELEASE
	CPU info: Intel(R) Xeon(R) CPU E5-2699 v3 @ 2.30GHz (2294.74-MHz K8-class CPU)
	GCC Version: gcc (FreeBSD Ports Collection) 9.2.0
	Clang Version: 8.0.1 (tags/RELEASE_801/final 366581) (based on LLVM 8.0.1)
	x86_64-native-bsdapp-gcc
	x86_64-native-bsdapp-clang
	x86_64-native-bsdapp-gcc+shared
	x86_64-native-bsdapp-gcc+debug

OS: SUSE15-64
	Kernel Version: 4.12.14-lp150.11-default
	CPU info: Intel(R) Xeon(R) CPU E5-2699 v4 @ 2.20GHz
	GCC Version: gcc (SUSE Linux) 7.3.1 20180323 [gcc-7-branch revision 258812]
	Clang Version: 5.0.1 (tags/RELEASE_501/final 312548)
	x86_64-native-linuxapp-clang
	x86_64-native-linuxapp-gcc



*Build Failed #1:
OS: CENTOS82-64
Target: x86_64-native-linuxapp-icc
FAILED: drivers/a715181@@tmp_rte_pmd_octeontx2_crypto at sta/crypto_octeontx2_otx2_cryptodev_hw_access.c.o 
icc -Idrivers/a715181@@tmp_rte_pmd_octeontx2_crypto at sta -Idrivers -I../drivers -Idrivers/crypto/octeontx2 -I../drivers/crypto/octeontx2 -Idrivers/crypto/octeontx2/../../common/cpt -I../drivers/crypto/octeontx2/../../common/cpt -Idrivers/crypto/octeontx2/../../common/octeontx2 -I../drivers/crypto/octeontx2/../../common/octeontx2 -Idrivers/crypto/octeontx2/../../crypto/octeontx2 -I../drivers/crypto/octeontx2/../../crypto/octeontx2 -Idrivers/crypto/octeontx2/../../mempool/octeontx2 -I../drivers/crypto/octeontx2/../../mempool/octeontx2 -Idrivers/crypto/octeontx2/../../net/octeontx2 -I../drivers/crypto/octeontx2/../../net/octeontx2 -Ilib/librte_cryptodev -I../lib/librte_cryptodev -I. -I../ -Iconfig -I../config -Ilib/librte_eal/include -I../lib/librte_eal/include -Ilib/librte_eal/linux/include -I../lib/librte_eal/linux/include -Ilib/librte_eal/x86/include -I../lib/librte_eal/x86/include -Ilib/librte_eal/common -I../lib/librte_eal/common -Ilib/librte_eal -I../lib/librte_eal -Ilib/librte_kvargs -I../lib/librte_kvargs -Ilib/librte_telemetry/../librte_metrics -I../lib/librte_telemetry/../librte_metrics -Ilib/librte_telemetry -I../lib/librte_telemetry -Ilib/librte_mbuf -I../lib/librte_mbuf -Ilib/librte_mempool -I../lib/librte_mempool -Ilib/librte_ring -I../lib/librte_ring -Idrivers/bus/pci -I../drivers/bus/pci -I../drivers/bus/pci/linux -Ilib/librte_pci -I../lib/librte_pci -Idrivers/common/cpt -I../drivers/common/cpt -Idrivers/common/cpt/../../crypto/octeontx -I../drivers/common/cpt/../../crypto/octeontx -Idrivers/common/octeontx2 -I../drivers/common/octeontx2 -Idrivers/common/octeontx2/../../common/octeontx2 -I../drivers/common/octeontx2/../../common/octeontx2 -Idrivers/common/octeontx2/../../mempool/octeontx2 -I../drivers/common/octeontx2/../../mempool/octeontx2 -Idrivers/common/octeontx2/../../bus/pci -I../drivers/common/octeontx2/../../bus/pci -Ilib/librte_ethdev -I../lib/librte_ethdev -Ilib/librte_net -I../lib/librte_net -Ilib/librte_meter -I../lib/librte_meter -Ilib/librte_security -I../lib/librte_security -pipe -D_FILE_OFFSET_BITS=64 -Wall -w3 -diag-disable:remark -Werror -O3 -include rte_config.h -Wextra -Wcast-qual -Wdeprecated -Wformat-security -Wmissing-declarations -Wmissing-prototypes -Wold-style-definition -Wpointer-arith -Wsign-compare -Wstrict-prototypes -Wundef -Wwrite-strings -Wno-missing-field-initializers -diag-disable=188 -diag-disable=2203 -diag-disable=2279 -diag-disable=2557 -diag-disable=3179 -diag-disable=3656 -D_GNU_SOURCE -fPIC -march=native -mno-avx512f -DALLOW_EXPERIMENTAL_API -DALLOW_INTERNAL_API -MD -MQ 'drivers/a715181@@tmp_rte_pmd_octeontx2_crypto at sta/crypto_octeontx2_otx2_cryptodev_hw_access.c.o' -MF 'drivers/a715181@@tmp_rte_pmd_octeontx2_crypto at sta/crypto_octeontx2_otx2_cryptodev_hw_access.c.o.d' -o 'drivers/a715181@@tmp_rte_pmd_octeontx2_crypto at sta/crypto_octeontx2_otx2_cryptodev_hw_access.c.o' -c ../drivers/crypto/octeontx2/otx2_cryptodev_hw_access.c
In file included from ../drivers/crypto/octeontx2/otx2_cryptodev_hw_access.c(7):
../drivers/crypto/octeontx2/otx2_cryptodev.h(41): error #1366: a reduction in alignment without the "packed" attribute is ignored
  	struct cpt_request_info cpt_req __rte_aligned(8);
  	                        ^

compilation aborted for ../drivers/crypto/octeontx2/otx2_cryptodev_hw_access.c (code 2)
[1850/2578] Linking target drivers/librte_pmd_nitrox.so.20.0.3.
[1851/2578] Compiling C object 'drivers/a715181@@tmp_rte_pmd_octeontx2_crypto at sta/crypto_octeontx2_otx2_cryptodev_mbox.c.o'.
FAILED: drivers/a715181@@tmp_rte_pmd_octeontx2_crypto at sta/crypto_octeontx2_otx2_cryptodev_mbox.c.o 
icc -Idrivers/a715181@@tmp_rte_pmd_octeontx2_crypto at sta -Idrivers -I../drivers -Idrivers/crypto/octeontx2 -I../drivers/crypto/octeontx2 -Idrivers/crypto/octeontx2/../../common/cpt -I../drivers/crypto/octeontx2/../../common/cpt -Idrivers/crypto/octeontx2/../../common/octeontx2 -I../drivers/crypto/octeontx2/../../common/octeontx2 -Idrivers/crypto/octeontx2/../../crypto/octeontx2 -I../drivers/crypto/octeontx2/../../crypto/octeontx2 -Idrivers/crypto/octeontx2/../../mempool/octeontx2 -I../drivers/crypto/octeontx2/../../mempool/octeontx2 -Idrivers/crypto/octeontx2/../../net/octeontx2 -I../drivers/crypto/octeontx2/../../net/octeontx2 -Ilib/librte_cryptodev -I../lib/librte_cryptodev -I. -I../ -Iconfig -I../config -Ilib/librte_eal/include -I../lib/librte_eal/include -Ilib/librte_eal/linux/include -I../lib/librte_eal/linux/include -Ilib/librte_eal/x86/include -I../lib/librte_eal/x86/include -Ilib/librte_eal/common -I../lib/librte_eal/common -Ilib/librte_eal -I../lib/librte_eal -Ilib/librte_kvargs -I../lib/librte_kvargs -Ilib/librte_telemetry/../librte_metrics -I../lib/librte_telemetry/../librte_metrics -Ilib/librte_telemetry -I../lib/librte_telemetry -Ilib/librte_mbuf -I../lib/librte_mbuf -Ilib/librte_mempool -I../lib/librte_mempool -Ilib/librte_ring -I../lib/librte_ring -Idrivers/bus/pci -I../drivers/bus/pci -I../drivers/bus/pci/linux -Ilib/librte_pci -I../lib/librte_pci -Idrivers/common/cpt -I../drivers/common/cpt -Idrivers/common/cpt/../../crypto/octeontx -I../drivers/common/cpt/../../crypto/octeontx -Idrivers/common/octeontx2 -I../drivers/common/octeontx2 -Idrivers/common/octeontx2/../../common/octeontx2 -I../drivers/common/octeontx2/../../common/octeontx2 -Idrivers/common/octeontx2/../../mempool/octeontx2 -I../drivers/common/octeontx2/../../mempool/octeontx2 -Idrivers/common/octeontx2/../../bus/pci -I../drivers/common/octeontx2/../../bus/pci -Ilib/librte_ethdev -I../lib/librte_ethdev -Ilib/librte_net -I../lib/librte_net -Ilib/librte_meter -I../lib/librte_meter -Ilib/librte_security -I../lib/librte_security -pipe -D_FILE_OFFSET_BITS=64 -Wall -w3 -diag-disable:remark -Werror -O3 -include rte_config.h -Wextra -Wcast-qual -Wdeprecated -Wformat-security -Wmissing-declarations -Wmissing-prototypes -Wold-style-definition -Wpointer-arith -Wsign-compare -Wstrict-prototypes -Wundef -Wwrite-strings -Wno-missing-field-initializers -diag-disable=188 -diag-disable=2203 -diag-disable=2279 -diag-disable=2557 -diag-disable=3179 -diag-disable=3656 -D_GNU_SOURCE -fPIC -march=native -mno-avx512f -DALLOW_EXPERIMENTAL_API -DALLOW_INTERNAL_API -MD -MQ 'drivers/a715181@@tmp_rte_pmd_octeontx2_crypto at sta/crypto_octeontx2_otx2_cryptodev_mbox.c.o' -MF 'drivers/a715181@@tmp_rte_pmd_octeontx2_crypto at sta/crypto_octeontx2_otx2_cryptodev_mbox.c.o.d' -o 'drivers/a715181@@tmp_rte_pmd_octeontx2_crypto at sta/crypto_octeontx2_otx2_cryptodev_mbox.c.o' -c ../drivers/crypto/octeontx2/otx2_cryptodev_mbox.c
In file included from ../drivers/crypto/octeontx2/otx2_cryptodev_mbox.c(7):
../drivers/crypto/octeontx2/otx2_cryptodev.h(41): error #1366: a reduction in alignment without the "packed" attribute is ignored
  	struct cpt_request_info cpt_req __rte_aligned(8);
  	                        ^

compilation aborted for ../drivers/crypto/octeontx2/otx2_cryptodev_mbox.c (code 2)
[1852/2578] Compiling C object 'drivers/a715181@@rte_pmd_ccp at sta/meson-generated_.._rte_pmd_ccp.pmd.c.o'.
[1853/2578] Compiling C object 'drivers/a715181@@tmp_rte_pmd_octeontx2_crypto at sta/crypto_octeontx2_otx2_cryptodev_capabilities.c.o'.
FAILED: drivers/a715181@@tmp_rte_pmd_octeontx2_crypto at sta/crypto_octeontx2_otx2_cryptodev_capabilities.c.o 
icc -Idrivers/a715181@@tmp_rte_pmd_octeontx2_crypto at sta -Idrivers -I../drivers -Idrivers/crypto/octeontx2 -I../drivers/crypto/octeontx2 -Idrivers/crypto/octeontx2/../../common/cpt -I../drivers/crypto/octeontx2/../../common/cpt -Idrivers/crypto/octeontx2/../../common/octeontx2 -I../drivers/crypto/octeontx2/../../common/octeontx2 -Idrivers/crypto/octeontx2/../../crypto/octeontx2 -I../drivers/crypto/octeontx2/../../crypto/octeontx2 -Idrivers/crypto/octeontx2/../../mempool/octeontx2 -I../drivers/crypto/octeontx2/../../mempool/octeontx2 -Idrivers/crypto/octeontx2/../../net/octeontx2 -I../drivers/crypto/octeontx2/../../net/octeontx2 -Ilib/librte_cryptodev -I../lib/librte_cryptodev -I. -I../ -Iconfig -I../config -Ilib/librte_eal/include -I../lib/librte_eal/include -Ilib/librte_eal/linux/include -I../lib/librte_eal/linux/include -Ilib/librte_eal/x86/include -I../lib/librte_eal/x86/include -Ilib/librte_eal/common -I../lib/librte_eal/common -Ilib/librte_eal -I../lib/librte_eal -Ilib/librte_kvargs -I../lib/librte_kvargs -Ilib/librte_telemetry/../librte_metrics -I../lib/librte_telemetry/../librte_metrics -Ilib/librte_telemetry -I../lib/librte_telemetry -Ilib/librte_mbuf -I../lib/librte_mbuf -Ilib/librte_mempool -I../lib/librte_mempool -Ilib/librte_ring -I../lib/librte_ring -Idrivers/bus/pci -I../drivers/bus/pci -I../drivers/bus/pci/linux -Ilib/librte_pci -I../lib/librte_pci -Idrivers/common/cpt -I../drivers/common/cpt -Idrivers/common/cpt/../../crypto/octeontx -I../drivers/common/cpt/../../crypto/octeontx -Idrivers/common/octeontx2 -I../drivers/common/octeontx2 -Idrivers/common/octeontx2/../../common/octeontx2 -I../drivers/common/octeontx2/../../common/octeontx2 -Idrivers/common/octeontx2/../../mempool/octeontx2 -I../drivers/common/octeontx2/../../mempool/octeontx2 -Idrivers/common/octeontx2/../../bus/pci -I../drivers/common/octeontx2/../../bus/pci -Ilib/librte_ethdev -I../lib/librte_ethdev -Ilib/librte_net -I../lib/librte_net -Ilib/librte_meter -I../lib/librte_meter -Ilib/librte_security -I../lib/librte_security -pipe -D_FILE_OFFSET_BITS=64 -Wall -w3 -diag-disable:remark -Werror -O3 -include rte_config.h -Wextra -Wcast-qual -Wdeprecated -Wformat-security -Wmissing-declarations -Wmissing-prototypes -Wold-style-definition -Wpointer-arith -Wsign-compare -Wstrict-prototypes -Wundef -Wwrite-strings -Wno-missing-field-initializers -diag-disable=188 -diag-disable=2203 -diag-disable=2279 -diag-disable=2557 -diag-disable=3179 -diag-disable=3656 -D_GNU_SOURCE -fPIC -march=native -mno-avx512f -DALLOW_EXPERIMENTAL_API -DALLOW_INTERNAL_API -MD -MQ 'drivers/a715181@@tmp_rte_pmd_octeontx2_crypto at sta/crypto_octeontx2_otx2_cryptodev_capabilities.c.o' -MF 'drivers/a715181@@tmp_rte_pmd_octeontx2_crypto at sta/crypto_octeontx2_otx2_cryptodev_capabilities.c.o.d' -o 'drivers/a715181@@tmp_rte_pmd_octeontx2_crypto at sta/crypto_octeontx2_otx2_cryptodev_capabilities.c.o' -c ../drivers/crypto/octeontx2/otx2_cryptodev_capabilities.c
In file included from ../drivers/crypto/octeontx2/otx2_cryptodev_capabilities.c(8):
../drivers/crypto/octeontx2/otx2_cryptodev.h(41): error #1366: a reduction in alignment without the "packed" attribute is ignored
  	struct cpt_request_info cpt_req __rte_aligned(8);
  	                        ^

compilation aborted for ../drivers/crypto/octeontx2/otx2_cryptodev_capabilities.c (code 2)
[1854/2578] Generating rte_pmd_null_crypto.sym_chk with a meson_exe.py custom command.
[1855/2578] Compiling C object 'drivers/a715181@@tmp_rte_pmd_dpaa2_sec at sta/crypto_dpaa2_sec_dpaa2_sec_dpseci.c.o'.
[1856/2578] Compiling C object 'drivers/a715181@@tmp_rte_pmd_dpaa_sec at sta/crypto_dpaa_sec_dpaa_sec.c.o'.
[1857/2578] Compiling C object 'drivers/a715181@@tmp_rte_pmd_octeontx2 at sta/net_octeontx2_otx2_tx.c.o'.
[1858/2578] Compiling C object 'drivers/a715181@@tmp_rte_pmd_octeontx_crypto at sta/crypto_octeontx_otx_cryptodev_ops.c.o'.
ninja: build stopped: subcommand failed




*Build Failed #2:
OS: UB2004-64
Target: x86_64-native-linuxapp-icc
FAILED: drivers/a715181@@tmp_rte_pmd_octeontx2_crypto at sta/crypto_octeontx2_otx2_cryptodev_hw_access.c.o 
icc -Idrivers/a715181@@tmp_rte_pmd_octeontx2_crypto at sta -Idrivers -I../drivers -Idrivers/crypto/octeontx2 -I../drivers/crypto/octeontx2 -Idrivers/crypto/octeontx2/../../common/cpt -I../drivers/crypto/octeontx2/../../common/cpt -Idrivers/crypto/octeontx2/../../common/octeontx2 -I../drivers/crypto/octeontx2/../../common/octeontx2 -Idrivers/crypto/octeontx2/../../crypto/octeontx2 -I../drivers/crypto/octeontx2/../../crypto/octeontx2 -Idrivers/crypto/octeontx2/../../mempool/octeontx2 -I../drivers/crypto/octeontx2/../../mempool/octeontx2 -Idrivers/crypto/octeontx2/../../net/octeontx2 -I../drivers/crypto/octeontx2/../../net/octeontx2 -Ilib/librte_cryptodev -I../lib/librte_cryptodev -I. -I../ -Iconfig -I../config -Ilib/librte_eal/include -I../lib/librte_eal/include -Ilib/librte_eal/linux/include -I../lib/librte_eal/linux/include -Ilib/librte_eal/x86/include -I../lib/librte_eal/x86/include -Ilib/librte_eal/common -I../lib/librte_eal/common -Ilib/librte_eal -I../lib/librte_eal -Ilib/librte_kvargs -I../lib/librte_kvargs -Ilib/librte_telemetry/../librte_metrics -I../lib/librte_telemetry/../librte_metrics -Ilib/librte_telemetry -I../lib/librte_telemetry -Ilib/librte_mbuf -I../lib/librte_mbuf -Ilib/librte_mempool -I../lib/librte_mempool -Ilib/librte_ring -I../lib/librte_ring -Idrivers/bus/pci -I../drivers/bus/pci -I../drivers/bus/pci/linux -Ilib/librte_pci -I../lib/librte_pci -Idrivers/common/cpt -I../drivers/common/cpt -Idrivers/common/cpt/../../crypto/octeontx -I../drivers/common/cpt/../../crypto/octeontx -Idrivers/common/octeontx2 -I../drivers/common/octeontx2 -Idrivers/common/octeontx2/../../common/octeontx2 -I../drivers/common/octeontx2/../../common/octeontx2 -Idrivers/common/octeontx2/../../mempool/octeontx2 -I../drivers/common/octeontx2/../../mempool/octeontx2 -Idrivers/common/octeontx2/../../bus/pci -I../drivers/common/octeontx2/../../bus/pci -Ilib/librte_ethdev -I../lib/librte_ethdev -Ilib/librte_net -I../lib/librte_net -Ilib/librte_meter -I../lib/librte_meter -Ilib/librte_security -I../lib/librte_security -pipe -D_FILE_OFFSET_BITS=64 -Wall -w3 -diag-disable:remark -Werror -O3 -include rte_config.h -Wextra -Wcast-qual -Wdeprecated -Wformat-security -Wmissing-declarations -Wmissing-prototypes -Wold-style-definition -Wpointer-arith -Wsign-compare -Wstrict-prototypes -Wundef -Wwrite-strings -Wno-missing-field-initializers -diag-disable=188 -diag-disable=2203 -diag-disable=2279 -diag-disable=2557 -diag-disable=3179 -diag-disable=3656 -D_GNU_SOURCE -fPIC -march=native -DALLOW_EXPERIMENTAL_API -DALLOW_INTERNAL_API -MD -MQ 'drivers/a715181@@tmp_rte_pmd_octeontx2_crypto at sta/crypto_octeontx2_otx2_cryptodev_hw_access.c.o' -MF 'drivers/a715181@@tmp_rte_pmd_octeontx2_crypto at sta/crypto_octeontx2_otx2_cryptodev_hw_access.c.o.d' -o 'drivers/a715181@@tmp_rte_pmd_octeontx2_crypto at sta/crypto_octeontx2_otx2_cryptodev_hw_access.c.o' -c ../drivers/crypto/octeontx2/otx2_cryptodev_hw_access.c
In file included from ../drivers/crypto/octeontx2/otx2_cryptodev_hw_access.c(7):
../drivers/crypto/octeontx2/otx2_cryptodev.h(41): error #1366: a reduction in alignment without the "packed" attribute is ignored
  	struct cpt_request_info cpt_req __rte_aligned(8);
  	                        ^

compilation aborted for ../drivers/crypto/octeontx2/otx2_cryptodev_hw_access.c (code 2)
[1840/2569] Linking target drivers/librte_pmd_null_crypto.so.20.0.3.
[1841/2569] Linking target drivers/librte_pmd_caam_jr.so.20.0.3.
[1842/2569] Compiling C object 'drivers/a715181@@tmp_rte_pmd_octeontx2_crypto at sta/crypto_octeontx2_otx2_cryptodev_mbox.c.o'.
FAILED: drivers/a715181@@tmp_rte_pmd_octeontx2_crypto at sta/crypto_octeontx2_otx2_cryptodev_mbox.c.o 
icc -Idrivers/a715181@@tmp_rte_pmd_octeontx2_crypto at sta -Idrivers -I../drivers -Idrivers/crypto/octeontx2 -I../drivers/crypto/octeontx2 -Idrivers/crypto/octeontx2/../../common/cpt -I../drivers/crypto/octeontx2/../../common/cpt -Idrivers/crypto/octeontx2/../../common/octeontx2 -I../drivers/crypto/octeontx2/../../common/octeontx2 -Idrivers/crypto/octeontx2/../../crypto/octeontx2 -I../drivers/crypto/octeontx2/../../crypto/octeontx2 -Idrivers/crypto/octeontx2/../../mempool/octeontx2 -I../drivers/crypto/octeontx2/../../mempool/octeontx2 -Idrivers/crypto/octeontx2/../../net/octeontx2 -I../drivers/crypto/octeontx2/../../net/octeontx2 -Ilib/librte_cryptodev -I../lib/librte_cryptodev -I. -I../ -Iconfig -I../config -Ilib/librte_eal/include -I../lib/librte_eal/include -Ilib/librte_eal/linux/include -I../lib/librte_eal/linux/include -Ilib/librte_eal/x86/include -I../lib/librte_eal/x86/include -Ilib/librte_eal/common -I../lib/librte_eal/common -Ilib/librte_eal -I../lib/librte_eal -Ilib/librte_kvargs -I../lib/librte_kvargs -Ilib/librte_telemetry/../librte_metrics -I../lib/librte_telemetry/../librte_metrics -Ilib/librte_telemetry -I../lib/librte_telemetry -Ilib/librte_mbuf -I../lib/librte_mbuf -Ilib/librte_mempool -I../lib/librte_mempool -Ilib/librte_ring -I../lib/librte_ring -Idrivers/bus/pci -I../drivers/bus/pci -I../drivers/bus/pci/linux -Ilib/librte_pci -I../lib/librte_pci -Idrivers/common/cpt -I../drivers/common/cpt -Idrivers/common/cpt/../../crypto/octeontx -I../drivers/common/cpt/../../crypto/octeontx -Idrivers/common/octeontx2 -I../drivers/common/octeontx2 -Idrivers/common/octeontx2/../../common/octeontx2 -I../drivers/common/octeontx2/../../common/octeontx2 -Idrivers/common/octeontx2/../../mempool/octeontx2 -I../drivers/common/octeontx2/../../mempool/octeontx2 -Idrivers/common/octeontx2/../../bus/pci -I../drivers/common/octeontx2/../../bus/pci -Ilib/librte_ethdev -I../lib/librte_ethdev -Ilib/librte_net -I../lib/librte_net -Ilib/librte_meter -I../lib/librte_meter -Ilib/librte_security -I../lib/librte_security -pipe -D_FILE_OFFSET_BITS=64 -Wall -w3 -diag-disable:remark -Werror -O3 -include rte_config.h -Wextra -Wcast-qual -Wdeprecated -Wformat-security -Wmissing-declarations -Wmissing-prototypes -Wold-style-definition -Wpointer-arith -Wsign-compare -Wstrict-prototypes -Wundef -Wwrite-strings -Wno-missing-field-initializers -diag-disable=188 -diag-disable=2203 -diag-disable=2279 -diag-disable=2557 -diag-disable=3179 -diag-disable=3656 -D_GNU_SOURCE -fPIC -march=native -DALLOW_EXPERIMENTAL_API -DALLOW_INTERNAL_API -MD -MQ 'drivers/a715181@@tmp_rte_pmd_octeontx2_crypto at sta/crypto_octeontx2_otx2_cryptodev_mbox.c.o' -MF 'drivers/a715181@@tmp_rte_pmd_octeontx2_crypto at sta/crypto_octeontx2_otx2_cryptodev_mbox.c.o.d' -o 'drivers/a715181@@tmp_rte_pmd_octeontx2_crypto at sta/crypto_octeontx2_otx2_cryptodev_mbox.c.o' -c ../drivers/crypto/octeontx2/otx2_cryptodev_mbox.c
In file included from ../drivers/crypto/octeontx2/otx2_cryptodev_mbox.c(7):
../drivers/crypto/octeontx2/otx2_cryptodev.h(41): error #1366: a reduction in alignment without the "packed" attribute is ignored
  	struct cpt_request_info cpt_req __rte_aligned(8);
  	                        ^

compilation aborted for ../drivers/crypto/octeontx2/otx2_cryptodev_mbox.c (code 2)
[1843/2569] Compiling C object 'drivers/a715181@@tmp_rte_pmd_octeontx2_crypto at sta/crypto_octeontx2_otx2_cryptodev_capabilities.c.o'.
FAILED: drivers/a715181@@tmp_rte_pmd_octeontx2_crypto at sta/crypto_octeontx2_otx2_cryptodev_capabilities.c.o 
icc -Idrivers/a715181@@tmp_rte_pmd_octeontx2_crypto at sta -Idrivers -I../drivers -Idrivers/crypto/octeontx2 -I../drivers/crypto/octeontx2 -Idrivers/crypto/octeontx2/../../common/cpt -I../drivers/crypto/octeontx2/../../common/cpt -Idrivers/crypto/octeontx2/../../common/octeontx2 -I../drivers/crypto/octeontx2/../../common/octeontx2 -Idrivers/crypto/octeontx2/../../crypto/octeontx2 -I../drivers/crypto/octeontx2/../../crypto/octeontx2 -Idrivers/crypto/octeontx2/../../mempool/octeontx2 -I../drivers/crypto/octeontx2/../../mempool/octeontx2 -Idrivers/crypto/octeontx2/../../net/octeontx2 -I../drivers/crypto/octeontx2/../../net/octeontx2 -Ilib/librte_cryptodev -I../lib/librte_cryptodev -I. -I../ -Iconfig -I../config -Ilib/librte_eal/include -I../lib/librte_eal/include -Ilib/librte_eal/linux/include -I../lib/librte_eal/linux/include -Ilib/librte_eal/x86/include -I../lib/librte_eal/x86/include -Ilib/librte_eal/common -I../lib/librte_eal/common -Ilib/librte_eal -I../lib/librte_eal -Ilib/librte_kvargs -I../lib/librte_kvargs -Ilib/librte_telemetry/../librte_metrics -I../lib/librte_telemetry/../librte_metrics -Ilib/librte_telemetry -I../lib/librte_telemetry -Ilib/librte_mbuf -I../lib/librte_mbuf -Ilib/librte_mempool -I../lib/librte_mempool -Ilib/librte_ring -I../lib/librte_ring -Idrivers/bus/pci -I../drivers/bus/pci -I../drivers/bus/pci/linux -Ilib/librte_pci -I../lib/librte_pci -Idrivers/common/cpt -I../drivers/common/cpt -Idrivers/common/cpt/../../crypto/octeontx -I../drivers/common/cpt/../../crypto/octeontx -Idrivers/common/octeontx2 -I../drivers/common/octeontx2 -Idrivers/common/octeontx2/../../common/octeontx2 -I../drivers/common/octeontx2/../../common/octeontx2 -Idrivers/common/octeontx2/../../mempool/octeontx2 -I../drivers/common/octeontx2/../../mempool/octeontx2 -Idrivers/common/octeontx2/../../bus/pci -I../drivers/common/octeontx2/../../bus/pci -Ilib/librte_ethdev -I../lib/librte_ethdev -Ilib/librte_net -I../lib/librte_net -Ilib/librte_meter -I../lib/librte_meter -Ilib/librte_security -I../lib/librte_security -pipe -D_FILE_OFFSET_BITS=64 -Wall -w3 -diag-disable:remark -Werror -O3 -include rte_config.h -Wextra -Wcast-qual -Wdeprecated -Wformat-security -Wmissing-declarations -Wmissing-prototypes -Wold-style-definition -Wpointer-arith -Wsign-compare -Wstrict-prototypes -Wundef -Wwrite-strings -Wno-missing-field-initializers -diag-disable=188 -diag-disable=2203 -diag-disable=2279 -diag-disable=2557 -diag-disable=3179 -diag-disable=3656 -D_GNU_SOURCE -fPIC -march=native -DALLOW_EXPERIMENTAL_API -DALLOW_INTERNAL_API -MD -MQ 'drivers/a715181@@tmp_rte_pmd_octeontx2_crypto at sta/crypto_octeontx2_otx2_cryptodev_capabilities.c.o' -MF 'drivers/a715181@@tmp_rte_pmd_octeontx2_crypto at sta/crypto_octeontx2_otx2_cryptodev_capabilities.c.o.d' -o 'drivers/a715181@@tmp_rte_pmd_octeontx2_crypto at sta/crypto_octeontx2_otx2_cryptodev_capabilities.c.o' -c ../drivers/crypto/octeontx2/otx2_cryptodev_capabilities.c
In file included from ../drivers/crypto/octeontx2/otx2_cryptodev_capabilities.c(8):
../drivers/crypto/octeontx2/otx2_cryptodev.h(41): error #1366: a reduction in alignment without the "packed" attribute is ignored
  	struct cpt_request_info cpt_req __rte_aligned(8);
  	                        ^

compilation aborted for ../drivers/crypto/octeontx2/otx2_cryptodev_capabilities.c (code 2)
[1844/2569] Compiling C object 'drivers/a715181@@tmp_rte_pmd_ccp at sta/crypto_ccp_ccp_crypto.c.o'.
[1845/2569] Compiling C object 'drivers/a715181@@tmp_rte_pmd_dpaa2_sec at sta/crypto_dpaa2_sec_dpaa2_sec_dpseci.c.o'.
[1846/2569] Compiling C object 'drivers/a715181@@tmp_rte_pmd_dpaa_sec at sta/crypto_dpaa_sec_dpaa_sec.c.o'.
[1847/2569] Compiling C object 'drivers/a715181@@tmp_rte_pmd_octeontx2 at sta/net_octeontx2_otx2_tx.c.o'.
[1848/2569] Compiling C object 'drivers/a715181@@tmp_rte_pmd_octeontx_crypto at sta/crypto_octeontx_otx_cryptodev_ops.c.o'.
ninja: build stopped: subcommand failed


DPDK STV team


More information about the test-report mailing list