[dpdk-test-report] |FAILURE| pw(78911) [8/8] net/iavf: support check DD bit of a RX descriptor

sys_stv at intel.com sys_stv at intel.com
Sun Sep 27 11:45:07 CEST 2020


Test-Label: Intel-compilation
Test-Status: FAILURE
http://dpdk.org/patch/78911

_Compilation issues_

Submitter: Robin Zhang <robinx.zhang at intel.com>
Date: 2020-09-27 07:26:26
Reply_mail: 20200927072626.28374-9-robinx.zhang at intel.com

DPDK git baseline: Repo:dpdk-next-net-intel, CommitID: 67b790caa655867facde55b454b2354e8aab2e06


Meson Build Summary: 21 Builds Done, 16 Successful, 5 Failures, 0 Blocked

+----------------+------------+--------------+------------+------------+-----------+----------+
| os             | gcc-static | clang-static | icc-static | gcc-shared | gcc-debug | document |
+----------------+------------+--------------+------------+------------+-----------+----------+
| CENTOS82-64    | pass       | FAIL         | pass       | pass       | pass      |          |
| RHEL82-64      | pass       |              |            |            |           |          |
| UB1804-64      | pass       |              |            |            |           |          |
| FC32-64        | pass       | FAIL         |            |            |           |          |
| UB2004-64      | pass       | FAIL         | pass       |            |           | pass     |
| WIN10-64       |            | pass         |            |            |           |          |
| UB2004-32      | pass       |              |            |            |           |          |
| FreeBSD1201-64 | pass       | FAIL         |            | pass       | pass      |          |
| SUSE15-64      | pass       | FAIL         |            |            |           |          |
+----------------+------------+--------------+------------+------------+-----------+----------+
Test environment and configuration as below:


OS: CENTOS82-64
	Kernel Version: 4.18.0-193.el8.x86_64
	CPU info: Intel(R) Xeon(R) Platinum 8280M CPU @ 2.70GHz
	GCC Version: gcc (GCC) 8.3.1 20191121 (Red Hat 8.3.1-5)
	Clang Version: 9.0.1 (Red Hat 9.0.1-2.module_el8.2.0+309+0c7b6b03)
	x86_64-native-linuxapp-gcc
	x86_64-native-linuxapp-clang
	x86_64-native-linuxapp-icc
	x86_64-native-linuxapp-gcc+shared
	x86_64-native-linuxapp-gcc+debug

OS: RHEL82-64
	Kernel Version: 4.18.0-193.el8.x86_64
	CPU info: Intel(R) Xeon(R) Platinum 8280M CPU @ 2.70GHz
	GCC Version: gcc (GCC) 8.3.1 20191121 (Red Hat 8.3.1-5)
	Clang Version: 8.0.1 (Red Hat 8.0.1-1.module_el8.1.0+215+a01033fb)
	x86_64-native-linuxapp-gcc

OS: UB1804-64
	Kernel Version: 5.3.0-59-generic
	CPU info: Intel(R) Xeon(R) Platinum 8180 CPU @ 2.50GHz
	GCC Version: gcc (Ubuntu 8.4.0-1ubuntu1~18.04) 8.4.0
	Clang Version: 6.0.0-1ubuntu2 (tags/RELEASE_600/final)
	x86_64-native-linuxapp-gcc

OS: FC32-64
	Kernel Version: 5.6.0-0.rc7.git0.2.fc32.x86_64
	CPU info: Intel(R) Xeon(R) Platinum 8280M CPU @ 2.70GHz
	GCC Version: gcc (GCC) 10.0.1 20200311 (Red Hat 10.0.1-0.9)
	Clang Version: 10.0.0 (Fedora 10.0.0-0.3.rc4.fc32)
	x86_64-native-linuxapp-gcc
	x86_64-native-linuxapp-clang

OS: UB2004-64
	Kernel Version: 5.4.0-26-generic
	CPU info: Intel(R) Xeon(R) Platinum 8180 CPU @ 2.50GHz
	GCC Version: gcc (Ubuntu 10-20200416-0ubuntu1) 10.0.1 20200416 (experimental) [master revision 3c3f12e2a76:dcee354ce56:44b326839d864fc10c459916abcc97f35a9ac3de]
	Clang Version: 10.0.0-4ubuntu1
	x86_64-native-linuxapp-clang
	x86_64-native-linuxapp-gcc
	x86_64-native-linuxapp-icc
	x86_64-native-linuxapp-doc

OS: WIN10-64
	Kernel Version: N/A
	CPU info: N/A
	GCC Version: N/A
	Clang Version: Clang 8.0.0
	x86_64-windows-clang

OS: UB2004-32
	Kernel Version: 5.4.0-26-generic
	CPU info: Intel(R) Xeon(R) Platinum 8180 CPU @ 2.50GHz
	GCC Version: gcc (Ubuntu 9.3.0-10ubuntu2) 9.3.0
	Clang Version: 10.0.0-4ubuntu1
	i686-native-linuxapp-gcc

OS: FreeBSD1201-64
	Kernel Version: 12.1-RELEASE
	CPU info: Intel(R) Xeon(R) CPU E5-2699 v3 @ 2.30GHz (2294.74-MHz K8-class CPU)
	GCC Version: gcc (FreeBSD Ports Collection) 9.2.0
	Clang Version: 8.0.1 (tags/RELEASE_801/final 366581) (based on LLVM 8.0.1)
	x86_64-native-bsdapp-gcc
	x86_64-native-bsdapp-clang
	x86_64-native-bsdapp-gcc+shared
	x86_64-native-bsdapp-gcc+debug

OS: SUSE15-64
	Kernel Version: 4.12.14-lp150.11-default
	CPU info: Intel(R) Xeon(R) CPU E5-2699 v4 @ 2.20GHz
	GCC Version: gcc (SUSE Linux) 7.3.1 20180323 [gcc-7-branch revision 258812]
	Clang Version: 5.0.1 (tags/RELEASE_501/final 312548)
	x86_64-native-linuxapp-clang
	x86_64-native-linuxapp-gcc



*Build Failed #1:
OS: CENTOS82-64
Target: x86_64-native-linuxapp-clang
FAILED: drivers/libtmp_rte_pmd_iavf.a.p/net_iavf_iavf_rxtx.c.o 
clang -Idrivers/libtmp_rte_pmd_iavf.a.p -Idrivers -I../drivers -Idrivers/net/iavf -I../drivers/net/iavf -Idrivers/common/iavf -I../drivers/common/iavf -Ilib/librte_ethdev -I../lib/librte_ethdev -I. -I.. -Iconfig -I../config -Ilib/librte_eal/include -I../lib/librte_eal/include -Ilib/librte_eal/linux/include -I../lib/librte_eal/linux/include -Ilib/librte_eal/x86/include -I../lib/librte_eal/x86/include -Ilib/librte_eal/common -I../lib/librte_eal/common -Ilib/librte_eal -I../lib/librte_eal -Ilib/librte_kvargs -I../lib/librte_kvargs -Ilib/librte_metrics -I../lib/librte_metrics -Ilib/librte_telemetry -I../lib/librte_telemetry -Ilib/librte_net -I../lib/librte_net -Ilib/librte_mbuf -I../lib/librte_mbuf -Ilib/librte_mempool -I../lib/librte_mempool -Ilib/librte_ring -I../lib/librte_ring -Ilib/librte_meter -I../lib/librte_meter -Idrivers/bus/pci -I../drivers/bus/pci -I../drivers/bus/pci/linux -Ilib/librte_pci -I../lib/librte_pci -Idrivers/bus/vdev -I../drivers/bus/vdev -Xclang -fcolor-diagnostics -pipe -D_FILE_OFFSET_BITS=64 -Wall -Winvalid-pch -Werror -O3 -include rte_config.h -Wextra -Wcast-qual -Wdeprecated -Wformat-nonliteral -Wformat-security -Wmissing-declarations -Wmissing-prototypes -Wnested-externs -Wold-style-definition -Wpointer-arith -Wsign-compare -Wstrict-prototypes -Wundef -Wwrite-strings -Wno-address-of-packed-member -Wno-missing-field-initializers -D_GNU_SOURCE -fPIC -march=native -mno-avx512f -DALLOW_EXPERIMENTAL_API -DALLOW_INTERNAL_API -Wno-strict-aliasing -DCC_AVX2_SUPPORT -MD -MQ drivers/libtmp_rte_pmd_iavf.a.p/net_iavf_iavf_rxtx.c.o -MF drivers/libtmp_rte_pmd_iavf.a.p/net_iavf_iavf_rxtx.c.o.d -o drivers/libtmp_rte_pmd_iavf.a.p/net_iavf_iavf_rxtx.c.o -c ../drivers/net/iavf/iavf_rxtx.c
../drivers/net/iavf/iavf_rxtx.c:916:1: error: unused function 'iavf_rxd_error_to_pkt_flags' [-Werror,-Wunused-function]
iavf_rxd_error_to_pkt_flags(uint16_t stat_err0)
^
1 error generated.
[1260/2600] Generating rte_pmd_iavf_mingw with a custom command
[1261/2600] Compiling C object drivers/libtmp_rte_pmd_iavf.a.p/net_iavf_iavf_vchnl.c.o
[1262/2600] Compiling C object drivers/libtmp_rte_pmd_iavf.a.p/net_iavf_iavf_generic_flow.c.o
[1263/2600] Compiling C object drivers/libtmp_rte_pmd_iavf.a.p/net_iavf_iavf_fdir.c.o
[1264/2600] Compiling C object drivers/libtmp_rte_pmd_iavf.a.p/net_iavf_iavf_hash.c.o
[1265/2600] Compiling C object drivers/libtmp_rte_pmd_hns3.a.p/net_hns3_hns3_rxtx.c.o
[1266/2600] Compiling C object drivers/libtmp_rte_pmd_iavf.a.p/net_iavf_iavf_ethdev.c.o
[1267/2600] Compiling C object drivers/libtmp_rte_pmd_iavf.a.p/net_iavf_iavf_rxtx_vec_sse.c.o
[1268/2600] Compiling C object drivers/libtmp_rte_pmd_iavf.a.p/net_iavf_iavf_rxtx_vec_avx2.c.o
ninja: build stopped: subcommand failed




*Build Failed #2:
OS: FC32-64
Target: x86_64-native-linuxapp-clang
FAILED: drivers/libtmp_rte_pmd_iavf.a.p/net_iavf_iavf_rxtx.c.o 
clang -Idrivers/libtmp_rte_pmd_iavf.a.p -Idrivers -I../drivers -Idrivers/net/iavf -I../drivers/net/iavf -Idrivers/common/iavf -I../drivers/common/iavf -Ilib/librte_ethdev -I../lib/librte_ethdev -I. -I.. -Iconfig -I../config -Ilib/librte_eal/include -I../lib/librte_eal/include -Ilib/librte_eal/linux/include -I../lib/librte_eal/linux/include -Ilib/librte_eal/x86/include -I../lib/librte_eal/x86/include -Ilib/librte_eal/common -I../lib/librte_eal/common -Ilib/librte_eal -I../lib/librte_eal -Ilib/librte_kvargs -I../lib/librte_kvargs -Ilib/librte_metrics -I../lib/librte_metrics -Ilib/librte_telemetry -I../lib/librte_telemetry -Ilib/librte_net -I../lib/librte_net -Ilib/librte_mbuf -I../lib/librte_mbuf -Ilib/librte_mempool -I../lib/librte_mempool -Ilib/librte_ring -I../lib/librte_ring -Ilib/librte_meter -I../lib/librte_meter -Idrivers/bus/pci -I../drivers/bus/pci -I../drivers/bus/pci/linux -Ilib/librte_pci -I../lib/librte_pci -Idrivers/bus/vdev -I../drivers/bus/vdev -Xclang -fcolor-diagnostics -pipe -D_FILE_OFFSET_BITS=64 -Wall -Winvalid-pch -Werror -O3 -include rte_config.h -Wextra -Wcast-qual -Wdeprecated -Wformat-nonliteral -Wformat-security -Wmissing-declarations -Wmissing-prototypes -Wnested-externs -Wold-style-definition -Wpointer-arith -Wsign-compare -Wstrict-prototypes -Wundef -Wwrite-strings -Wno-address-of-packed-member -Wno-missing-field-initializers -D_GNU_SOURCE -fPIC -march=native -DALLOW_EXPERIMENTAL_API -DALLOW_INTERNAL_API -Wno-strict-aliasing -DCC_AVX2_SUPPORT -MD -MQ drivers/libtmp_rte_pmd_iavf.a.p/net_iavf_iavf_rxtx.c.o -MF drivers/libtmp_rte_pmd_iavf.a.p/net_iavf_iavf_rxtx.c.o.d -o drivers/libtmp_rte_pmd_iavf.a.p/net_iavf_iavf_rxtx.c.o -c ../drivers/net/iavf/iavf_rxtx.c
../drivers/net/iavf/iavf_rxtx.c:916:1: error: unused function 'iavf_rxd_error_to_pkt_flags' [-Werror,-Wunused-function]
iavf_rxd_error_to_pkt_flags(uint16_t stat_err0)
^
1 error generated.
[1256/2601] Compiling C object drivers/libtmp_rte_pmd_hns3.a.p/net_hns3_hns3_stats.c.o
[1257/2601] Compiling C object drivers/libtmp_rte_pmd_iavf.a.p/net_iavf_iavf_vchnl.c.o
[1258/2601] Compiling C object drivers/libtmp_rte_pmd_iavf.a.p/net_iavf_iavf_generic_flow.c.o
[1259/2601] Compiling C object drivers/libtmp_rte_pmd_iavf.a.p/net_iavf_iavf_fdir.c.o
[1260/2601] Compiling C object drivers/libtmp_rte_pmd_hns3.a.p/net_hns3_hns3_rxtx.c.o
[1261/2601] Compiling C object drivers/libtmp_rte_pmd_hns3.a.p/net_hns3_hns3_ethdev.c.o
[1262/2601] Compiling C object drivers/libtmp_rte_pmd_iavf.a.p/net_iavf_iavf_hash.c.o
[1263/2601] Compiling C object drivers/libtmp_rte_pmd_iavf.a.p/net_iavf_iavf_ethdev.c.o
[1264/2601] Compiling C object drivers/libtmp_rte_pmd_iavf.a.p/net_iavf_iavf_rxtx_vec_sse.c.o
ninja: build stopped: subcommand failed




*Build Failed #3:
OS: FreeBSD1201-64
Target: x86_64-native-bsdapp-clang
FAILED: drivers/libtmp_rte_pmd_iavf.a.p/net_iavf_iavf_rxtx.c.o 
clang -Idrivers/libtmp_rte_pmd_iavf.a.p -Idrivers -I../drivers -Idrivers/net/iavf -I../drivers/net/iavf -Idrivers/common/iavf -I../drivers/common/iavf -Ilib/librte_ethdev -I../lib/librte_ethdev -I. -I.. -Iconfig -I../config -Ilib/librte_eal/include -I../lib/librte_eal/include -Ilib/librte_eal/freebsd/include -I../lib/librte_eal/freebsd/include -Ilib/librte_eal/x86/include -I../lib/librte_eal/x86/include -Ilib/librte_eal/common -I../lib/librte_eal/common -Ilib/librte_eal -I../lib/librte_eal -Ilib/librte_kvargs -I../lib/librte_kvargs -Ilib/librte_metrics -I../lib/librte_metrics -Ilib/librte_telemetry -I../lib/librte_telemetry -Ilib/librte_net -I../lib/librte_net -Ilib/librte_mbuf -I../lib/librte_mbuf -Ilib/librte_mempool -I../lib/librte_mempool -Ilib/librte_ring -I../lib/librte_ring -Ilib/librte_meter -I../lib/librte_meter -Idrivers/bus/pci -I../drivers/bus/pci -I../drivers/bus/pci/bsd -Ilib/librte_pci -I../lib/librte_pci -Idrivers/bus/vdev -I../drivers/bus/vdev -Xclang -fcolor-diagnostics -pipe -D_FILE_OFFSET_BITS=64 -Wall -Winvalid-pch -Werror -O3 -include rte_config.h -Wextra -Wcast-qual -Wdeprecated -Wformat-nonliteral -Wformat-security -Wmissing-declarations -Wmissing-prototypes -Wnested-externs -Wold-style-definition -Wpointer-arith -Wsign-compare -Wstrict-prototypes -Wundef -Wwrite-strings -Wno-address-of-packed-member -Wno-missing-field-initializers -D_GNU_SOURCE -D__BSD_VISIBLE -fPIC -march=native -mno-avx512f -DALLOW_EXPERIMENTAL_API -DALLOW_INTERNAL_API -Wno-strict-aliasing -DCC_AVX2_SUPPORT -MD -MQ drivers/libtmp_rte_pmd_iavf.a.p/net_iavf_iavf_rxtx.c.o -MF drivers/libtmp_rte_pmd_iavf.a.p/net_iavf_iavf_rxtx.c.o.d -o drivers/libtmp_rte_pmd_iavf.a.p/net_iavf_iavf_rxtx.c.o -c ../drivers/net/iavf/iavf_rxtx.c
../drivers/net/iavf/iavf_rxtx.c:916:1: error: unused function 'iavf_rxd_error_to_pkt_flags' [-Werror,-Wunused-function]
iavf_rxd_error_to_pkt_flags(uint16_t stat_err0)
^
1 error generated.
[1005/1937] Generating rte_pmd_hinic.pmd.c with a custom command
[1006/1937] Generating rte_pmd_i40e.sym_chk with a meson_exe.py custom command
[1007/1937] Compiling C object drivers/libtmp_rte_pmd_iavf.a.p/net_iavf_iavf_vchnl.c.o
[1008/1937] Compiling C object drivers/libtmp_rte_pmd_iavf.a.p/net_iavf_iavf_generic_flow.c.o
[1009/1937] Compiling C object drivers/libtmp_rte_pmd_iavf.a.p/net_iavf_iavf_ethdev.c.o
ninja: build stopped: subcommand failed




*Build Failed #4:
OS: SUSE15-64
Target: x86_64-native-linuxapp-clang
FAILED: drivers/libtmp_rte_pmd_iavf.a.p/net_iavf_iavf_rxtx.c.o 
clang -Idrivers/libtmp_rte_pmd_iavf.a.p -Idrivers -I../drivers -Idrivers/net/iavf -I../drivers/net/iavf -Idrivers/common/iavf -I../drivers/common/iavf -Ilib/librte_ethdev -I../lib/librte_ethdev -I. -I.. -Iconfig -I../config -Ilib/librte_eal/include -I../lib/librte_eal/include -Ilib/librte_eal/linux/include -I../lib/librte_eal/linux/include -Ilib/librte_eal/x86/include -I../lib/librte_eal/x86/include -Ilib/librte_eal/common -I../lib/librte_eal/common -Ilib/librte_eal -I../lib/librte_eal -Ilib/librte_kvargs -I../lib/librte_kvargs -Ilib/librte_metrics -I../lib/librte_metrics -Ilib/librte_telemetry -I../lib/librte_telemetry -Ilib/librte_net -I../lib/librte_net -Ilib/librte_mbuf -I../lib/librte_mbuf -Ilib/librte_mempool -I../lib/librte_mempool -Ilib/librte_ring -I../lib/librte_ring -Ilib/librte_meter -I../lib/librte_meter -Idrivers/bus/pci -I../drivers/bus/pci -I../drivers/bus/pci/linux -Ilib/librte_pci -I../lib/librte_pci -Idrivers/bus/vdev -I../drivers/bus/vdev -Xclang -fcolor-diagnostics -pipe -D_FILE_OFFSET_BITS=64 -Wall -Winvalid-pch -Werror -O3 -include rte_config.h -Wextra -Wcast-qual -Wdeprecated -Wformat-nonliteral -Wformat-security -Wmissing-declarations -Wmissing-prototypes -Wnested-externs -Wold-style-definition -Wpointer-arith -Wsign-compare -Wstrict-prototypes -Wundef -Wwrite-strings -Wno-address-of-packed-member -Wno-missing-field-initializers -D_GNU_SOURCE -fPIC -march=native -DALLOW_EXPERIMENTAL_API -DALLOW_INTERNAL_API -Wno-strict-aliasing -DCC_AVX2_SUPPORT -MD -MQ drivers/libtmp_rte_pmd_iavf.a.p/net_iavf_iavf_rxtx.c.o -MF drivers/libtmp_rte_pmd_iavf.a.p/net_iavf_iavf_rxtx.c.o.d -o drivers/libtmp_rte_pmd_iavf.a.p/net_iavf_iavf_rxtx.c.o -c ../drivers/net/iavf/iavf_rxtx.c
../drivers/net/iavf/iavf_rxtx.c:916:1: error: unused function 'iavf_rxd_error_to_pkt_flags' [-Werror,-Wunused-function]
iavf_rxd_error_to_pkt_flags(uint16_t stat_err0)
^
1 error generated.
[1265/2569] Compiling C object drivers/libtmp_rte_pmd_hns3.a.p/net_hns3_hns3_flow.c.o
[1266/2569] Generating rte_pmd_hinic.sym_chk with a meson_exe.py custom command
[1267/2569] Compiling C object drivers/libtmp_rte_pmd_iavf.a.p/net_iavf_iavf_fdir.c.o
[1268/2569] Compiling C object drivers/libtmp_rte_pmd_hns3.a.p/net_hns3_hns3_mp.c.o
[1269/2569] Compiling C object drivers/libtmp_rte_pmd_iavf.a.p/net_iavf_iavf_vchnl.c.o
[1270/2569] Compiling C object drivers/libtmp_rte_pmd_iavf.a.p/net_iavf_iavf_generic_flow.c.o
[1271/2569] Compiling C object drivers/libtmp_rte_pmd_hns3.a.p/net_hns3_hns3_ethdev.c.o
[1272/2569] Compiling C object drivers/libtmp_rte_pmd_hns3.a.p/net_hns3_hns3_rxtx.c.o
[1273/2569] Compiling C object drivers/libtmp_rte_pmd_iavf.a.p/net_iavf_iavf_ethdev.c.o
ninja: build stopped: subcommand failed




*Build Failed #5:
OS: UB2004-64
Target: x86_64-native-linuxapp-clang
FAILED: drivers/libtmp_rte_pmd_iavf.a.p/net_iavf_iavf_rxtx.c.o 
clang -Idrivers/libtmp_rte_pmd_iavf.a.p -Idrivers -I../drivers -Idrivers/net/iavf -I../drivers/net/iavf -Idrivers/common/iavf -I../drivers/common/iavf -Ilib/librte_ethdev -I../lib/librte_ethdev -I. -I.. -Iconfig -I../config -Ilib/librte_eal/include -I../lib/librte_eal/include -Ilib/librte_eal/linux/include -I../lib/librte_eal/linux/include -Ilib/librte_eal/x86/include -I../lib/librte_eal/x86/include -Ilib/librte_eal/common -I../lib/librte_eal/common -Ilib/librte_eal -I../lib/librte_eal -Ilib/librte_kvargs -I../lib/librte_kvargs -Ilib/librte_metrics -I../lib/librte_metrics -Ilib/librte_telemetry -I../lib/librte_telemetry -Ilib/librte_net -I../lib/librte_net -Ilib/librte_mbuf -I../lib/librte_mbuf -Ilib/librte_mempool -I../lib/librte_mempool -Ilib/librte_ring -I../lib/librte_ring -Ilib/librte_meter -I../lib/librte_meter -Idrivers/bus/pci -I../drivers/bus/pci -I../drivers/bus/pci/linux -Ilib/librte_pci -I../lib/librte_pci -Idrivers/bus/vdev -I../drivers/bus/vdev -Xclang -fcolor-diagnostics -pipe -D_FILE_OFFSET_BITS=64 -Wall -Winvalid-pch -Werror -O3 -include rte_config.h -Wextra -Wcast-qual -Wdeprecated -Wformat-nonliteral -Wformat-security -Wmissing-declarations -Wmissing-prototypes -Wnested-externs -Wold-style-definition -Wpointer-arith -Wsign-compare -Wstrict-prototypes -Wundef -Wwrite-strings -Wno-address-of-packed-member -Wno-missing-field-initializers -D_GNU_SOURCE -fPIC -march=native -DALLOW_EXPERIMENTAL_API -DALLOW_INTERNAL_API -Wno-strict-aliasing -DCC_AVX2_SUPPORT -MD -MQ drivers/libtmp_rte_pmd_iavf.a.p/net_iavf_iavf_rxtx.c.o -MF drivers/libtmp_rte_pmd_iavf.a.p/net_iavf_iavf_rxtx.c.o.d -o drivers/libtmp_rte_pmd_iavf.a.p/net_iavf_iavf_rxtx.c.o -c ../drivers/net/iavf/iavf_rxtx.c
../drivers/net/iavf/iavf_rxtx.c:916:1: error: unused function 'iavf_rxd_error_to_pkt_flags' [-Werror,-Wunused-function]
iavf_rxd_error_to_pkt_flags(uint16_t stat_err0)
^
1 error generated.
[1254/2591] Compiling C object drivers/librte_pmd_i40e.so.21.0.p/meson-generated_.._rte_pmd_i40e.pmd.c.o
[1255/2591] Compiling C object drivers/libtmp_rte_pmd_hns3.a.p/net_hns3_hns3_ethdev.c.o
[1256/2591] Linking target drivers/librte_pmd_hinic.so.21.0
[1257/2591] Compiling C object drivers/libtmp_rte_pmd_hns3.a.p/net_hns3_hns3_stats.c.o
[1258/2591] Generating rte_pmd_i40e.sym_chk with a meson_exe.py custom command
[1259/2591] Compiling C object drivers/libtmp_rte_pmd_iavf.a.p/net_iavf_iavf_vchnl.c.o
[1260/2591] Compiling C object drivers/libtmp_rte_pmd_iavf.a.p/net_iavf_iavf_fdir.c.o
[1261/2591] Compiling C object drivers/libtmp_rte_pmd_iavf.a.p/net_iavf_iavf_ethdev.c.o
[1262/2591] Compiling C object drivers/libtmp_rte_pmd_hns3.a.p/net_hns3_hns3_rxtx.c.o
ninja: build stopped: subcommand failed


DPDK STV team


More information about the test-report mailing list