[dpdk-test-report] |FAILURE| pw78917-78918 [PATCH] [v3, 2/2] net/iavf: enable large VF configuration

dpdklab at iol.unh.edu dpdklab at iol.unh.edu
Sun Sep 27 15:16:24 CEST 2020


Test-Label: Performance-Testing
Test-Status: FAILURE
http://dpdk.org/patch/78917

_build patch failure_

Submitter: Ting Xu <ting.xu at intel.com>
Date: Sunday, September 27 2020 12:42:29 
Applied on: CommitID:6554ec412c45af32c2aa1636d0879063133f7ddc
Apply patch set 78917-78918 failed:

[1/1146] Linking static target drivers/libtmp_rte_pmd_i40e.a.
[2/1146] Compiling C object 'drivers/a715181@@rte_pmd_hinic at sta/meson-generated_.._rte_pmd_hinic.pmd.c.o'.
[3/1146] Compiling C object 'drivers/a715181@@rte_pmd_hinic at sha/meson-generated_.._rte_pmd_hinic.pmd.c.o'.
[4/1146] Linking static target drivers/libtmp_rte_pmd_hns3.a.
[5/1146] Linking target lib/librte_pipeline.so.21.0.
[6/1146] Linking static target drivers/librte_pmd_hinic.a.
[7/1146] Generating rte_pmd_i40e.pmd.c with a custom command.
[8/1146] Compiling C object 'drivers/net/ice/base/39545a2@@ice_base at sta/ice_acl.c.o'.
[9/1146] Compiling C object 'drivers/a715181@@tmp_rte_pmd_iavf at sta/net_iavf_iavf_ethdev.c.o'.
FAILED: drivers/a715181@@tmp_rte_pmd_iavf at sta/net_iavf_iavf_ethdev.c.o 
cc -Idrivers/a715181@@tmp_rte_pmd_iavf at sta -Idrivers -I../drivers -Idrivers/net/iavf -I../drivers/net/iavf -Idrivers/net/iavf/../../common/iavf -I../drivers/net/iavf/../../common/iavf -Ilib/librte_ethdev -I../lib/librte_ethdev -I. -I../ -Iconfig -I../config -Ilib/librte_eal/include -I../lib/librte_eal/include -Ilib/librte_eal/linux/include -I../lib/librte_eal/linux/include -Ilib/librte_eal/x86/include -I../lib/librte_eal/x86/include -Ilib/librte_eal/common -I../lib/librte_eal/common -Ilib/librte_eal -I../lib/librte_eal -Ilib/librte_kvargs -I../lib/librte_kvargs -Ilib/librte_telemetry/../librte_metrics -I../lib/librte_telemetry/../librte_metrics -Ilib/librte_telemetry -I../lib/librte_telemetry -Ilib/librte_net -I../lib/librte_net -Ilib/librte_mbuf -I../lib/librte_mbuf -Ilib/librte_mempool -I../lib/librte_mempool -Ilib/librte_ring -I../lib/librte_ring -Ilib/librte_meter -I../lib/librte_meter -Idrivers/bus/pci -I../drivers/bus/pci -I../drivers/bus/pci/linux -Ilib/librte_pci -I../lib/librte_pci -Idrivers/bus/vdev -I../drivers/bus/vdev -Idrivers/common/iavf -I../drivers/common/iavf -fdiagnostics-color=always -pipe -D_FILE_OFFSET_BITS=64 -Wall -Winvalid-pch -O3 -include rte_config.h -Wextra -Wcast-qual -Wdeprecated -Wformat-nonliteral -Wformat-security -Wmissing-declarations -Wmissing-prototypes -Wnested-externs -Wold-style-definition -Wpointer-arith -Wsign-compare -Wstrict-prototypes -Wundef -Wwrite-strings -Wno-missing-field-initializers -D_GNU_SOURCE -fPIC -march=native -DALLOW_EXPERIMENTAL_API -DALLOW_INTERNAL_API -Wno-format-truncation -Wno-strict-aliasing -DCC_AVX2_SUPPORT -MD -MQ 'drivers/a715181@@tmp_rte_pmd_iavf at sta/net_iavf_iavf_ethdev.c.o' -MF 'drivers/a715181@@tmp_rte_pmd_iavf at sta/net_iavf_iavf_ethdev.c.o.d' -o 'drivers/a715181@@tmp_rte_pmd_iavf at sta/net_iavf_iavf_ethdev.c.o' -c ../drivers/net/iavf/iavf_ethdev.c
../drivers/net/iavf/iavf_ethdev.c: In function ‘iavf_dev_configure’:
../drivers/net/iavf/iavf_ethdev.c:235:5: error: ‘VIRTCHNL_VF_LARGE_NUM_QPAIRS’ undeclared (first use in this function); did you mean ‘VIRTCHNL_MAX_NUM_ACTIONS’?
     VIRTCHNL_VF_LARGE_NUM_QPAIRS)) {
     ^~~~~~~~~~~~~~~~~~~~~~~~~~~~
     VIRTCHNL_MAX_NUM_ACTIONS
../drivers/net/iavf/iavf_ethdev.c:235:5: note: each undeclared identifier is reported only once for each function it appears in
[10/1146] Generating rte_pmd_hns3.pmd.c with a custom command.
[11/1146] Compiling C object 'drivers/a715181@@rte_pmd_i40e at sta/meson-generated_.._rte_pmd_i40e.pmd.c.o'.
[12/1146] Compiling C object 'drivers/a715181@@rte_pmd_i40e at sha/meson-generated_.._rte_pmd_i40e.pmd.c.o'.
[13/1146] Generating symbol file 'lib/76b5a35@@rte_pipeline at sha/librte_pipeline.so.21.0.symbols'.
[14/1146] Generating rte_pmd_hinic.sym_chk with a meson_exe.py custom command.
[15/1146] Compiling C object 'drivers/net/ice/base/39545a2@@ice_base at sta/ice_nvm.c.o'.
[16/1146] Compiling C object 'drivers/net/ice/base/39545a2@@ice_base at sta/ice_fdir.c.o'.
[17/1146] Compiling C object 'drivers/a715181@@tmp_rte_pmd_iavf at sta/net_iavf_iavf_vchnl.c.o'.
FAILED: drivers/a715181@@tmp_rte_pmd_iavf at sta/net_iavf_iavf_vchnl.c.o 
cc -Idrivers/a715181@@tmp_rte_pmd_iavf at sta -Idrivers -I../drivers -Idrivers/net/iavf -I../drivers/net/iavf -Idrivers/net/iavf/../../common/iavf -I../drivers/net/iavf/../../common/iavf -Ilib/librte_ethdev -I../lib/librte_ethdev -I. -I../ -Iconfig -I../config -Ilib/librte_eal/include -I../lib/librte_eal/include -Ilib/librte_eal/linux/include -I../lib/librte_eal/linux/include -Ilib/librte_eal/x86/include -I../lib/librte_eal/x86/include -Ilib/librte_eal/common -I../lib/librte_eal/common -Ilib/librte_eal -I../lib/librte_eal -Ilib/librte_kvargs -I../lib/librte_kvargs -Ilib/librte_telemetry/../librte_metrics -I../lib/librte_telemetry/../librte_metrics -Ilib/librte_telemetry -I../lib/librte_telemetry -Ilib/librte_net -I../lib/librte_net -Ilib/librte_mbuf -I../lib/librte_mbuf -Ilib/librte_mempool -I../lib/librte_mempool -Ilib/librte_ring -I../lib/librte_ring -Ilib/librte_meter -I../lib/librte_meter -Idrivers/bus/pci -I../drivers/bus/pci -I../drivers/bus/pci/linux -Ilib/librte_pci -I../lib/librte_pci -Idrivers/bus/vdev -I../drivers/bus/vdev -Idrivers/common/iavf -I../drivers/common/iavf -fdiagnostics-color=always -pipe -D_FILE_OFFSET_BITS=64 -Wall -Winvalid-pch -O3 -include rte_config.h -Wextra -Wcast-qual -Wdeprecated -Wformat-nonliteral -Wformat-security -Wmissing-declarations -Wmissing-prototypes -Wnested-externs -Wold-style-definition -Wpointer-arith -Wsign-compare -Wstrict-prototypes -Wundef -Wwrite-strings -Wno-missing-field-initializers -D_GNU_SOURCE -fPIC -march=native -DALLOW_EXPERIMENTAL_API -DALLOW_INTERNAL_API -Wno-format-truncation -Wno-strict-aliasing -DCC_AVX2_SUPPORT -MD -MQ 'drivers/a715181@@tmp_rte_pmd_iavf at sta/net_iavf_iavf_vchnl.c.o' -MF 'drivers/a715181@@tmp_rte_pmd_iavf at sta/net_iavf_iavf_vchnl.c.o.d' -o 'drivers/a715181@@tmp_rte_pmd_iavf at sta/net_iavf_iavf_vchnl.c.o' -c ../drivers/net/iavf/iavf_vchnl.c
../drivers/net/iavf/iavf_vchnl.c: In function ‘iavf_get_vf_resource’:
../drivers/net/iavf/iavf_vchnl.c:454:3: error: ‘VIRTCHNL_VF_LARGE_NUM_QPAIRS’ undeclared (first use in this function); did you mean ‘VIRTCHNL_MAX_NUM_ACTIONS’?
   VIRTCHNL_VF_LARGE_NUM_QPAIRS;
   ^~~~~~~~~~~~~~~~~~~~~~~~~~~~
   VIRTCHNL_MAX_NUM_ACTIONS
../drivers/net/iavf/iavf_vchnl.c:454:3: note: each undeclared identifier is reported only once for each function it appears in
../drivers/net/iavf/iavf_vchnl.c: In function ‘iavf_enable_queues_lv’:
../drivers/net/iavf/iavf_vchnl.c:613:15: error: invalid application of ‘sizeof’ to incomplete type ‘struct virtchnl_del_ena_dis_queues’
  len = sizeof(struct virtchnl_del_ena_dis_queues) +
               ^~~~~~
../drivers/net/iavf/iavf_vchnl.c:614:12: error: invalid application of ‘sizeof’ to incomplete type ‘struct virtchnl_queue_chunk’
     sizeof(struct virtchnl_queue_chunk) *
            ^~~~~~
../drivers/net/iavf/iavf_vchnl.c:620:28: error: dereferencing pointer to incomplete type ‘struct virtchnl_del_ena_dis_queues’
  queue_chunk = queue_select->chunks.chunks;
                            ^~
../drivers/net/iavf/iavf_vchnl.c:624:14: error: ‘VIRTCHNL_QUEUE_TYPE_TX’ undeclared (first use in this function); did you mean ‘IAVF_QUEUE_TYPE_TX’?
  queue_chunk[VIRTCHNL_QUEUE_TYPE_TX].type = VIRTCHNL_QUEUE_TYPE_TX;
              ^~~~~~~~~~~~~~~~~~~~~~
              IAVF_QUEUE_TYPE_TX
../drivers/net/iavf/iavf_vchnl.c:629:14: error: ‘VIRTCHNL_QUEUE_TYPE_RX’ undeclared (first use in this function); did you mean ‘VIRTCHNL_QUEUE_TYPE_TX’?
  queue_chunk[VIRTCHNL_QUEUE_TYPE_RX].type = VIRTCHNL_QUEUE_TYPE_RX;
              ^~~~~~~~~~~~~~~~~~~~~~
              VIRTCHNL_QUEUE_TYPE_TX
../drivers/net/iavf/iavf_vchnl.c:634:13: error: ‘VIRTCHNL_OP_ENABLE_QUEUES_V2’ undeclared (first use in this function); did you mean ‘VIRTCHNL_OP_ENABLE_QUEUES’?
  args.ops = VIRTCHNL_OP_ENABLE_QUEUES_V2;
             ^~~~~~~~~~~~~~~~~~~~~~~~~~~~
             VIRTCHNL_OP_ENABLE_QUEUES
../drivers/net/iavf/iavf_vchnl.c:609:31: warning: variable ‘queue_chunk’ set but not used [-Wunused-but-set-variable]
  struct virtchnl_queue_chunk *queue_chunk;
                               ^~~~~~~~~~~
../drivers/net/iavf/iavf_vchnl.c: In function ‘iavf_disable_queues_lv’:
../drivers/net/iavf/iavf_vchnl.c:657:15: error: invalid application of ‘sizeof’ to incomplete type ‘struct virtchnl_del_ena_dis_queues’
  len = sizeof(struct virtchnl_del_ena_dis_queues) +
               ^~~~~~
../drivers/net/iavf/iavf_vchnl.c:658:12: error: invalid application of ‘sizeof’ to incomplete type ‘struct virtchnl_queue_chunk’
     sizeof(struct virtchnl_queue_chunk) *
            ^~~~~~
../drivers/net/iavf/iavf_vchnl.c:664:28: error: dereferencing pointer to incomplete type ‘struct virtchnl_del_ena_dis_queues’
  queue_chunk = queue_select->chunks.chunks;
                            ^~
../drivers/net/iavf/iavf_vchnl.c:668:14: error: ‘VIRTCHNL_QUEUE_TYPE_TX’ undeclared (first use in this function); did you mean ‘IAVF_QUEUE_TYPE_TX’?
  queue_chunk[VIRTCHNL_QUEUE_TYPE_TX].type = VIRTCHNL_QUEUE_TYPE_TX;
              ^~~~~~~~~~~~~~~~~~~~~~
              IAVF_QUEUE_TYPE_TX
../drivers/net/iavf/iavf_vchnl.c:673:14: error: ‘VIRTCHNL_QUEUE_TYPE_RX’ undeclared (first use in this function); did you mean ‘VIRTCHNL_QUEUE_TYPE_TX’?
  queue_chunk[VIRTCHNL_QUEUE_TYPE_RX].type = VIRTCHNL_QUEUE_TYPE_RX;
              ^~~~~~~~~~~~~~~~~~~~~~
              VIRTCHNL_QUEUE_TYPE_TX
../drivers/net/iavf/iavf_vchnl.c:678:13: error: ‘VIRTCHNL_OP_DISABLE_QUEUES_V2’ undeclared (first use in this function); did you mean ‘VIRTCHNL_OP_DISABLE_QUEUES’?
  args.ops = VIRTCHNL_OP_DISABLE_QUEUES_V2;
             ^~~~~~~~~~~~~~~~~~~~~~~~~~~~~
             VIRTCHNL_OP_DISABLE_QUEUES
../drivers/net/iavf/iavf_vchnl.c:653:31: warning: variable ‘queue_chunk’ set but not used [-Wunused-but-set-variable]
  struct virtchnl_queue_chunk *queue_chunk;
                               ^~~~~~~~~~~
../drivers/net/iavf/iavf_vchnl.c: In function ‘iavf_switch_queue_lv’:
../drivers/net/iavf/iavf_vchnl.c:702:15: error: invalid application of ‘sizeof’ to incomplete type ‘struct virtchnl_del_ena_dis_queues’
  len = sizeof(struct virtchnl_del_ena_dis_queues);
               ^~~~~~
../drivers/net/iavf/iavf_vchnl.c:707:28: error: dereferencing pointer to incomplete type ‘struct virtchnl_del_ena_dis_queues’
  queue_chunk = queue_select->chunks.chunks;
                            ^~
../drivers/net/iavf/iavf_vchnl.c:712:14: error: dereferencing pointer to incomplete type ‘struct virtchnl_queue_chunk’
   queue_chunk->type = VIRTCHNL_QUEUE_TYPE_RX;
              ^~
../drivers/net/iavf/iavf_vchnl.c:712:23: error: ‘VIRTCHNL_QUEUE_TYPE_RX’ undeclared (first use in this function); did you mean ‘IAVF_QUEUE_TYPE_RX’?
   queue_chunk->type = VIRTCHNL_QUEUE_TYPE_RX;
                       ^~~~~~~~~~~~~~~~~~~~~~
                       IAVF_QUEUE_TYPE_RX
../drivers/net/iavf/iavf_vchnl.c:716:23: error: ‘VIRTCHNL_QUEUE_TYPE_TX’ undeclared (first use in this function); did you mean ‘VIRTCHNL_QUEUE_TYPE_RX’?
   queue_chunk->type = VIRTCHNL_QUEUE_TYPE_TX;
                       ^~~~~~~~~~~~~~~~~~~~~~
                       VIRTCHNL_QUEUE_TYPE_RX
../drivers/net/iavf/iavf_vchnl.c:722:14: error: ‘VIRTCHNL_OP_ENABLE_QUEUES_V2’ undeclared (first use in this function); did you mean ‘VIRTCHNL_OP_ENABLE_QUEUES’?
   args.ops = VIRTCHNL_OP_ENABLE_QUEUES_V2;
              ^~~~~~~~~~~~~~~~~~~~~~~~~~~~
              VIRTCHNL_OP_ENABLE_QUEUES
../drivers/net/iavf/iavf_vchnl.c:724:14: error: ‘VIRTCHNL_OP_DISABLE_QUEUES_V2’ undeclared (first use in this function); did you mean ‘VIRTCHNL_OP_ENABLE_QUEUES_V2’?
   args.ops = VIRTCHNL_OP_DISABLE_QUEUES_V2;
              ^~~~~~~~~~~~~~~~~~~~~~~~~~~~~
              VIRTCHNL_OP_ENABLE_QUEUES_V2
../drivers/net/iavf/iavf_vchnl.c: In function ‘iavf_config_irq_map_lv’:
../drivers/net/iavf/iavf_vchnl.c:991:15: error: invalid application of ‘sizeof’ to incomplete type ‘struct virtchnl_queue_vector_maps’
  len = sizeof(struct virtchnl_queue_vector_maps) +
               ^~~~~~
../drivers/net/iavf/iavf_vchnl.c:992:15: error: invalid application of ‘sizeof’ to incomplete type ‘struct virtchnl_queue_vector’
        sizeof(struct virtchnl_queue_vector) *
               ^~~~~~
../drivers/net/iavf/iavf_vchnl.c:999:10: error: dereferencing pointer to incomplete type ‘struct virtchnl_queue_vector_maps’
  map_info->vport_id = vf->vsi_res->vsi_id;
          ^~
../drivers/net/iavf/iavf_vchnl.c:1003:10: error: dereferencing pointer to incomplete type ‘struct virtchnl_queue_vector’
   qv_maps->itr_idx = VIRTCHNL_ITR_IDX_0;
          ^~
../drivers/net/iavf/iavf_vchnl.c:1003:22: error: ‘VIRTCHNL_ITR_IDX_0’ undeclared (first use in this function); did you mean ‘VIRTCHNL_ERR_PARAM’?
   qv_maps->itr_idx = VIRTCHNL_ITR_IDX_0;
                      ^~~~~~~~~~~~~~~~~~
                      VIRTCHNL_ERR_PARAM
../drivers/net/iavf/iavf_vchnl.c:1004:25: error: ‘VIRTCHNL_QUEUE_TYPE_RX’ undeclared (first use in this function); did you mean ‘IAVF_QUEUE_TYPE_RX’?
   qv_maps->queue_type = VIRTCHNL_QUEUE_TYPE_RX;
                         ^~~~~~~~~~~~~~~~~~~~~~
                         IAVF_QUEUE_TYPE_RX
../drivers/net/iavf/iavf_vchnl.c:1009:13: error: ‘VIRTCHNL_OP_MAP_QUEUE_VECTOR’ undeclared (first use in this function); did you mean ‘VIRTCHNL_OP_DEL_CLOUD_FILTER’?
  args.ops = VIRTCHNL_OP_MAP_QUEUE_VECTOR;
             ^~~~~~~~~~~~~~~~~~~~~~~~~~~~
             VIRTCHNL_OP_DEL_CLOUD_FILTER
../drivers/net/iavf/iavf_vchnl.c: In function ‘iavf_get_max_rss_queue_region’:
../drivers/net/iavf/iavf_vchnl.c:1498:13: error: ‘VIRTCHNL_OP_GET_MAX_RSS_QREGION’ undeclared (first use in this function); did you mean ‘VIRTCHNL_OP_SET_RSS_HENA’?
  args.ops = VIRTCHNL_OP_GET_MAX_RSS_QREGION;
             ^~~~~~~~~~~~~~~~~~~~~~~~~~~~~~~
             VIRTCHNL_OP_SET_RSS_HENA
../drivers/net/iavf/iavf_vchnl.c:1513:54: error: dereferencing pointer to incomplete type ‘struct virtchnl_max_rss_qregion’
  ((struct virtchnl_max_rss_qregion *)args.out_buffer)->qregion_width;
                                                      ^~
[18/1146] Compiling C object 'drivers/net/ice/base/39545a2@@ice_base at sta/ice_dcb.c.o'.
[19/1146] Compiling C object 'drivers/net/ice/base/39545a2@@ice_base at sta/ice_acl_ctrl.c.o'.
[20/1146] Compiling C object 'drivers/a715181@@tmp_rte_pmd_ice at sta/net_ice_ice_dcf_ethdev.c.o'.
[21/1146] Compiling C object 'drivers/a715181@@tmp_rte_pmd_ice at sta/net_ice_ice_rxtx_vec_sse.c.o'.
[22/1146] Compiling C object 'drivers/a715181@@tmp_rte_pmd_ice at sta/net_ice_ice_ethdev.c.o'.
[23/1146] Compiling C object 'drivers/net/ice/base/39545a2@@ice_base at sta/ice_flex_pipe.c.o'.
[24/1146] Compiling C object 'drivers/net/ice/base/39545a2@@ice_base at sta/ice_flow.c.o'.
[25/1146] Compiling C object 'drivers/a715181@@tmp_rte_pmd_ice at sta/net_ice_ice_rxtx.c.o'.
[26/1146] Compiling C object 'drivers/net/ice/base/39545a2@@ice_base at sta/ice_switch.c.o'.
ninja: build stopped: subcommand failed.

https://lab.dpdk.org/results/dashboard/patchsets/13307/

UNH-IOL DPDK Community Lab


More information about the test-report mailing list