[dpdk-test-report] |FAILURE| pw(79301) [RFC, v3, 3/3] app/testpmd: handle device recovery event

sys_stv at intel.com sys_stv at intel.com
Wed Sep 30 10:38:29 CEST 2020


Test-Label: Intel-compilation
Test-Status: FAILURE
http://dpdk.org/patch/79301

_Compilation issues_

Submitter: Kalesh A P <kalesh-anakkur.purayil at broadcom.com>
Date: 2020-09-30 07:12:58
Reply_mail: 20200930071258.22457-4-kalesh-anakkur.purayil at broadcom.com

DPDK git baseline: Repo:dpdk-next-net, CommitID: 10c835f2f57a62e50c83c764926d2481afbb60d5


Meson Build Summary: 21 Builds Done, 1 Successful, 20 Failures, 0 Blocked

+----------------+------------+--------------+------------+------------+-----------+----------+
| os             | gcc-static | clang-static | icc-static | gcc-shared | gcc-debug | document |
+----------------+------------+--------------+------------+------------+-----------+----------+
| CENTOS82-64    | FAIL       | FAIL         | FAIL       | FAIL       | FAIL      |          |
| RHEL82-64      | FAIL       |              |            |            |           |          |
| UB1804-64      | FAIL       |              |            |            |           |          |
| FC32-64        | FAIL       | FAIL         |            |            |           |          |
| UB2004-64      | FAIL       | FAIL         | FAIL       |            |           | FAIL     |
| WIN10-64       |            | pass         |            |            |           |          |
| UB2004-32      | FAIL       |              |            |            |           |          |
| FreeBSD1201-64 | FAIL       | FAIL         |            | FAIL       | FAIL      |          |
| SUSE15-64      | FAIL       | FAIL         |            |            |           |          |
+----------------+------------+--------------+------------+------------+-----------+----------+
Test environment and configuration as below:


OS: CENTOS82-64
	Kernel Version: 4.18.0-193.el8.x86_64
	CPU info: Intel(R) Xeon(R) Platinum 8280M CPU @ 2.70GHz
	GCC Version: gcc (GCC) 8.3.1 20191121 (Red Hat 8.3.1-5)
	Clang Version: 9.0.1 (Red Hat 9.0.1-2.module_el8.2.0+309+0c7b6b03)
	x86_64-native-linuxapp-gcc
	x86_64-native-linuxapp-clang
	x86_64-native-linuxapp-icc
	x86_64-native-linuxapp-gcc+shared
	x86_64-native-linuxapp-gcc+debug

OS: RHEL82-64
	Kernel Version: 4.18.0-193.el8.x86_64
	CPU info: Intel(R) Xeon(R) Platinum 8280M CPU @ 2.70GHz
	GCC Version: gcc (GCC) 8.3.1 20191121 (Red Hat 8.3.1-5)
	Clang Version: 8.0.1 (Red Hat 8.0.1-1.module_el8.1.0+215+a01033fb)
	x86_64-native-linuxapp-gcc

OS: UB1804-64
	Kernel Version: 5.3.0-59-generic
	CPU info: Intel(R) Xeon(R) Platinum 8180 CPU @ 2.50GHz
	GCC Version: gcc (Ubuntu 8.4.0-1ubuntu1~18.04) 8.4.0
	Clang Version: 6.0.0-1ubuntu2 (tags/RELEASE_600/final)
	x86_64-native-linuxapp-gcc

OS: FC32-64
	Kernel Version: 5.6.0-0.rc7.git0.2.fc32.x86_64
	CPU info: Intel(R) Xeon(R) Platinum 8280M CPU @ 2.70GHz
	GCC Version: gcc (GCC) 10.0.1 20200311 (Red Hat 10.0.1-0.9)
	Clang Version: 10.0.0 (Fedora 10.0.0-0.3.rc4.fc32)
	x86_64-native-linuxapp-gcc
	x86_64-native-linuxapp-clang

OS: UB2004-64
	Kernel Version: 5.4.0-26-generic
	CPU info: Intel(R) Xeon(R) Platinum 8180 CPU @ 2.50GHz
	GCC Version: gcc (Ubuntu 10-20200416-0ubuntu1) 10.0.1 20200416 (experimental) [master revision 3c3f12e2a76:dcee354ce56:44b326839d864fc10c459916abcc97f35a9ac3de]
	Clang Version: 10.0.0-4ubuntu1
	x86_64-native-linuxapp-clang
	x86_64-native-linuxapp-gcc
	x86_64-native-linuxapp-icc
	x86_64-native-linuxapp-doc

OS: WIN10-64
	Kernel Version: N/A
	CPU info: N/A
	GCC Version: N/A
	Clang Version: Clang 8.0.0
	x86_64-windows-clang

OS: UB2004-32
	Kernel Version: 5.4.0-26-generic
	CPU info: Intel(R) Xeon(R) Platinum 8180 CPU @ 2.50GHz
	GCC Version: gcc (Ubuntu 9.3.0-10ubuntu2) 9.3.0
	Clang Version: 10.0.0-4ubuntu1
	i686-native-linuxapp-gcc

OS: FreeBSD1201-64
	Kernel Version: 12.1-RELEASE
	CPU info: Intel(R) Xeon(R) CPU E5-2699 v3 @ 2.30GHz (2294.74-MHz K8-class CPU)
	GCC Version: gcc (FreeBSD Ports Collection) 9.2.0
	Clang Version: 8.0.1 (tags/RELEASE_801/final 366581) (based on LLVM 8.0.1)
	x86_64-native-bsdapp-gcc
	x86_64-native-bsdapp-clang
	x86_64-native-bsdapp-gcc+shared
	x86_64-native-bsdapp-gcc+debug

OS: SUSE15-64
	Kernel Version: 4.12.14-lp150.11-default
	CPU info: Intel(R) Xeon(R) CPU E5-2699 v4 @ 2.20GHz
	GCC Version: gcc (SUSE Linux) 7.3.1 20180323 [gcc-7-branch revision 258812]
	Clang Version: 5.0.1 (tags/RELEASE_501/final 312548)
	x86_64-native-linuxapp-clang
	x86_64-native-linuxapp-gcc



*Build Failed #1:
OS: CENTOS82-64
Target: x86_64-native-linuxapp-gcc
FAILED: drivers/libtmp_rte_pmd_bnxt.a.p/net_bnxt_bnxt_cpr.c.o 
gcc -Idrivers/libtmp_rte_pmd_bnxt.a.p -Idrivers -I../drivers -Idrivers/net/bnxt -I../drivers/net/bnxt -I../drivers/net/bnxt/tf_ulp -I../drivers/net/bnxt/tf_core -Ilib/librte_ethdev -I../lib/librte_ethdev -I. -I.. -Iconfig -I../config -Ilib/librte_eal/include -I../lib/librte_eal/include -Ilib/librte_eal/linux/include -I../lib/librte_eal/linux/include -Ilib/librte_eal/x86/include -I../lib/librte_eal/x86/include -Ilib/librte_eal/common -I../lib/librte_eal/common -Ilib/librte_eal -I../lib/librte_eal -Ilib/librte_kvargs -I../lib/librte_kvargs -Ilib/librte_metrics -I../lib/librte_metrics -Ilib/librte_telemetry -I../lib/librte_telemetry -Ilib/librte_net -I../lib/librte_net -Ilib/librte_mbuf -I../lib/librte_mbuf -Ilib/librte_mempool -I../lib/librte_mempool -Ilib/librte_ring -I../lib/librte_ring -Ilib/librte_meter -I../lib/librte_meter -Idrivers/bus/pci -I../drivers/bus/pci -I../drivers/bus/pci/linux -Ilib/librte_pci -I../lib/librte_pci -Idrivers/bus/vdev -I../drivers/bus/vdev -fdiagnostics-color=always -pipe -D_FILE_OFFSET_BITS=64 -Wall -Winvalid-pch -Werror -O3 -include rte_config.h -Wextra -Wcast-qual -Wdeprecated -Wformat-nonliteral -Wformat-security -Wmissing-declarations -Wmissing-prototypes -Wnested-externs -Wold-style-definition -Wpointer-arith -Wsign-compare -Wstrict-prototypes -Wundef -Wwrite-strings -Wno-packed-not-aligned -Wno-missing-field-initializers -D_GNU_SOURCE -fPIC -march=native -mno-avx512f -DALLOW_EXPERIMENTAL_API -DALLOW_INTERNAL_API -Wno-format-truncation -MD -MQ drivers/libtmp_rte_pmd_bnxt.a.p/net_bnxt_bnxt_cpr.c.o -MF drivers/libtmp_rte_pmd_bnxt.a.p/net_bnxt_bnxt_cpr.c.o.d -o drivers/libtmp_rte_pmd_bnxt.a.p/net_bnxt_bnxt_cpr.c.o -c ../drivers/net/bnxt/bnxt_cpr.c
../drivers/net/bnxt/bnxt_cpr.c: In function ‘bnxt_handle_async_event’:
../drivers/net/bnxt/bnxt_cpr.c:132:3: error: implicit declaration of function ‘_rte_eth_dev_callback_process’; did you mean ‘rte_eth_dev_callback_process’? [-Werror=implicit-function-declaration]
   _rte_eth_dev_callback_process(bp->eth_dev,
   ^~~~~~~~~~~~~~~~~~~~~~~~~~~~~
   rte_eth_dev_callback_process
../drivers/net/bnxt/bnxt_cpr.c:132:3: error: nested extern declaration of ‘_rte_eth_dev_callback_process’ [-Werror=nested-externs]
cc1: all warnings being treated as errors
[943/2609] Compiling C object drivers/libtmp_rte_pmd_bond.a.p/net_bonding_rte_eth_bond_pmd.c.o
[944/2609] Compiling C object drivers/libtmp_rte_pmd_bnx2x.a.p/net_bnx2x_bnx2x_stats.c.o
[945/2609] Compiling C object drivers/libtmp_rte_pmd_bnxt.a.p/net_bnxt_bnxt_irq.c.o
[946/2609] Compiling C object drivers/libtmp_rte_pmd_bnxt.a.p/net_bnxt_bnxt_ring.c.o
[947/2609] Compiling C object drivers/libtmp_rte_pmd_bnxt.a.p/net_bnxt_bnxt_flow.c.o
[948/2609] Compiling C object drivers/libtmp_rte_pmd_bnxt.a.p/net_bnxt_bnxt_ethdev.c.o
FAILED: drivers/libtmp_rte_pmd_bnxt.a.p/net_bnxt_bnxt_ethdev.c.o 
gcc -Idrivers/libtmp_rte_pmd_bnxt.a.p -Idrivers -I../drivers -Idrivers/net/bnxt -I../drivers/net/bnxt -I../drivers/net/bnxt/tf_ulp -I../drivers/net/bnxt/tf_core -Ilib/librte_ethdev -I../lib/librte_ethdev -I. -I.. -Iconfig -I../config -Ilib/librte_eal/include -I../lib/librte_eal/include -Ilib/librte_eal/linux/include -I../lib/librte_eal/linux/include -Ilib/librte_eal/x86/include -I../lib/librte_eal/x86/include -Ilib/librte_eal/common -I../lib/librte_eal/common -Ilib/librte_eal -I../lib/librte_eal -Ilib/librte_kvargs -I../lib/librte_kvargs -Ilib/librte_metrics -I../lib/librte_metrics -Ilib/librte_telemetry -I../lib/librte_telemetry -Ilib/librte_net -I../lib/librte_net -Ilib/librte_mbuf -I../lib/librte_mbuf -Ilib/librte_mempool -I../lib/librte_mempool -Ilib/librte_ring -I../lib/librte_ring -Ilib/librte_meter -I../lib/librte_meter -Idrivers/bus/pci -I../drivers/bus/pci -I../drivers/bus/pci/linux -Ilib/librte_pci -I../lib/librte_pci -Idrivers/bus/vdev -I../drivers/bus/vdev -fdiagnostics-color=always -pipe -D_FILE_OFFSET_BITS=64 -Wall -Winvalid-pch -Werror -O3 -include rte_config.h -Wextra -Wcast-qual -Wdeprecated -Wformat-nonliteral -Wformat-security -Wmissing-declarations -Wmissing-prototypes -Wnested-externs -Wold-style-definition -Wpointer-arith -Wsign-compare -Wstrict-prototypes -Wundef -Wwrite-strings -Wno-packed-not-aligned -Wno-missing-field-initializers -D_GNU_SOURCE -fPIC -march=native -mno-avx512f -DALLOW_EXPERIMENTAL_API -DALLOW_INTERNAL_API -Wno-format-truncation -MD -MQ drivers/libtmp_rte_pmd_bnxt.a.p/net_bnxt_bnxt_ethdev.c.o -MF drivers/libtmp_rte_pmd_bnxt.a.p/net_bnxt_bnxt_ethdev.c.o.d -o drivers/libtmp_rte_pmd_bnxt.a.p/net_bnxt_bnxt_ethdev.c.o -c ../drivers/net/bnxt/bnxt_ethdev.c
../drivers/net/bnxt/bnxt_ethdev.c: In function ‘bnxt_dev_recover’:
../drivers/net/bnxt/bnxt_ethdev.c:4569:2: error: implicit declaration of function ‘_rte_eth_dev_callback_process’; did you mean ‘rte_eth_dev_callback_process’? [-Werror=implicit-function-declaration]
  _rte_eth_dev_callback_process(bp->eth_dev,
  ^~~~~~~~~~~~~~~~~~~~~~~~~~~~~
  rte_eth_dev_callback_process
../drivers/net/bnxt/bnxt_ethdev.c:4569:2: error: nested extern declaration of ‘_rte_eth_dev_callback_process’ [-Werror=nested-externs]
cc1: all warnings being treated as errors
[949/2609] Compiling C object drivers/libtmp_rte_pmd_bnx2x.a.p/net_bnx2x_bnx2x.c.o
[950/2609] Compiling C object drivers/libtmp_rte_pmd_bnxt.a.p/net_bnxt_bnxt_hwrm.c.o
[951/2609] Compiling C object drivers/libtmp_rte_pmd_bnx2x.a.p/net_bnx2x_elink.c.o
ninja: build stopped: subcommand failed




*Build Failed #2:
OS: CENTOS82-64
Target: x86_64-native-linuxapp-clang
FAILED: drivers/libtmp_rte_pmd_bnxt.a.p/net_bnxt_bnxt_cpr.c.o 
clang -Idrivers/libtmp_rte_pmd_bnxt.a.p -Idrivers -I../drivers -Idrivers/net/bnxt -I../drivers/net/bnxt -I../drivers/net/bnxt/tf_ulp -I../drivers/net/bnxt/tf_core -Ilib/librte_ethdev -I../lib/librte_ethdev -I. -I.. -Iconfig -I../config -Ilib/librte_eal/include -I../lib/librte_eal/include -Ilib/librte_eal/linux/include -I../lib/librte_eal/linux/include -Ilib/librte_eal/x86/include -I../lib/librte_eal/x86/include -Ilib/librte_eal/common -I../lib/librte_eal/common -Ilib/librte_eal -I../lib/librte_eal -Ilib/librte_kvargs -I../lib/librte_kvargs -Ilib/librte_metrics -I../lib/librte_metrics -Ilib/librte_telemetry -I../lib/librte_telemetry -Ilib/librte_net -I../lib/librte_net -Ilib/librte_mbuf -I../lib/librte_mbuf -Ilib/librte_mempool -I../lib/librte_mempool -Ilib/librte_ring -I../lib/librte_ring -Ilib/librte_meter -I../lib/librte_meter -Idrivers/bus/pci -I../drivers/bus/pci -I../drivers/bus/pci/linux -Ilib/librte_pci -I../lib/librte_pci -Idrivers/bus/vdev -I../drivers/bus/vdev -Xclang -fcolor-diagnostics -pipe -D_FILE_OFFSET_BITS=64 -Wall -Winvalid-pch -Werror -O3 -include rte_config.h -Wextra -Wcast-qual -Wdeprecated -Wformat-nonliteral -Wformat-security -Wmissing-declarations -Wmissing-prototypes -Wnested-externs -Wold-style-definition -Wpointer-arith -Wsign-compare -Wstrict-prototypes -Wundef -Wwrite-strings -Wno-address-of-packed-member -Wno-missing-field-initializers -D_GNU_SOURCE -fPIC -march=native -mno-avx512f -DALLOW_EXPERIMENTAL_API -DALLOW_INTERNAL_API -MD -MQ drivers/libtmp_rte_pmd_bnxt.a.p/net_bnxt_bnxt_cpr.c.o -MF drivers/libtmp_rte_pmd_bnxt.a.p/net_bnxt_bnxt_cpr.c.o.d -o drivers/libtmp_rte_pmd_bnxt.a.p/net_bnxt_bnxt_cpr.c.o -c ../drivers/net/bnxt/bnxt_cpr.c
../drivers/net/bnxt/bnxt_cpr.c:132:3: error: implicit declaration of function '_rte_eth_dev_callback_process' is invalid in C99 [-Werror,-Wimplicit-function-declaration]
                _rte_eth_dev_callback_process(bp->eth_dev,
                ^
../drivers/net/bnxt/bnxt_cpr.c:132:3: note: did you mean 'rte_eth_dev_callback_process'?
../lib/librte_ethdev/rte_ethdev_driver.h:844:5: note: 'rte_eth_dev_callback_process' declared here
int rte_eth_dev_callback_process(struct rte_eth_dev *dev,
    ^
1 error generated.
[943/2609] Compiling C object drivers/libtmp_rte_pmd_bond.a.p/net_bonding_rte_eth_bond_pmd.c.o
[944/2609] Compiling C object drivers/libtmp_rte_pmd_bnxt.a.p/net_bnxt_bnxt_ethdev.c.o
FAILED: drivers/libtmp_rte_pmd_bnxt.a.p/net_bnxt_bnxt_ethdev.c.o 
clang -Idrivers/libtmp_rte_pmd_bnxt.a.p -Idrivers -I../drivers -Idrivers/net/bnxt -I../drivers/net/bnxt -I../drivers/net/bnxt/tf_ulp -I../drivers/net/bnxt/tf_core -Ilib/librte_ethdev -I../lib/librte_ethdev -I. -I.. -Iconfig -I../config -Ilib/librte_eal/include -I../lib/librte_eal/include -Ilib/librte_eal/linux/include -I../lib/librte_eal/linux/include -Ilib/librte_eal/x86/include -I../lib/librte_eal/x86/include -Ilib/librte_eal/common -I../lib/librte_eal/common -Ilib/librte_eal -I../lib/librte_eal -Ilib/librte_kvargs -I../lib/librte_kvargs -Ilib/librte_metrics -I../lib/librte_metrics -Ilib/librte_telemetry -I../lib/librte_telemetry -Ilib/librte_net -I../lib/librte_net -Ilib/librte_mbuf -I../lib/librte_mbuf -Ilib/librte_mempool -I../lib/librte_mempool -Ilib/librte_ring -I../lib/librte_ring -Ilib/librte_meter -I../lib/librte_meter -Idrivers/bus/pci -I../drivers/bus/pci -I../drivers/bus/pci/linux -Ilib/librte_pci -I../lib/librte_pci -Idrivers/bus/vdev -I../drivers/bus/vdev -Xclang -fcolor-diagnostics -pipe -D_FILE_OFFSET_BITS=64 -Wall -Winvalid-pch -Werror -O3 -include rte_config.h -Wextra -Wcast-qual -Wdeprecated -Wformat-nonliteral -Wformat-security -Wmissing-declarations -Wmissing-prototypes -Wnested-externs -Wold-style-definition -Wpointer-arith -Wsign-compare -Wstrict-prototypes -Wundef -Wwrite-strings -Wno-address-of-packed-member -Wno-missing-field-initializers -D_GNU_SOURCE -fPIC -march=native -mno-avx512f -DALLOW_EXPERIMENTAL_API -DALLOW_INTERNAL_API -MD -MQ drivers/libtmp_rte_pmd_bnxt.a.p/net_bnxt_bnxt_ethdev.c.o -MF drivers/libtmp_rte_pmd_bnxt.a.p/net_bnxt_bnxt_ethdev.c.o.d -o drivers/libtmp_rte_pmd_bnxt.a.p/net_bnxt_bnxt_ethdev.c.o -c ../drivers/net/bnxt/bnxt_ethdev.c
../drivers/net/bnxt/bnxt_ethdev.c:4569:2: error: implicit declaration of function '_rte_eth_dev_callback_process' is invalid in C99 [-Werror,-Wimplicit-function-declaration]
        _rte_eth_dev_callback_process(bp->eth_dev,
        ^
../drivers/net/bnxt/bnxt_ethdev.c:4569:2: note: did you mean 'rte_eth_dev_callback_process'?
../lib/librte_ethdev/rte_ethdev_driver.h:844:5: note: 'rte_eth_dev_callback_process' declared here
int rte_eth_dev_callback_process(struct rte_eth_dev *dev,
    ^
../drivers/net/bnxt/bnxt_ethdev.c:4717:2: error: implicit declaration of function '_rte_eth_dev_callback_process' is invalid in C99 [-Werror,-Wimplicit-function-declaration]
        _rte_eth_dev_callback_process(bp->eth_dev,
        ^
2 errors generated.
[945/2609] Compiling C object drivers/libtmp_rte_pmd_bnx2x.a.p/net_bnx2x_bnx2x_stats.c.o
[946/2609] Compiling C object drivers/libtmp_rte_pmd_bnxt.a.p/net_bnxt_bnxt_flow.c.o
[947/2609] Compiling C object drivers/libtmp_rte_pmd_bnxt.a.p/net_bnxt_bnxt_irq.c.o
[948/2609] Compiling C object drivers/libtmp_rte_pmd_bnxt.a.p/net_bnxt_bnxt_ring.c.o
[949/2609] Compiling C object drivers/libtmp_rte_pmd_bnxt.a.p/net_bnxt_bnxt_hwrm.c.o
[950/2609] Compiling C object drivers/libtmp_rte_pmd_bnx2x.a.p/net_bnx2x_elink.c.o
[951/2609] Compiling C object drivers/libtmp_rte_pmd_bnx2x.a.p/net_bnx2x_bnx2x.c.o
ninja: build stopped: subcommand failed




*Build Failed #3:
OS: CENTOS82-64
Target: x86_64-native-linuxapp-icc
FAILED: drivers/libtmp_rte_pmd_bnxt.a.p/net_bnxt_bnxt_ethdev.c.o 
icc -Idrivers/libtmp_rte_pmd_bnxt.a.p -Idrivers -I../drivers -Idrivers/net/bnxt -I../drivers/net/bnxt -I../drivers/net/bnxt/tf_ulp -I../drivers/net/bnxt/tf_core -Ilib/librte_ethdev -I../lib/librte_ethdev -I. -I.. -Iconfig -I../config -Ilib/librte_eal/include -I../lib/librte_eal/include -Ilib/librte_eal/linux/include -I../lib/librte_eal/linux/include -Ilib/librte_eal/x86/include -I../lib/librte_eal/x86/include -Ilib/librte_eal/common -I../lib/librte_eal/common -Ilib/librte_eal -I../lib/librte_eal -Ilib/librte_kvargs -I../lib/librte_kvargs -Ilib/librte_metrics -I../lib/librte_metrics -Ilib/librte_telemetry -I../lib/librte_telemetry -Ilib/librte_net -I../lib/librte_net -Ilib/librte_mbuf -I../lib/librte_mbuf -Ilib/librte_mempool -I../lib/librte_mempool -Ilib/librte_ring -I../lib/librte_ring -Ilib/librte_meter -I../lib/librte_meter -Idrivers/bus/pci -I../drivers/bus/pci -I../drivers/bus/pci/linux -Ilib/librte_pci -I../lib/librte_pci -Idrivers/bus/vdev -I../drivers/bus/vdev -pipe -D_FILE_OFFSET_BITS=64 -Wall -w3 -diag-disable:remark -Werror -O3 -include rte_config.h -Wextra -Wcast-qual -Wdeprecated -Wformat-security -Wmissing-declarations -Wmissing-prototypes -Wold-style-definition -Wpointer-arith -Wsign-compare -Wstrict-prototypes -Wundef -Wwrite-strings -Wno-missing-field-initializers -diag-disable=188 -diag-disable=2203 -diag-disable=2279 -diag-disable=2557 -diag-disable=3179 -diag-disable=3656 -D_GNU_SOURCE -fPIC -march=native -mno-avx512f -DALLOW_EXPERIMENTAL_API -DALLOW_INTERNAL_API -MD -MQ drivers/libtmp_rte_pmd_bnxt.a.p/net_bnxt_bnxt_ethdev.c.o -MF drivers/libtmp_rte_pmd_bnxt.a.p/net_bnxt_bnxt_ethdev.c.o.d -o drivers/libtmp_rte_pmd_bnxt.a.p/net_bnxt_bnxt_ethdev.c.o -c ../drivers/net/bnxt/bnxt_ethdev.c
../drivers/net/bnxt/bnxt_ethdev.c(4569): error #266: function "_rte_eth_dev_callback_process" declared implicitly
  	_rte_eth_dev_callback_process(bp->eth_dev,
  	^

../drivers/net/bnxt/bnxt_ethdev.c(4717): error #266: function "_rte_eth_dev_callback_process" declared implicitly
  	_rte_eth_dev_callback_process(bp->eth_dev,
  	^

compilation aborted for ../drivers/net/bnxt/bnxt_ethdev.c (code 2)
[936/2609] Compiling C object drivers/libtmp_rte_pmd_bnxt.a.p/net_bnxt_bnxt_cpr.c.o
FAILED: drivers/libtmp_rte_pmd_bnxt.a.p/net_bnxt_bnxt_cpr.c.o 
icc -Idrivers/libtmp_rte_pmd_bnxt.a.p -Idrivers -I../drivers -Idrivers/net/bnxt -I../drivers/net/bnxt -I../drivers/net/bnxt/tf_ulp -I../drivers/net/bnxt/tf_core -Ilib/librte_ethdev -I../lib/librte_ethdev -I. -I.. -Iconfig -I../config -Ilib/librte_eal/include -I../lib/librte_eal/include -Ilib/librte_eal/linux/include -I../lib/librte_eal/linux/include -Ilib/librte_eal/x86/include -I../lib/librte_eal/x86/include -Ilib/librte_eal/common -I../lib/librte_eal/common -Ilib/librte_eal -I../lib/librte_eal -Ilib/librte_kvargs -I../lib/librte_kvargs -Ilib/librte_metrics -I../lib/librte_metrics -Ilib/librte_telemetry -I../lib/librte_telemetry -Ilib/librte_net -I../lib/librte_net -Ilib/librte_mbuf -I../lib/librte_mbuf -Ilib/librte_mempool -I../lib/librte_mempool -Ilib/librte_ring -I../lib/librte_ring -Ilib/librte_meter -I../lib/librte_meter -Idrivers/bus/pci -I../drivers/bus/pci -I../drivers/bus/pci/linux -Ilib/librte_pci -I../lib/librte_pci -Idrivers/bus/vdev -I../drivers/bus/vdev -pipe -D_FILE_OFFSET_BITS=64 -Wall -w3 -diag-disable:remark -Werror -O3 -include rte_config.h -Wextra -Wcast-qual -Wdeprecated -Wformat-security -Wmissing-declarations -Wmissing-prototypes -Wold-style-definition -Wpointer-arith -Wsign-compare -Wstrict-prototypes -Wundef -Wwrite-strings -Wno-missing-field-initializers -diag-disable=188 -diag-disable=2203 -diag-disable=2279 -diag-disable=2557 -diag-disable=3179 -diag-disable=3656 -D_GNU_SOURCE -fPIC -march=native -mno-avx512f -DALLOW_EXPERIMENTAL_API -DALLOW_INTERNAL_API -MD -MQ drivers/libtmp_rte_pmd_bnxt.a.p/net_bnxt_bnxt_cpr.c.o -MF drivers/libtmp_rte_pmd_bnxt.a.p/net_bnxt_bnxt_cpr.c.o.d -o drivers/libtmp_rte_pmd_bnxt.a.p/net_bnxt_bnxt_cpr.c.o -c ../drivers/net/bnxt/bnxt_cpr.c
../drivers/net/bnxt/bnxt_cpr.c(132): error #266: function "_rte_eth_dev_callback_process" declared implicitly
  		_rte_eth_dev_callback_process(bp->eth_dev,
  		^

compilation aborted for ../drivers/net/bnxt/bnxt_cpr.c (code 2)
[937/2609] Generating rte_pmd_axgbe.sym_chk with a meson_exe.py custom command
[938/2609] Compiling C object drivers/libtmp_rte_pmd_bnx2x.a.p/net_bnx2x_bnx2x_rxtx.c.o
[939/2609] Compiling C object drivers/libtmp_rte_pmd_bond.a.p/net_bonding_rte_eth_bond_pmd.c.o
[940/2609] Compiling C object drivers/libtmp_rte_pmd_bnxt.a.p/net_bnxt_bnxt_flow.c.o
[941/2609] Compiling C object drivers/libtmp_rte_pmd_bnx2x.a.p/net_bnx2x_bnx2x.c.o
[942/2609] Compiling C object drivers/libtmp_rte_pmd_bond.a.p/net_bonding_rte_eth_bond_8023ad.c.o
[943/2609] Compiling C object drivers/libtmp_rte_pmd_bnx2x.a.p/net_bnx2x_elink.c.o
[944/2609] Compiling C object lib/librte_pipeline.a.p/librte_pipeline_rte_table_action.c.o
ninja: build stopped: subcommand failed




*Build Failed #4:
OS: CENTOS82-64
Target: x86_64-native-linuxapp-gcc+shared
FAILED: drivers/libtmp_rte_pmd_bnxt.a.p/net_bnxt_bnxt_cpr.c.o 
gcc -Idrivers/libtmp_rte_pmd_bnxt.a.p -Idrivers -I../drivers -Idrivers/net/bnxt -I../drivers/net/bnxt -I../drivers/net/bnxt/tf_ulp -I../drivers/net/bnxt/tf_core -Ilib/librte_ethdev -I../lib/librte_ethdev -I. -I.. -Iconfig -I../config -Ilib/librte_eal/include -I../lib/librte_eal/include -Ilib/librte_eal/linux/include -I../lib/librte_eal/linux/include -Ilib/librte_eal/x86/include -I../lib/librte_eal/x86/include -Ilib/librte_eal/common -I../lib/librte_eal/common -Ilib/librte_eal -I../lib/librte_eal -Ilib/librte_kvargs -I../lib/librte_kvargs -Ilib/librte_metrics -I../lib/librte_metrics -Ilib/librte_telemetry -I../lib/librte_telemetry -Ilib/librte_net -I../lib/librte_net -Ilib/librte_mbuf -I../lib/librte_mbuf -Ilib/librte_mempool -I../lib/librte_mempool -Ilib/librte_ring -I../lib/librte_ring -Ilib/librte_meter -I../lib/librte_meter -Idrivers/bus/pci -I../drivers/bus/pci -I../drivers/bus/pci/linux -Ilib/librte_pci -I../lib/librte_pci -Idrivers/bus/vdev -I../drivers/bus/vdev -fdiagnostics-color=always -pipe -D_FILE_OFFSET_BITS=64 -Wall -Winvalid-pch -Werror -O3 -include rte_config.h -Wextra -Wcast-qual -Wdeprecated -Wformat-nonliteral -Wformat-security -Wmissing-declarations -Wmissing-prototypes -Wnested-externs -Wold-style-definition -Wpointer-arith -Wsign-compare -Wstrict-prototypes -Wundef -Wwrite-strings -Wno-packed-not-aligned -Wno-missing-field-initializers -D_GNU_SOURCE -fPIC -march=native -mno-avx512f -DALLOW_EXPERIMENTAL_API -DALLOW_INTERNAL_API -Wno-format-truncation -MD -MQ drivers/libtmp_rte_pmd_bnxt.a.p/net_bnxt_bnxt_cpr.c.o -MF drivers/libtmp_rte_pmd_bnxt.a.p/net_bnxt_bnxt_cpr.c.o.d -o drivers/libtmp_rte_pmd_bnxt.a.p/net_bnxt_bnxt_cpr.c.o -c ../drivers/net/bnxt/bnxt_cpr.c
../drivers/net/bnxt/bnxt_cpr.c: In function ‘bnxt_handle_async_event’:
../drivers/net/bnxt/bnxt_cpr.c:132:3: error: implicit declaration of function ‘_rte_eth_dev_callback_process’; did you mean ‘rte_eth_dev_callback_process’? [-Werror=implicit-function-declaration]
   _rte_eth_dev_callback_process(bp->eth_dev,
   ^~~~~~~~~~~~~~~~~~~~~~~~~~~~~
   rte_eth_dev_callback_process
../drivers/net/bnxt/bnxt_cpr.c:132:3: error: nested extern declaration of ‘_rte_eth_dev_callback_process’ [-Werror=nested-externs]
cc1: all warnings being treated as errors
[968/2445] Generating rte_pmd_bond.sym_chk with a meson_exe.py custom command
[969/2445] Compiling C object drivers/libtmp_rte_pmd_bnxt.a.p/net_bnxt_bnxt_flow.c.o
[970/2445] Compiling C object drivers/libtmp_rte_pmd_bnxt.a.p/net_bnxt_bnxt_ethdev.c.o
FAILED: drivers/libtmp_rte_pmd_bnxt.a.p/net_bnxt_bnxt_ethdev.c.o 
gcc -Idrivers/libtmp_rte_pmd_bnxt.a.p -Idrivers -I../drivers -Idrivers/net/bnxt -I../drivers/net/bnxt -I../drivers/net/bnxt/tf_ulp -I../drivers/net/bnxt/tf_core -Ilib/librte_ethdev -I../lib/librte_ethdev -I. -I.. -Iconfig -I../config -Ilib/librte_eal/include -I../lib/librte_eal/include -Ilib/librte_eal/linux/include -I../lib/librte_eal/linux/include -Ilib/librte_eal/x86/include -I../lib/librte_eal/x86/include -Ilib/librte_eal/common -I../lib/librte_eal/common -Ilib/librte_eal -I../lib/librte_eal -Ilib/librte_kvargs -I../lib/librte_kvargs -Ilib/librte_metrics -I../lib/librte_metrics -Ilib/librte_telemetry -I../lib/librte_telemetry -Ilib/librte_net -I../lib/librte_net -Ilib/librte_mbuf -I../lib/librte_mbuf -Ilib/librte_mempool -I../lib/librte_mempool -Ilib/librte_ring -I../lib/librte_ring -Ilib/librte_meter -I../lib/librte_meter -Idrivers/bus/pci -I../drivers/bus/pci -I../drivers/bus/pci/linux -Ilib/librte_pci -I../lib/librte_pci -Idrivers/bus/vdev -I../drivers/bus/vdev -fdiagnostics-color=always -pipe -D_FILE_OFFSET_BITS=64 -Wall -Winvalid-pch -Werror -O3 -include rte_config.h -Wextra -Wcast-qual -Wdeprecated -Wformat-nonliteral -Wformat-security -Wmissing-declarations -Wmissing-prototypes -Wnested-externs -Wold-style-definition -Wpointer-arith -Wsign-compare -Wstrict-prototypes -Wundef -Wwrite-strings -Wno-packed-not-aligned -Wno-missing-field-initializers -D_GNU_SOURCE -fPIC -march=native -mno-avx512f -DALLOW_EXPERIMENTAL_API -DALLOW_INTERNAL_API -Wno-format-truncation -MD -MQ drivers/libtmp_rte_pmd_bnxt.a.p/net_bnxt_bnxt_ethdev.c.o -MF drivers/libtmp_rte_pmd_bnxt.a.p/net_bnxt_bnxt_ethdev.c.o.d -o drivers/libtmp_rte_pmd_bnxt.a.p/net_bnxt_bnxt_ethdev.c.o -c ../drivers/net/bnxt/bnxt_ethdev.c
../drivers/net/bnxt/bnxt_ethdev.c: In function ‘bnxt_dev_recover’:
../drivers/net/bnxt/bnxt_ethdev.c:4569:2: error: implicit declaration of function ‘_rte_eth_dev_callback_process’; did you mean ‘rte_eth_dev_callback_process’? [-Werror=implicit-function-declaration]
  _rte_eth_dev_callback_process(bp->eth_dev,
  ^~~~~~~~~~~~~~~~~~~~~~~~~~~~~
  rte_eth_dev_callback_process
../drivers/net/bnxt/bnxt_ethdev.c:4569:2: error: nested extern declaration of ‘_rte_eth_dev_callback_process’ [-Werror=nested-externs]
cc1: all warnings being treated as errors
[971/2445] Compiling C object drivers/libtmp_rte_pmd_bnx2x.a.p/net_bnx2x_bnx2x.c.o
[972/2445] Compiling C object drivers/libtmp_rte_pmd_bnx2x.a.p/net_bnx2x_elink.c.o
ninja: build stopped: subcommand failed




*Build Failed #5:
OS: CENTOS82-64
Target: x86_64-native-linuxapp-gcc+debug
FAILED: drivers/libtmp_rte_pmd_bnxt.a.p/net_bnxt_bnxt_cpr.c.o 
gcc -Idrivers/libtmp_rte_pmd_bnxt.a.p -Idrivers -I../drivers -Idrivers/net/bnxt -I../drivers/net/bnxt -I../drivers/net/bnxt/tf_ulp -I../drivers/net/bnxt/tf_core -Ilib/librte_ethdev -I../lib/librte_ethdev -I. -I.. -Iconfig -I../config -Ilib/librte_eal/include -I../lib/librte_eal/include -Ilib/librte_eal/linux/include -I../lib/librte_eal/linux/include -Ilib/librte_eal/x86/include -I../lib/librte_eal/x86/include -Ilib/librte_eal/common -I../lib/librte_eal/common -Ilib/librte_eal -I../lib/librte_eal -Ilib/librte_kvargs -I../lib/librte_kvargs -Ilib/librte_metrics -I../lib/librte_metrics -Ilib/librte_telemetry -I../lib/librte_telemetry -Ilib/librte_net -I../lib/librte_net -Ilib/librte_mbuf -I../lib/librte_mbuf -Ilib/librte_mempool -I../lib/librte_mempool -Ilib/librte_ring -I../lib/librte_ring -Ilib/librte_meter -I../lib/librte_meter -Idrivers/bus/pci -I../drivers/bus/pci -I../drivers/bus/pci/linux -Ilib/librte_pci -I../lib/librte_pci -Idrivers/bus/vdev -I../drivers/bus/vdev -fdiagnostics-color=always -pipe -D_FILE_OFFSET_BITS=64 -Wall -Winvalid-pch -Werror -O2 -g -include rte_config.h -Wextra -Wcast-qual -Wdeprecated -Wformat-nonliteral -Wformat-security -Wmissing-declarations -Wmissing-prototypes -Wnested-externs -Wold-style-definition -Wpointer-arith -Wsign-compare -Wstrict-prototypes -Wundef -Wwrite-strings -Wno-packed-not-aligned -Wno-missing-field-initializers -D_GNU_SOURCE -fPIC -march=native -mno-avx512f -DALLOW_EXPERIMENTAL_API -DALLOW_INTERNAL_API -Wno-format-truncation -MD -MQ drivers/libtmp_rte_pmd_bnxt.a.p/net_bnxt_bnxt_cpr.c.o -MF drivers/libtmp_rte_pmd_bnxt.a.p/net_bnxt_bnxt_cpr.c.o.d -o drivers/libtmp_rte_pmd_bnxt.a.p/net_bnxt_bnxt_cpr.c.o -c ../drivers/net/bnxt/bnxt_cpr.c
../drivers/net/bnxt/bnxt_cpr.c: In function ‘bnxt_handle_async_event’:
../drivers/net/bnxt/bnxt_cpr.c:132:3: error: implicit declaration of function ‘_rte_eth_dev_callback_process’; did you mean ‘rte_eth_dev_callback_process’? [-Werror=implicit-function-declaration]
   _rte_eth_dev_callback_process(bp->eth_dev,
   ^~~~~~~~~~~~~~~~~~~~~~~~~~~~~
   rte_eth_dev_callback_process
../drivers/net/bnxt/bnxt_cpr.c:132:3: error: nested extern declaration of ‘_rte_eth_dev_callback_process’ [-Werror=nested-externs]
cc1: all warnings being treated as errors
[949/2609] Compiling C object drivers/libtmp_rte_pmd_bnx2x.a.p/net_bnx2x_bnx2x_stats.c.o
[950/2609] Generating rte_pmd_bond.sym_chk with a meson_exe.py custom command
[951/2609] Compiling C object drivers/libtmp_rte_pmd_bnxt.a.p/net_bnxt_bnxt_ethdev.c.o
FAILED: drivers/libtmp_rte_pmd_bnxt.a.p/net_bnxt_bnxt_ethdev.c.o 
gcc -Idrivers/libtmp_rte_pmd_bnxt.a.p -Idrivers -I../drivers -Idrivers/net/bnxt -I../drivers/net/bnxt -I../drivers/net/bnxt/tf_ulp -I../drivers/net/bnxt/tf_core -Ilib/librte_ethdev -I../lib/librte_ethdev -I. -I.. -Iconfig -I../config -Ilib/librte_eal/include -I../lib/librte_eal/include -Ilib/librte_eal/linux/include -I../lib/librte_eal/linux/include -Ilib/librte_eal/x86/include -I../lib/librte_eal/x86/include -Ilib/librte_eal/common -I../lib/librte_eal/common -Ilib/librte_eal -I../lib/librte_eal -Ilib/librte_kvargs -I../lib/librte_kvargs -Ilib/librte_metrics -I../lib/librte_metrics -Ilib/librte_telemetry -I../lib/librte_telemetry -Ilib/librte_net -I../lib/librte_net -Ilib/librte_mbuf -I../lib/librte_mbuf -Ilib/librte_mempool -I../lib/librte_mempool -Ilib/librte_ring -I../lib/librte_ring -Ilib/librte_meter -I../lib/librte_meter -Idrivers/bus/pci -I../drivers/bus/pci -I../drivers/bus/pci/linux -Ilib/librte_pci -I../lib/librte_pci -Idrivers/bus/vdev -I../drivers/bus/vdev -fdiagnostics-color=always -pipe -D_FILE_OFFSET_BITS=64 -Wall -Winvalid-pch -Werror -O2 -g -include rte_config.h -Wextra -Wcast-qual -Wdeprecated -Wformat-nonliteral -Wformat-security -Wmissing-declarations -Wmissing-prototypes -Wnested-externs -Wold-style-definition -Wpointer-arith -Wsign-compare -Wstrict-prototypes -Wundef -Wwrite-strings -Wno-packed-not-aligned -Wno-missing-field-initializers -D_GNU_SOURCE -fPIC -march=native -mno-avx512f -DALLOW_EXPERIMENTAL_API -DALLOW_INTERNAL_API -Wno-format-truncation -MD -MQ drivers/libtmp_rte_pmd_bnxt.a.p/net_bnxt_bnxt_ethdev.c.o -MF drivers/libtmp_rte_pmd_bnxt.a.p/net_bnxt_bnxt_ethdev.c.o.d -o drivers/libtmp_rte_pmd_bnxt.a.p/net_bnxt_bnxt_ethdev.c.o -c ../drivers/net/bnxt/bnxt_ethdev.c
../drivers/net/bnxt/bnxt_ethdev.c: In function ‘bnxt_dev_recover’:
../drivers/net/bnxt/bnxt_ethdev.c:4569:2: error: implicit declaration of function ‘_rte_eth_dev_callback_process’; did you mean ‘rte_eth_dev_callback_process’? [-Werror=implicit-function-declaration]
  _rte_eth_dev_callback_process(bp->eth_dev,
  ^~~~~~~~~~~~~~~~~~~~~~~~~~~~~
  rte_eth_dev_callback_process
../drivers/net/bnxt/bnxt_ethdev.c:4569:2: error: nested extern declaration of ‘_rte_eth_dev_callback_process’ [-Werror=nested-externs]
cc1: all warnings being treated as errors
[952/2609] Compiling C object drivers/libtmp_rte_pmd_bnx2x.a.p/net_bnx2x_elink.c.o
[953/2609] Compiling C object drivers/libtmp_rte_pmd_bnx2x.a.p/net_bnx2x_bnx2x.c.o
ninja: build stopped: subcommand failed




*Build Failed #6:
OS: FC32-64
Target: x86_64-native-linuxapp-gcc
FAILED: drivers/libtmp_rte_pmd_bnxt.a.p/net_bnxt_bnxt_cpr.c.o 
gcc -Idrivers/libtmp_rte_pmd_bnxt.a.p -Idrivers -I../drivers -Idrivers/net/bnxt -I../drivers/net/bnxt -I../drivers/net/bnxt/tf_ulp -I../drivers/net/bnxt/tf_core -Ilib/librte_ethdev -I../lib/librte_ethdev -I. -I.. -Iconfig -I../config -Ilib/librte_eal/include -I../lib/librte_eal/include -Ilib/librte_eal/linux/include -I../lib/librte_eal/linux/include -Ilib/librte_eal/x86/include -I../lib/librte_eal/x86/include -Ilib/librte_eal/common -I../lib/librte_eal/common -Ilib/librte_eal -I../lib/librte_eal -Ilib/librte_kvargs -I../lib/librte_kvargs -Ilib/librte_metrics -I../lib/librte_metrics -Ilib/librte_telemetry -I../lib/librte_telemetry -Ilib/librte_net -I../lib/librte_net -Ilib/librte_mbuf -I../lib/librte_mbuf -Ilib/librte_mempool -I../lib/librte_mempool -Ilib/librte_ring -I../lib/librte_ring -Ilib/librte_meter -I../lib/librte_meter -Idrivers/bus/pci -I../drivers/bus/pci -I../drivers/bus/pci/linux -Ilib/librte_pci -I../lib/librte_pci -Idrivers/bus/vdev -I../drivers/bus/vdev -fdiagnostics-color=always -pipe -D_FILE_OFFSET_BITS=64 -Wall -Winvalid-pch -Werror -O3 -include rte_config.h -Wextra -Wcast-qual -Wdeprecated -Wformat-nonliteral -Wformat-security -Wmissing-declarations -Wmissing-prototypes -Wnested-externs -Wold-style-definition -Wpointer-arith -Wsign-compare -Wstrict-prototypes -Wundef -Wwrite-strings -Wno-address-of-packed-member -Wno-packed-not-aligned -Wno-missing-field-initializers -Wno-zero-length-bounds -D_GNU_SOURCE -fPIC -march=native -DALLOW_EXPERIMENTAL_API -DALLOW_INTERNAL_API -Wno-format-truncation -MD -MQ drivers/libtmp_rte_pmd_bnxt.a.p/net_bnxt_bnxt_cpr.c.o -MF drivers/libtmp_rte_pmd_bnxt.a.p/net_bnxt_bnxt_cpr.c.o.d -o drivers/libtmp_rte_pmd_bnxt.a.p/net_bnxt_bnxt_cpr.c.o -c ../drivers/net/bnxt/bnxt_cpr.c
../drivers/net/bnxt/bnxt_cpr.c: In function ‘bnxt_handle_async_event’:
../drivers/net/bnxt/bnxt_cpr.c:132:3: error: implicit declaration of function ‘_rte_eth_dev_callback_process’; did you mean ‘rte_eth_dev_callback_process’? [-Werror=implicit-function-declaration]
  132 |   _rte_eth_dev_callback_process(bp->eth_dev,
      |   ^~~~~~~~~~~~~~~~~~~~~~~~~~~~~
      |   rte_eth_dev_callback_process
../drivers/net/bnxt/bnxt_cpr.c:132:3: error: nested extern declaration of ‘_rte_eth_dev_callback_process’ [-Werror=nested-externs]
cc1: all warnings being treated as errors
[940/2610] Compiling C object drivers/libtmp_rte_pmd_bnxt.a.p/net_bnxt_bnxt_filter.c.o
[941/2610] Compiling C object drivers/libtmp_rte_pmd_bond.a.p/net_bonding_rte_eth_bond_args.c.o
[942/2610] Compiling C object drivers/libtmp_rte_pmd_bond.a.p/net_bonding_rte_eth_bond_alb.c.o
[943/2610] Compiling C object drivers/libtmp_rte_pmd_bond.a.p/net_bonding_rte_eth_bond_pmd.c.o
[944/2610] Compiling C object drivers/libtmp_rte_pmd_bnx2x.a.p/net_bnx2x_bnx2x_stats.c.o
[945/2610] Compiling C object drivers/libtmp_rte_pmd_bnxt.a.p/net_bnxt_bnxt_flow.c.o
[946/2610] Compiling C object drivers/libtmp_rte_pmd_bond.a.p/net_bonding_rte_eth_bond_8023ad.c.o
[947/2610] Compiling C object drivers/libtmp_rte_pmd_bnxt.a.p/net_bnxt_bnxt_ethdev.c.o
FAILED: drivers/libtmp_rte_pmd_bnxt.a.p/net_bnxt_bnxt_ethdev.c.o 
gcc -Idrivers/libtmp_rte_pmd_bnxt.a.p -Idrivers -I../drivers -Idrivers/net/bnxt -I../drivers/net/bnxt -I../drivers/net/bnxt/tf_ulp -I../drivers/net/bnxt/tf_core -Ilib/librte_ethdev -I../lib/librte_ethdev -I. -I.. -Iconfig -I../config -Ilib/librte_eal/include -I../lib/librte_eal/include -Ilib/librte_eal/linux/include -I../lib/librte_eal/linux/include -Ilib/librte_eal/x86/include -I../lib/librte_eal/x86/include -Ilib/librte_eal/common -I../lib/librte_eal/common -Ilib/librte_eal -I../lib/librte_eal -Ilib/librte_kvargs -I../lib/librte_kvargs -Ilib/librte_metrics -I../lib/librte_metrics -Ilib/librte_telemetry -I../lib/librte_telemetry -Ilib/librte_net -I../lib/librte_net -Ilib/librte_mbuf -I../lib/librte_mbuf -Ilib/librte_mempool -I../lib/librte_mempool -Ilib/librte_ring -I../lib/librte_ring -Ilib/librte_meter -I../lib/librte_meter -Idrivers/bus/pci -I../drivers/bus/pci -I../drivers/bus/pci/linux -Ilib/librte_pci -I../lib/librte_pci -Idrivers/bus/vdev -I../drivers/bus/vdev -fdiagnostics-color=always -pipe -D_FILE_OFFSET_BITS=64 -Wall -Winvalid-pch -Werror -O3 -include rte_config.h -Wextra -Wcast-qual -Wdeprecated -Wformat-nonliteral -Wformat-security -Wmissing-declarations -Wmissing-prototypes -Wnested-externs -Wold-style-definition -Wpointer-arith -Wsign-compare -Wstrict-prototypes -Wundef -Wwrite-strings -Wno-address-of-packed-member -Wno-packed-not-aligned -Wno-missing-field-initializers -Wno-zero-length-bounds -D_GNU_SOURCE -fPIC -march=native -DALLOW_EXPERIMENTAL_API -DALLOW_INTERNAL_API -Wno-format-truncation -MD -MQ drivers/libtmp_rte_pmd_bnxt.a.p/net_bnxt_bnxt_ethdev.c.o -MF drivers/libtmp_rte_pmd_bnxt.a.p/net_bnxt_bnxt_ethdev.c.o.d -o drivers/libtmp_rte_pmd_bnxt.a.p/net_bnxt_bnxt_ethdev.c.o -c ../drivers/net/bnxt/bnxt_ethdev.c
../drivers/net/bnxt/bnxt_ethdev.c: In function ‘bnxt_dev_recover’:
../drivers/net/bnxt/bnxt_ethdev.c:4569:2: error: implicit declaration of function ‘_rte_eth_dev_callback_process’; did you mean ‘rte_eth_dev_callback_process’? [-Werror=implicit-function-declaration]
 4569 |  _rte_eth_dev_callback_process(bp->eth_dev,
      |  ^~~~~~~~~~~~~~~~~~~~~~~~~~~~~
      |  rte_eth_dev_callback_process
../drivers/net/bnxt/bnxt_ethdev.c:4569:2: error: nested extern declaration of ‘_rte_eth_dev_callback_process’ [-Werror=nested-externs]
cc1: all warnings being treated as errors
[948/2610] Compiling C object drivers/libtmp_rte_pmd_bnx2x.a.p/net_bnx2x_bnx2x.c.o
[949/2610] Compiling C object drivers/libtmp_rte_pmd_bnxt.a.p/net_bnxt_bnxt_hwrm.c.o
[950/2610] Compiling C object drivers/libtmp_rte_pmd_bnx2x.a.p/net_bnx2x_elink.c.o
ninja: build stopped: subcommand failed




*Build Failed #7:
OS: FC32-64
Target: x86_64-native-linuxapp-clang
FAILED: drivers/libtmp_rte_pmd_bnxt.a.p/net_bnxt_bnxt_cpr.c.o 
clang -Idrivers/libtmp_rte_pmd_bnxt.a.p -Idrivers -I../drivers -Idrivers/net/bnxt -I../drivers/net/bnxt -I../drivers/net/bnxt/tf_ulp -I../drivers/net/bnxt/tf_core -Ilib/librte_ethdev -I../lib/librte_ethdev -I. -I.. -Iconfig -I../config -Ilib/librte_eal/include -I../lib/librte_eal/include -Ilib/librte_eal/linux/include -I../lib/librte_eal/linux/include -Ilib/librte_eal/x86/include -I../lib/librte_eal/x86/include -Ilib/librte_eal/common -I../lib/librte_eal/common -Ilib/librte_eal -I../lib/librte_eal -Ilib/librte_kvargs -I../lib/librte_kvargs -Ilib/librte_metrics -I../lib/librte_metrics -Ilib/librte_telemetry -I../lib/librte_telemetry -Ilib/librte_net -I../lib/librte_net -Ilib/librte_mbuf -I../lib/librte_mbuf -Ilib/librte_mempool -I../lib/librte_mempool -Ilib/librte_ring -I../lib/librte_ring -Ilib/librte_meter -I../lib/librte_meter -Idrivers/bus/pci -I../drivers/bus/pci -I../drivers/bus/pci/linux -Ilib/librte_pci -I../lib/librte_pci -Idrivers/bus/vdev -I../drivers/bus/vdev -Xclang -fcolor-diagnostics -pipe -D_FILE_OFFSET_BITS=64 -Wall -Winvalid-pch -Werror -O3 -include rte_config.h -Wextra -Wcast-qual -Wdeprecated -Wformat-nonliteral -Wformat-security -Wmissing-declarations -Wmissing-prototypes -Wnested-externs -Wold-style-definition -Wpointer-arith -Wsign-compare -Wstrict-prototypes -Wundef -Wwrite-strings -Wno-address-of-packed-member -Wno-missing-field-initializers -D_GNU_SOURCE -fPIC -march=native -DALLOW_EXPERIMENTAL_API -DALLOW_INTERNAL_API -MD -MQ drivers/libtmp_rte_pmd_bnxt.a.p/net_bnxt_bnxt_cpr.c.o -MF drivers/libtmp_rte_pmd_bnxt.a.p/net_bnxt_bnxt_cpr.c.o.d -o drivers/libtmp_rte_pmd_bnxt.a.p/net_bnxt_bnxt_cpr.c.o -c ../drivers/net/bnxt/bnxt_cpr.c
../drivers/net/bnxt/bnxt_cpr.c:132:3: error: implicit declaration of function '_rte_eth_dev_callback_process' is invalid in C99 [-Werror,-Wimplicit-function-declaration]
                _rte_eth_dev_callback_process(bp->eth_dev,
                ^
../drivers/net/bnxt/bnxt_cpr.c:132:3: note: did you mean 'rte_eth_dev_callback_process'?
../lib/librte_ethdev/rte_ethdev_driver.h:844:5: note: 'rte_eth_dev_callback_process' declared here
int rte_eth_dev_callback_process(struct rte_eth_dev *dev,
    ^
1 error generated.
[941/2610] Compiling C object drivers/libtmp_rte_pmd_bnxt.a.p/net_bnxt_bnxt_ethdev.c.o
FAILED: drivers/libtmp_rte_pmd_bnxt.a.p/net_bnxt_bnxt_ethdev.c.o 
clang -Idrivers/libtmp_rte_pmd_bnxt.a.p -Idrivers -I../drivers -Idrivers/net/bnxt -I../drivers/net/bnxt -I../drivers/net/bnxt/tf_ulp -I../drivers/net/bnxt/tf_core -Ilib/librte_ethdev -I../lib/librte_ethdev -I. -I.. -Iconfig -I../config -Ilib/librte_eal/include -I../lib/librte_eal/include -Ilib/librte_eal/linux/include -I../lib/librte_eal/linux/include -Ilib/librte_eal/x86/include -I../lib/librte_eal/x86/include -Ilib/librte_eal/common -I../lib/librte_eal/common -Ilib/librte_eal -I../lib/librte_eal -Ilib/librte_kvargs -I../lib/librte_kvargs -Ilib/librte_metrics -I../lib/librte_metrics -Ilib/librte_telemetry -I../lib/librte_telemetry -Ilib/librte_net -I../lib/librte_net -Ilib/librte_mbuf -I../lib/librte_mbuf -Ilib/librte_mempool -I../lib/librte_mempool -Ilib/librte_ring -I../lib/librte_ring -Ilib/librte_meter -I../lib/librte_meter -Idrivers/bus/pci -I../drivers/bus/pci -I../drivers/bus/pci/linux -Ilib/librte_pci -I../lib/librte_pci -Idrivers/bus/vdev -I../drivers/bus/vdev -Xclang -fcolor-diagnostics -pipe -D_FILE_OFFSET_BITS=64 -Wall -Winvalid-pch -Werror -O3 -include rte_config.h -Wextra -Wcast-qual -Wdeprecated -Wformat-nonliteral -Wformat-security -Wmissing-declarations -Wmissing-prototypes -Wnested-externs -Wold-style-definition -Wpointer-arith -Wsign-compare -Wstrict-prototypes -Wundef -Wwrite-strings -Wno-address-of-packed-member -Wno-missing-field-initializers -D_GNU_SOURCE -fPIC -march=native -DALLOW_EXPERIMENTAL_API -DALLOW_INTERNAL_API -MD -MQ drivers/libtmp_rte_pmd_bnxt.a.p/net_bnxt_bnxt_ethdev.c.o -MF drivers/libtmp_rte_pmd_bnxt.a.p/net_bnxt_bnxt_ethdev.c.o.d -o drivers/libtmp_rte_pmd_bnxt.a.p/net_bnxt_bnxt_ethdev.c.o -c ../drivers/net/bnxt/bnxt_ethdev.c
../drivers/net/bnxt/bnxt_ethdev.c:4569:2: error: implicit declaration of function '_rte_eth_dev_callback_process' is invalid in C99 [-Werror,-Wimplicit-function-declaration]
        _rte_eth_dev_callback_process(bp->eth_dev,
        ^
../drivers/net/bnxt/bnxt_ethdev.c:4569:2: note: did you mean 'rte_eth_dev_callback_process'?
../lib/librte_ethdev/rte_ethdev_driver.h:844:5: note: 'rte_eth_dev_callback_process' declared here
int rte_eth_dev_callback_process(struct rte_eth_dev *dev,
    ^
../drivers/net/bnxt/bnxt_ethdev.c:4717:2: error: implicit declaration of function '_rte_eth_dev_callback_process' is invalid in C99 [-Werror,-Wimplicit-function-declaration]
        _rte_eth_dev_callback_process(bp->eth_dev,
        ^
2 errors generated.
[942/2610] Compiling C object drivers/libtmp_rte_pmd_bond.a.p/net_bonding_rte_eth_bond_8023ad.c.o
[943/2610] Compiling C object drivers/libtmp_rte_pmd_bond.a.p/net_bonding_rte_eth_bond_pmd.c.o
[944/2610] Compiling C object drivers/libtmp_rte_pmd_bnxt.a.p/net_bnxt_bnxt_irq.c.o
[945/2610] Compiling C object drivers/libtmp_rte_pmd_bnx2x.a.p/net_bnx2x_bnx2x_stats.c.o
[946/2610] Compiling C object drivers/libtmp_rte_pmd_bnxt.a.p/net_bnxt_bnxt_flow.c.o
[947/2610] Compiling C object drivers/libtmp_rte_pmd_bnx2x.a.p/net_bnx2x_elink.c.o
[948/2610] Compiling C object drivers/libtmp_rte_pmd_bnxt.a.p/net_bnxt_bnxt_hwrm.c.o
[949/2610] Compiling C object drivers/libtmp_rte_pmd_bnx2x.a.p/net_bnx2x_bnx2x.c.o
ninja: build stopped: subcommand failed




*Build Failed #8:
OS: FreeBSD1201-64
Target: x86_64-native-bsdapp-gcc
FAILED: drivers/libtmp_rte_pmd_bnxt.a.p/net_bnxt_bnxt_cpr.c.o 
gcc -Idrivers/libtmp_rte_pmd_bnxt.a.p -Idrivers -I../drivers -Idrivers/net/bnxt -I../drivers/net/bnxt -I../drivers/net/bnxt/tf_ulp -I../drivers/net/bnxt/tf_core -Ilib/librte_ethdev -I../lib/librte_ethdev -I. -I.. -Iconfig -I../config -Ilib/librte_eal/include -I../lib/librte_eal/include -Ilib/librte_eal/freebsd/include -I../lib/librte_eal/freebsd/include -Ilib/librte_eal/x86/include -I../lib/librte_eal/x86/include -Ilib/librte_eal/common -I../lib/librte_eal/common -Ilib/librte_eal -I../lib/librte_eal -Ilib/librte_kvargs -I../lib/librte_kvargs -Ilib/librte_metrics -I../lib/librte_metrics -Ilib/librte_telemetry -I../lib/librte_telemetry -Ilib/librte_net -I../lib/librte_net -Ilib/librte_mbuf -I../lib/librte_mbuf -Ilib/librte_mempool -I../lib/librte_mempool -Ilib/librte_ring -I../lib/librte_ring -Ilib/librte_meter -I../lib/librte_meter -Idrivers/bus/pci -I../drivers/bus/pci -I../drivers/bus/pci/bsd -Ilib/librte_pci -I../lib/librte_pci -Idrivers/bus/vdev -I../drivers/bus/vdev -fdiagnostics-color=always -pipe -D_FILE_OFFSET_BITS=64 -Wall -Winvalid-pch -Werror -O3 -include rte_config.h -Wextra -Wcast-qual -Wdeprecated -Wformat-nonliteral -Wformat-security -Wmissing-declarations -Wmissing-prototypes -Wnested-externs -Wold-style-definition -Wpointer-arith -Wsign-compare -Wstrict-prototypes -Wundef -Wwrite-strings -Wno-address-of-packed-member -Wno-packed-not-aligned -Wno-missing-field-initializers -D_GNU_SOURCE -D__BSD_VISIBLE -fPIC -march=native -mno-avx512f -DALLOW_EXPERIMENTAL_API -DALLOW_INTERNAL_API -Wno-format-truncation -MD -MQ drivers/libtmp_rte_pmd_bnxt.a.p/net_bnxt_bnxt_cpr.c.o -MF drivers/libtmp_rte_pmd_bnxt.a.p/net_bnxt_bnxt_cpr.c.o.d -o drivers/libtmp_rte_pmd_bnxt.a.p/net_bnxt_bnxt_cpr.c.o -c ../drivers/net/bnxt/bnxt_cpr.c
../drivers/net/bnxt/bnxt_cpr.c: In function 'bnxt_handle_async_event':
../drivers/net/bnxt/bnxt_cpr.c:132:3: error: implicit declaration of function '_rte_eth_dev_callback_process'; did you mean 'rte_eth_dev_callback_process'? [-Werror=implicit-function-declaration]
  132 |   _rte_eth_dev_callback_process(bp->eth_dev,
      |   ^~~~~~~~~~~~~~~~~~~~~~~~~~~~~
      |   rte_eth_dev_callback_process
../drivers/net/bnxt/bnxt_cpr.c:132:3: error: nested extern declaration of '_rte_eth_dev_callback_process' [-Werror=nested-externs]
cc1: all warnings being treated as errors
[762/1946] Generating rte_common_sfc_efx.sym_chk with a meson_exe.py custom command
[763/1946] Compiling C object drivers/libtmp_rte_pmd_bnx2x.a.p/net_bnx2x_ecore_sp.c.o
[764/1946] Compiling C object drivers/libtmp_rte_pmd_bnx2x.a.p/net_bnx2x_bnx2x.c.o
[765/1946] Compiling C object drivers/libtmp_rte_pmd_bnxt.a.p/net_bnxt_bnxt_ethdev.c.o
FAILED: drivers/libtmp_rte_pmd_bnxt.a.p/net_bnxt_bnxt_ethdev.c.o 
gcc -Idrivers/libtmp_rte_pmd_bnxt.a.p -Idrivers -I../drivers -Idrivers/net/bnxt -I../drivers/net/bnxt -I../drivers/net/bnxt/tf_ulp -I../drivers/net/bnxt/tf_core -Ilib/librte_ethdev -I../lib/librte_ethdev -I. -I.. -Iconfig -I../config -Ilib/librte_eal/include -I../lib/librte_eal/include -Ilib/librte_eal/freebsd/include -I../lib/librte_eal/freebsd/include -Ilib/librte_eal/x86/include -I../lib/librte_eal/x86/include -Ilib/librte_eal/common -I../lib/librte_eal/common -Ilib/librte_eal -I../lib/librte_eal -Ilib/librte_kvargs -I../lib/librte_kvargs -Ilib/librte_metrics -I../lib/librte_metrics -Ilib/librte_telemetry -I../lib/librte_telemetry -Ilib/librte_net -I../lib/librte_net -Ilib/librte_mbuf -I../lib/librte_mbuf -Ilib/librte_mempool -I../lib/librte_mempool -Ilib/librte_ring -I../lib/librte_ring -Ilib/librte_meter -I../lib/librte_meter -Idrivers/bus/pci -I../drivers/bus/pci -I../drivers/bus/pci/bsd -Ilib/librte_pci -I../lib/librte_pci -Idrivers/bus/vdev -I../drivers/bus/vdev -fdiagnostics-color=always -pipe -D_FILE_OFFSET_BITS=64 -Wall -Winvalid-pch -Werror -O3 -include rte_config.h -Wextra -Wcast-qual -Wdeprecated -Wformat-nonliteral -Wformat-security -Wmissing-declarations -Wmissing-prototypes -Wnested-externs -Wold-style-definition -Wpointer-arith -Wsign-compare -Wstrict-prototypes -Wundef -Wwrite-strings -Wno-address-of-packed-member -Wno-packed-not-aligned -Wno-missing-field-initializers -D_GNU_SOURCE -D__BSD_VISIBLE -fPIC -march=native -mno-avx512f -DALLOW_EXPERIMENTAL_API -DALLOW_INTERNAL_API -Wno-format-truncation -MD -MQ drivers/libtmp_rte_pmd_bnxt.a.p/net_bnxt_bnxt_ethdev.c.o -MF drivers/libtmp_rte_pmd_bnxt.a.p/net_bnxt_bnxt_ethdev.c.o.d -o drivers/libtmp_rte_pmd_bnxt.a.p/net_bnxt_bnxt_ethdev.c.o -c ../drivers/net/bnxt/bnxt_ethdev.c
../drivers/net/bnxt/bnxt_ethdev.c: In function 'bnxt_dev_recover':
../drivers/net/bnxt/bnxt_ethdev.c:4569:2: error: implicit declaration of function '_rte_eth_dev_callback_process'; did you mean 'rte_eth_dev_callback_process'? [-Werror=implicit-function-declaration]
 4569 |  _rte_eth_dev_callback_process(bp->eth_dev,
      |  ^~~~~~~~~~~~~~~~~~~~~~~~~~~~~
      |  rte_eth_dev_callback_process
../drivers/net/bnxt/bnxt_ethdev.c:4569:2: error: nested extern declaration of '_rte_eth_dev_callback_process' [-Werror=nested-externs]
cc1: all warnings being treated as errors
[766/1946] Compiling C object drivers/libtmp_rte_pmd_bnx2x.a.p/net_bnx2x_elink.c.o
ninja: build stopped: subcommand failed




*Build Failed #9:
OS: FreeBSD1201-64
Target: x86_64-native-bsdapp-clang
FAILED: drivers/libtmp_rte_pmd_bnxt.a.p/net_bnxt_bnxt_cpr.c.o 
clang -Idrivers/libtmp_rte_pmd_bnxt.a.p -Idrivers -I../drivers -Idrivers/net/bnxt -I../drivers/net/bnxt -I../drivers/net/bnxt/tf_ulp -I../drivers/net/bnxt/tf_core -Ilib/librte_ethdev -I../lib/librte_ethdev -I. -I.. -Iconfig -I../config -Ilib/librte_eal/include -I../lib/librte_eal/include -Ilib/librte_eal/freebsd/include -I../lib/librte_eal/freebsd/include -Ilib/librte_eal/x86/include -I../lib/librte_eal/x86/include -Ilib/librte_eal/common -I../lib/librte_eal/common -Ilib/librte_eal -I../lib/librte_eal -Ilib/librte_kvargs -I../lib/librte_kvargs -Ilib/librte_metrics -I../lib/librte_metrics -Ilib/librte_telemetry -I../lib/librte_telemetry -Ilib/librte_net -I../lib/librte_net -Ilib/librte_mbuf -I../lib/librte_mbuf -Ilib/librte_mempool -I../lib/librte_mempool -Ilib/librte_ring -I../lib/librte_ring -Ilib/librte_meter -I../lib/librte_meter -Idrivers/bus/pci -I../drivers/bus/pci -I../drivers/bus/pci/bsd -Ilib/librte_pci -I../lib/librte_pci -Idrivers/bus/vdev -I../drivers/bus/vdev -Xclang -fcolor-diagnostics -pipe -D_FILE_OFFSET_BITS=64 -Wall -Winvalid-pch -Werror -O3 -include rte_config.h -Wextra -Wcast-qual -Wdeprecated -Wformat-nonliteral -Wformat-security -Wmissing-declarations -Wmissing-prototypes -Wnested-externs -Wold-style-definition -Wpointer-arith -Wsign-compare -Wstrict-prototypes -Wundef -Wwrite-strings -Wno-address-of-packed-member -Wno-missing-field-initializers -D_GNU_SOURCE -D__BSD_VISIBLE -fPIC -march=native -mno-avx512f -DALLOW_EXPERIMENTAL_API -DALLOW_INTERNAL_API -MD -MQ drivers/libtmp_rte_pmd_bnxt.a.p/net_bnxt_bnxt_cpr.c.o -MF drivers/libtmp_rte_pmd_bnxt.a.p/net_bnxt_bnxt_cpr.c.o.d -o drivers/libtmp_rte_pmd_bnxt.a.p/net_bnxt_bnxt_cpr.c.o -c ../drivers/net/bnxt/bnxt_cpr.c
../drivers/net/bnxt/bnxt_cpr.c:132:3: error: implicit declaration of function '_rte_eth_dev_callback_process' is invalid in C99 [-Werror,-Wimplicit-function-declaration]
                _rte_eth_dev_callback_process(bp->eth_dev,
                ^
../drivers/net/bnxt/bnxt_cpr.c:132:3: note: did you mean 'rte_eth_dev_callback_process'?
../lib/librte_ethdev/rte_ethdev_driver.h:844:5: note: 'rte_eth_dev_callback_process' declared here
int rte_eth_dev_callback_process(struct rte_eth_dev *dev,
    ^
../drivers/net/bnxt/bnxt_cpr.c:132:3: error: this function declaration is not a prototype [-Werror,-Wstrict-prototypes]
                _rte_eth_dev_callback_process(bp->eth_dev,
                ^
2 errors generated.
[766/1946] Compiling C object drivers/libtmp_rte_pmd_bnxt.a.p/net_bnxt_bnxt_ethdev.c.o
FAILED: drivers/libtmp_rte_pmd_bnxt.a.p/net_bnxt_bnxt_ethdev.c.o 
clang -Idrivers/libtmp_rte_pmd_bnxt.a.p -Idrivers -I../drivers -Idrivers/net/bnxt -I../drivers/net/bnxt -I../drivers/net/bnxt/tf_ulp -I../drivers/net/bnxt/tf_core -Ilib/librte_ethdev -I../lib/librte_ethdev -I. -I.. -Iconfig -I../config -Ilib/librte_eal/include -I../lib/librte_eal/include -Ilib/librte_eal/freebsd/include -I../lib/librte_eal/freebsd/include -Ilib/librte_eal/x86/include -I../lib/librte_eal/x86/include -Ilib/librte_eal/common -I../lib/librte_eal/common -Ilib/librte_eal -I../lib/librte_eal -Ilib/librte_kvargs -I../lib/librte_kvargs -Ilib/librte_metrics -I../lib/librte_metrics -Ilib/librte_telemetry -I../lib/librte_telemetry -Ilib/librte_net -I../lib/librte_net -Ilib/librte_mbuf -I../lib/librte_mbuf -Ilib/librte_mempool -I../lib/librte_mempool -Ilib/librte_ring -I../lib/librte_ring -Ilib/librte_meter -I../lib/librte_meter -Idrivers/bus/pci -I../drivers/bus/pci -I../drivers/bus/pci/bsd -Ilib/librte_pci -I../lib/librte_pci -Idrivers/bus/vdev -I../drivers/bus/vdev -Xclang -fcolor-diagnostics -pipe -D_FILE_OFFSET_BITS=64 -Wall -Winvalid-pch -Werror -O3 -include rte_config.h -Wextra -Wcast-qual -Wdeprecated -Wformat-nonliteral -Wformat-security -Wmissing-declarations -Wmissing-prototypes -Wnested-externs -Wold-style-definition -Wpointer-arith -Wsign-compare -Wstrict-prototypes -Wundef -Wwrite-strings -Wno-address-of-packed-member -Wno-missing-field-initializers -D_GNU_SOURCE -D__BSD_VISIBLE -fPIC -march=native -mno-avx512f -DALLOW_EXPERIMENTAL_API -DALLOW_INTERNAL_API -MD -MQ drivers/libtmp_rte_pmd_bnxt.a.p/net_bnxt_bnxt_ethdev.c.o -MF drivers/libtmp_rte_pmd_bnxt.a.p/net_bnxt_bnxt_ethdev.c.o.d -o drivers/libtmp_rte_pmd_bnxt.a.p/net_bnxt_bnxt_ethdev.c.o -c ../drivers/net/bnxt/bnxt_ethdev.c
../drivers/net/bnxt/bnxt_ethdev.c:4569:2: error: implicit declaration of function '_rte_eth_dev_callback_process' is invalid in C99 [-Werror,-Wimplicit-function-declaration]
        _rte_eth_dev_callback_process(bp->eth_dev,
        ^
../drivers/net/bnxt/bnxt_ethdev.c:4569:2: note: did you mean 'rte_eth_dev_callback_process'?
../lib/librte_ethdev/rte_ethdev_driver.h:844:5: note: 'rte_eth_dev_callback_process' declared here
int rte_eth_dev_callback_process(struct rte_eth_dev *dev,
    ^
../drivers/net/bnxt/bnxt_ethdev.c:4569:2: error: this function declaration is not a prototype [-Werror,-Wstrict-prototypes]
        _rte_eth_dev_callback_process(bp->eth_dev,
        ^
../drivers/net/bnxt/bnxt_ethdev.c:4717:2: error: implicit declaration of function '_rte_eth_dev_callback_process' is invalid in C99 [-Werror,-Wimplicit-function-declaration]
        _rte_eth_dev_callback_process(bp->eth_dev,
        ^
3 errors generated.
[767/1946] Compiling C object drivers/libtmp_rte_pmd_bnxt.a.p/net_bnxt_bnxt_filter.c.o
[768/1946] Compiling C object drivers/libtmp_rte_pmd_bnxt.a.p/net_bnxt_bnxt_flow.c.o
[769/1946] Compiling C object drivers/libtmp_rte_pmd_bnx2x.a.p/net_bnx2x_bnx2x.c.o
[770/1946] Compiling C object drivers/libtmp_rte_pmd_bnx2x.a.p/net_bnx2x_elink.c.o
ninja: build stopped: subcommand failed




*Build Failed #10:
OS: FreeBSD1201-64
Target: x86_64-native-bsdapp-gcc+shared
FAILED: drivers/libtmp_rte_pmd_bnxt.a.p/net_bnxt_bnxt_cpr.c.o 
gcc -Idrivers/libtmp_rte_pmd_bnxt.a.p -Idrivers -I../drivers -Idrivers/net/bnxt -I../drivers/net/bnxt -I../drivers/net/bnxt/tf_ulp -I../drivers/net/bnxt/tf_core -Ilib/librte_ethdev -I../lib/librte_ethdev -I. -I.. -Iconfig -I../config -Ilib/librte_eal/include -I../lib/librte_eal/include -Ilib/librte_eal/freebsd/include -I../lib/librte_eal/freebsd/include -Ilib/librte_eal/x86/include -I../lib/librte_eal/x86/include -Ilib/librte_eal/common -I../lib/librte_eal/common -Ilib/librte_eal -I../lib/librte_eal -Ilib/librte_kvargs -I../lib/librte_kvargs -Ilib/librte_metrics -I../lib/librte_metrics -Ilib/librte_telemetry -I../lib/librte_telemetry -Ilib/librte_net -I../lib/librte_net -Ilib/librte_mbuf -I../lib/librte_mbuf -Ilib/librte_mempool -I../lib/librte_mempool -Ilib/librte_ring -I../lib/librte_ring -Ilib/librte_meter -I../lib/librte_meter -Idrivers/bus/pci -I../drivers/bus/pci -I../drivers/bus/pci/bsd -Ilib/librte_pci -I../lib/librte_pci -Idrivers/bus/vdev -I../drivers/bus/vdev -fdiagnostics-color=always -pipe -D_FILE_OFFSET_BITS=64 -Wall -Winvalid-pch -Werror -O3 -include rte_config.h -Wextra -Wcast-qual -Wdeprecated -Wformat-nonliteral -Wformat-security -Wmissing-declarations -Wmissing-prototypes -Wnested-externs -Wold-style-definition -Wpointer-arith -Wsign-compare -Wstrict-prototypes -Wundef -Wwrite-strings -Wno-address-of-packed-member -Wno-packed-not-aligned -Wno-missing-field-initializers -D_GNU_SOURCE -D__BSD_VISIBLE -fPIC -march=native -mno-avx512f -DALLOW_EXPERIMENTAL_API -DALLOW_INTERNAL_API -Wno-format-truncation -MD -MQ drivers/libtmp_rte_pmd_bnxt.a.p/net_bnxt_bnxt_cpr.c.o -MF drivers/libtmp_rte_pmd_bnxt.a.p/net_bnxt_bnxt_cpr.c.o.d -o drivers/libtmp_rte_pmd_bnxt.a.p/net_bnxt_bnxt_cpr.c.o -c ../drivers/net/bnxt/bnxt_cpr.c
../drivers/net/bnxt/bnxt_cpr.c: In function 'bnxt_handle_async_event':
../drivers/net/bnxt/bnxt_cpr.c:132:3: error: implicit declaration of function '_rte_eth_dev_callback_process'; did you mean 'rte_eth_dev_callback_process'? [-Werror=implicit-function-declaration]
  132 |   _rte_eth_dev_callback_process(bp->eth_dev,
      |   ^~~~~~~~~~~~~~~~~~~~~~~~~~~~~
      |   rte_eth_dev_callback_process
../drivers/net/bnxt/bnxt_cpr.c:132:3: error: nested extern declaration of '_rte_eth_dev_callback_process' [-Werror=nested-externs]
cc1: all warnings being treated as errors
[785/1826] Linking target drivers/librte_common_sfc_efx.so.21.0
[786/1826] Compiling C object drivers/libtmp_rte_pmd_bnxt.a.p/net_bnxt_bnxt_filter.c.o
[787/1826] Compiling C object drivers/libtmp_rte_pmd_bnxt.a.p/net_bnxt_bnxt_flow.c.o
[788/1826] Compiling C object drivers/libtmp_rte_pmd_bnxt.a.p/net_bnxt_bnxt_ethdev.c.o
FAILED: drivers/libtmp_rte_pmd_bnxt.a.p/net_bnxt_bnxt_ethdev.c.o 
gcc -Idrivers/libtmp_rte_pmd_bnxt.a.p -Idrivers -I../drivers -Idrivers/net/bnxt -I../drivers/net/bnxt -I../drivers/net/bnxt/tf_ulp -I../drivers/net/bnxt/tf_core -Ilib/librte_ethdev -I../lib/librte_ethdev -I. -I.. -Iconfig -I../config -Ilib/librte_eal/include -I../lib/librte_eal/include -Ilib/librte_eal/freebsd/include -I../lib/librte_eal/freebsd/include -Ilib/librte_eal/x86/include -I../lib/librte_eal/x86/include -Ilib/librte_eal/common -I../lib/librte_eal/common -Ilib/librte_eal -I../lib/librte_eal -Ilib/librte_kvargs -I../lib/librte_kvargs -Ilib/librte_metrics -I../lib/librte_metrics -Ilib/librte_telemetry -I../lib/librte_telemetry -Ilib/librte_net -I../lib/librte_net -Ilib/librte_mbuf -I../lib/librte_mbuf -Ilib/librte_mempool -I../lib/librte_mempool -Ilib/librte_ring -I../lib/librte_ring -Ilib/librte_meter -I../lib/librte_meter -Idrivers/bus/pci -I../drivers/bus/pci -I../drivers/bus/pci/bsd -Ilib/librte_pci -I../lib/librte_pci -Idrivers/bus/vdev -I../drivers/bus/vdev -fdiagnostics-color=always -pipe -D_FILE_OFFSET_BITS=64 -Wall -Winvalid-pch -Werror -O3 -include rte_config.h -Wextra -Wcast-qual -Wdeprecated -Wformat-nonliteral -Wformat-security -Wmissing-declarations -Wmissing-prototypes -Wnested-externs -Wold-style-definition -Wpointer-arith -Wsign-compare -Wstrict-prototypes -Wundef -Wwrite-strings -Wno-address-of-packed-member -Wno-packed-not-aligned -Wno-missing-field-initializers -D_GNU_SOURCE -D__BSD_VISIBLE -fPIC -march=native -mno-avx512f -DALLOW_EXPERIMENTAL_API -DALLOW_INTERNAL_API -Wno-format-truncation -MD -MQ drivers/libtmp_rte_pmd_bnxt.a.p/net_bnxt_bnxt_ethdev.c.o -MF drivers/libtmp_rte_pmd_bnxt.a.p/net_bnxt_bnxt_ethdev.c.o.d -o drivers/libtmp_rte_pmd_bnxt.a.p/net_bnxt_bnxt_ethdev.c.o -c ../drivers/net/bnxt/bnxt_ethdev.c
../drivers/net/bnxt/bnxt_ethdev.c: In function 'bnxt_dev_recover':
../drivers/net/bnxt/bnxt_ethdev.c:4569:2: error: implicit declaration of function '_rte_eth_dev_callback_process'; did you mean 'rte_eth_dev_callback_process'? [-Werror=implicit-function-declaration]
 4569 |  _rte_eth_dev_callback_process(bp->eth_dev,
      |  ^~~~~~~~~~~~~~~~~~~~~~~~~~~~~
      |  rte_eth_dev_callback_process
../drivers/net/bnxt/bnxt_ethdev.c:4569:2: error: nested extern declaration of '_rte_eth_dev_callback_process' [-Werror=nested-externs]
cc1: all warnings being treated as errors
[789/1826] Compiling C object drivers/libtmp_rte_pmd_bnx2x.a.p/net_bnx2x_elink.c.o
ninja: build stopped: subcommand failed




*Build Failed #11:
OS: FreeBSD1201-64
Target: x86_64-native-bsdapp-gcc+debug
FAILED: drivers/libtmp_rte_pmd_bnxt.a.p/net_bnxt_bnxt_cpr.c.o 
gcc -Idrivers/libtmp_rte_pmd_bnxt.a.p -Idrivers -I../drivers -Idrivers/net/bnxt -I../drivers/net/bnxt -I../drivers/net/bnxt/tf_ulp -I../drivers/net/bnxt/tf_core -Ilib/librte_ethdev -I../lib/librte_ethdev -I. -I.. -Iconfig -I../config -Ilib/librte_eal/include -I../lib/librte_eal/include -Ilib/librte_eal/freebsd/include -I../lib/librte_eal/freebsd/include -Ilib/librte_eal/x86/include -I../lib/librte_eal/x86/include -Ilib/librte_eal/common -I../lib/librte_eal/common -Ilib/librte_eal -I../lib/librte_eal -Ilib/librte_kvargs -I../lib/librte_kvargs -Ilib/librte_metrics -I../lib/librte_metrics -Ilib/librte_telemetry -I../lib/librte_telemetry -Ilib/librte_net -I../lib/librte_net -Ilib/librte_mbuf -I../lib/librte_mbuf -Ilib/librte_mempool -I../lib/librte_mempool -Ilib/librte_ring -I../lib/librte_ring -Ilib/librte_meter -I../lib/librte_meter -Idrivers/bus/pci -I../drivers/bus/pci -I../drivers/bus/pci/bsd -Ilib/librte_pci -I../lib/librte_pci -Idrivers/bus/vdev -I../drivers/bus/vdev -fdiagnostics-color=always -pipe -D_FILE_OFFSET_BITS=64 -Wall -Winvalid-pch -Werror -O2 -g -include rte_config.h -Wextra -Wcast-qual -Wdeprecated -Wformat-nonliteral -Wformat-security -Wmissing-declarations -Wmissing-prototypes -Wnested-externs -Wold-style-definition -Wpointer-arith -Wsign-compare -Wstrict-prototypes -Wundef -Wwrite-strings -Wno-address-of-packed-member -Wno-packed-not-aligned -Wno-missing-field-initializers -D_GNU_SOURCE -D__BSD_VISIBLE -fPIC -march=native -mno-avx512f -DALLOW_EXPERIMENTAL_API -DALLOW_INTERNAL_API -Wno-format-truncation -MD -MQ drivers/libtmp_rte_pmd_bnxt.a.p/net_bnxt_bnxt_cpr.c.o -MF drivers/libtmp_rte_pmd_bnxt.a.p/net_bnxt_bnxt_cpr.c.o.d -o drivers/libtmp_rte_pmd_bnxt.a.p/net_bnxt_bnxt_cpr.c.o -c ../drivers/net/bnxt/bnxt_cpr.c
../drivers/net/bnxt/bnxt_cpr.c: In function 'bnxt_handle_async_event':
../drivers/net/bnxt/bnxt_cpr.c:132:3: error: implicit declaration of function '_rte_eth_dev_callback_process'; did you mean 'rte_eth_dev_callback_process'? [-Werror=implicit-function-declaration]
  132 |   _rte_eth_dev_callback_process(bp->eth_dev,
      |   ^~~~~~~~~~~~~~~~~~~~~~~~~~~~~
      |   rte_eth_dev_callback_process
../drivers/net/bnxt/bnxt_cpr.c:132:3: error: nested extern declaration of '_rte_eth_dev_callback_process' [-Werror=nested-externs]
cc1: all warnings being treated as errors
[765/1946] Compiling C object drivers/libtmp_rte_pmd_bnx2x.a.p/net_bnx2x_ecore_sp.c.o
[766/1946] Compiling C object drivers/libtmp_rte_pmd_bnxt.a.p/net_bnxt_bnxt_filter.c.o
[767/1946] Compiling C object drivers/libtmp_rte_pmd_bnx2x.a.p/net_bnx2x_bnx2x.c.o
[768/1946] Compiling C object drivers/libtmp_rte_pmd_bnxt.a.p/net_bnxt_bnxt_ethdev.c.o
FAILED: drivers/libtmp_rte_pmd_bnxt.a.p/net_bnxt_bnxt_ethdev.c.o 
gcc -Idrivers/libtmp_rte_pmd_bnxt.a.p -Idrivers -I../drivers -Idrivers/net/bnxt -I../drivers/net/bnxt -I../drivers/net/bnxt/tf_ulp -I../drivers/net/bnxt/tf_core -Ilib/librte_ethdev -I../lib/librte_ethdev -I. -I.. -Iconfig -I../config -Ilib/librte_eal/include -I../lib/librte_eal/include -Ilib/librte_eal/freebsd/include -I../lib/librte_eal/freebsd/include -Ilib/librte_eal/x86/include -I../lib/librte_eal/x86/include -Ilib/librte_eal/common -I../lib/librte_eal/common -Ilib/librte_eal -I../lib/librte_eal -Ilib/librte_kvargs -I../lib/librte_kvargs -Ilib/librte_metrics -I../lib/librte_metrics -Ilib/librte_telemetry -I../lib/librte_telemetry -Ilib/librte_net -I../lib/librte_net -Ilib/librte_mbuf -I../lib/librte_mbuf -Ilib/librte_mempool -I../lib/librte_mempool -Ilib/librte_ring -I../lib/librte_ring -Ilib/librte_meter -I../lib/librte_meter -Idrivers/bus/pci -I../drivers/bus/pci -I../drivers/bus/pci/bsd -Ilib/librte_pci -I../lib/librte_pci -Idrivers/bus/vdev -I../drivers/bus/vdev -fdiagnostics-color=always -pipe -D_FILE_OFFSET_BITS=64 -Wall -Winvalid-pch -Werror -O2 -g -include rte_config.h -Wextra -Wcast-qual -Wdeprecated -Wformat-nonliteral -Wformat-security -Wmissing-declarations -Wmissing-prototypes -Wnested-externs -Wold-style-definition -Wpointer-arith -Wsign-compare -Wstrict-prototypes -Wundef -Wwrite-strings -Wno-address-of-packed-member -Wno-packed-not-aligned -Wno-missing-field-initializers -D_GNU_SOURCE -D__BSD_VISIBLE -fPIC -march=native -mno-avx512f -DALLOW_EXPERIMENTAL_API -DALLOW_INTERNAL_API -Wno-format-truncation -MD -MQ drivers/libtmp_rte_pmd_bnxt.a.p/net_bnxt_bnxt_ethdev.c.o -MF drivers/libtmp_rte_pmd_bnxt.a.p/net_bnxt_bnxt_ethdev.c.o.d -o drivers/libtmp_rte_pmd_bnxt.a.p/net_bnxt_bnxt_ethdev.c.o -c ../drivers/net/bnxt/bnxt_ethdev.c
../drivers/net/bnxt/bnxt_ethdev.c: In function 'bnxt_dev_recover':
../drivers/net/bnxt/bnxt_ethdev.c:4569:2: error: implicit declaration of function '_rte_eth_dev_callback_process'; did you mean 'rte_eth_dev_callback_process'? [-Werror=implicit-function-declaration]
 4569 |  _rte_eth_dev_callback_process(bp->eth_dev,
      |  ^~~~~~~~~~~~~~~~~~~~~~~~~~~~~
      |  rte_eth_dev_callback_process
../drivers/net/bnxt/bnxt_ethdev.c:4569:2: error: nested extern declaration of '_rte_eth_dev_callback_process' [-Werror=nested-externs]
cc1: all warnings being treated as errors
[769/1946] Compiling C object drivers/libtmp_rte_pmd_bnx2x.a.p/net_bnx2x_elink.c.o
ninja: build stopped: subcommand failed




*Build Failed #12:
OS: RHEL82-64
Target: x86_64-native-linuxapp-gcc
FAILED: drivers/libtmp_rte_pmd_bnxt.a.p/net_bnxt_bnxt_cpr.c.o 
gcc -Idrivers/libtmp_rte_pmd_bnxt.a.p -Idrivers -I../drivers -Idrivers/net/bnxt -I../drivers/net/bnxt -I../drivers/net/bnxt/tf_ulp -I../drivers/net/bnxt/tf_core -Ilib/librte_ethdev -I../lib/librte_ethdev -I. -I.. -Iconfig -I../config -Ilib/librte_eal/include -I../lib/librte_eal/include -Ilib/librte_eal/linux/include -I../lib/librte_eal/linux/include -Ilib/librte_eal/x86/include -I../lib/librte_eal/x86/include -Ilib/librte_eal/common -I../lib/librte_eal/common -Ilib/librte_eal -I../lib/librte_eal -Ilib/librte_kvargs -I../lib/librte_kvargs -Ilib/librte_metrics -I../lib/librte_metrics -Ilib/librte_telemetry -I../lib/librte_telemetry -Ilib/librte_net -I../lib/librte_net -Ilib/librte_mbuf -I../lib/librte_mbuf -Ilib/librte_mempool -I../lib/librte_mempool -Ilib/librte_ring -I../lib/librte_ring -Ilib/librte_meter -I../lib/librte_meter -Idrivers/bus/pci -I../drivers/bus/pci -I../drivers/bus/pci/linux -Ilib/librte_pci -I../lib/librte_pci -Idrivers/bus/vdev -I../drivers/bus/vdev -fdiagnostics-color=always -pipe -D_FILE_OFFSET_BITS=64 -Wall -Winvalid-pch -Werror -O3 -include rte_config.h -Wextra -Wcast-qual -Wdeprecated -Wformat-nonliteral -Wformat-security -Wmissing-declarations -Wmissing-prototypes -Wnested-externs -Wold-style-definition -Wpointer-arith -Wsign-compare -Wstrict-prototypes -Wundef -Wwrite-strings -Wno-packed-not-aligned -Wno-missing-field-initializers -D_GNU_SOURCE -fPIC -march=native -mno-avx512f -DALLOW_EXPERIMENTAL_API -DALLOW_INTERNAL_API -Wno-format-truncation -MD -MQ drivers/libtmp_rte_pmd_bnxt.a.p/net_bnxt_bnxt_cpr.c.o -MF drivers/libtmp_rte_pmd_bnxt.a.p/net_bnxt_bnxt_cpr.c.o.d -o drivers/libtmp_rte_pmd_bnxt.a.p/net_bnxt_bnxt_cpr.c.o -c ../drivers/net/bnxt/bnxt_cpr.c
../drivers/net/bnxt/bnxt_cpr.c: In function ‘bnxt_handle_async_event’:
../drivers/net/bnxt/bnxt_cpr.c:132:3: error: implicit declaration of function ‘_rte_eth_dev_callback_process’; did you mean ‘rte_eth_dev_callback_process’? [-Werror=implicit-function-declaration]
   _rte_eth_dev_callback_process(bp->eth_dev,
   ^~~~~~~~~~~~~~~~~~~~~~~~~~~~~
   rte_eth_dev_callback_process
../drivers/net/bnxt/bnxt_cpr.c:132:3: error: nested extern declaration of ‘_rte_eth_dev_callback_process’ [-Werror=nested-externs]
cc1: all warnings being treated as errors
[942/2609] Linking target drivers/librte_pmd_axgbe.so.21.0
[943/2609] Compiling C object drivers/libtmp_rte_pmd_bond.a.p/net_bonding_rte_eth_bond_pmd.c.o
[944/2609] Compiling C object drivers/libtmp_rte_pmd_bnx2x.a.p/net_bnx2x_bnx2x_stats.c.o
[945/2609] Compiling C object drivers/libtmp_rte_pmd_bnxt.a.p/net_bnxt_bnxt_irq.c.o
[946/2609] Compiling C object drivers/libtmp_rte_pmd_bnxt.a.p/net_bnxt_bnxt_flow.c.o
[947/2609] Compiling C object drivers/libtmp_rte_pmd_bnxt.a.p/net_bnxt_bnxt_ethdev.c.o
FAILED: drivers/libtmp_rte_pmd_bnxt.a.p/net_bnxt_bnxt_ethdev.c.o 
gcc -Idrivers/libtmp_rte_pmd_bnxt.a.p -Idrivers -I../drivers -Idrivers/net/bnxt -I../drivers/net/bnxt -I../drivers/net/bnxt/tf_ulp -I../drivers/net/bnxt/tf_core -Ilib/librte_ethdev -I../lib/librte_ethdev -I. -I.. -Iconfig -I../config -Ilib/librte_eal/include -I../lib/librte_eal/include -Ilib/librte_eal/linux/include -I../lib/librte_eal/linux/include -Ilib/librte_eal/x86/include -I../lib/librte_eal/x86/include -Ilib/librte_eal/common -I../lib/librte_eal/common -Ilib/librte_eal -I../lib/librte_eal -Ilib/librte_kvargs -I../lib/librte_kvargs -Ilib/librte_metrics -I../lib/librte_metrics -Ilib/librte_telemetry -I../lib/librte_telemetry -Ilib/librte_net -I../lib/librte_net -Ilib/librte_mbuf -I../lib/librte_mbuf -Ilib/librte_mempool -I../lib/librte_mempool -Ilib/librte_ring -I../lib/librte_ring -Ilib/librte_meter -I../lib/librte_meter -Idrivers/bus/pci -I../drivers/bus/pci -I../drivers/bus/pci/linux -Ilib/librte_pci -I../lib/librte_pci -Idrivers/bus/vdev -I../drivers/bus/vdev -fdiagnostics-color=always -pipe -D_FILE_OFFSET_BITS=64 -Wall -Winvalid-pch -Werror -O3 -include rte_config.h -Wextra -Wcast-qual -Wdeprecated -Wformat-nonliteral -Wformat-security -Wmissing-declarations -Wmissing-prototypes -Wnested-externs -Wold-style-definition -Wpointer-arith -Wsign-compare -Wstrict-prototypes -Wundef -Wwrite-strings -Wno-packed-not-aligned -Wno-missing-field-initializers -D_GNU_SOURCE -fPIC -march=native -mno-avx512f -DALLOW_EXPERIMENTAL_API -DALLOW_INTERNAL_API -Wno-format-truncation -MD -MQ drivers/libtmp_rte_pmd_bnxt.a.p/net_bnxt_bnxt_ethdev.c.o -MF drivers/libtmp_rte_pmd_bnxt.a.p/net_bnxt_bnxt_ethdev.c.o.d -o drivers/libtmp_rte_pmd_bnxt.a.p/net_bnxt_bnxt_ethdev.c.o -c ../drivers/net/bnxt/bnxt_ethdev.c
../drivers/net/bnxt/bnxt_ethdev.c: In function ‘bnxt_dev_recover’:
../drivers/net/bnxt/bnxt_ethdev.c:4569:2: error: implicit declaration of function ‘_rte_eth_dev_callback_process’; did you mean ‘rte_eth_dev_callback_process’? [-Werror=implicit-function-declaration]
  _rte_eth_dev_callback_process(bp->eth_dev,
  ^~~~~~~~~~~~~~~~~~~~~~~~~~~~~
  rte_eth_dev_callback_process
../drivers/net/bnxt/bnxt_ethdev.c:4569:2: error: nested extern declaration of ‘_rte_eth_dev_callback_process’ [-Werror=nested-externs]
cc1: all warnings being treated as errors
[948/2609] Compiling C object drivers/libtmp_rte_pmd_bnx2x.a.p/net_bnx2x_bnx2x.c.o
[949/2609] Compiling C object drivers/libtmp_rte_pmd_bnx2x.a.p/net_bnx2x_elink.c.o
[950/2609] Compiling C object drivers/libtmp_rte_pmd_bnxt.a.p/net_bnxt_bnxt_hwrm.c.o
ninja: build stopped: subcommand failed




*Build Failed #13:
OS: SUSE15-64
Target: x86_64-native-linuxapp-clang
FAILED: drivers/libtmp_rte_pmd_bnxt.a.p/net_bnxt_bnxt_cpr.c.o 
clang -Idrivers/libtmp_rte_pmd_bnxt.a.p -Idrivers -I../drivers -Idrivers/net/bnxt -I../drivers/net/bnxt -I../drivers/net/bnxt/tf_ulp -I../drivers/net/bnxt/tf_core -Ilib/librte_ethdev -I../lib/librte_ethdev -I. -I.. -Iconfig -I../config -Ilib/librte_eal/include -I../lib/librte_eal/include -Ilib/librte_eal/linux/include -I../lib/librte_eal/linux/include -Ilib/librte_eal/x86/include -I../lib/librte_eal/x86/include -Ilib/librte_eal/common -I../lib/librte_eal/common -Ilib/librte_eal -I../lib/librte_eal -Ilib/librte_kvargs -I../lib/librte_kvargs -Ilib/librte_metrics -I../lib/librte_metrics -Ilib/librte_telemetry -I../lib/librte_telemetry -Ilib/librte_net -I../lib/librte_net -Ilib/librte_mbuf -I../lib/librte_mbuf -Ilib/librte_mempool -I../lib/librte_mempool -Ilib/librte_ring -I../lib/librte_ring -Ilib/librte_meter -I../lib/librte_meter -Idrivers/bus/pci -I../drivers/bus/pci -I../drivers/bus/pci/linux -Ilib/librte_pci -I../lib/librte_pci -Idrivers/bus/vdev -I../drivers/bus/vdev -Xclang -fcolor-diagnostics -pipe -D_FILE_OFFSET_BITS=64 -Wall -Winvalid-pch -Werror -O3 -include rte_config.h -Wextra -Wcast-qual -Wdeprecated -Wformat-nonliteral -Wformat-security -Wmissing-declarations -Wmissing-prototypes -Wnested-externs -Wold-style-definition -Wpointer-arith -Wsign-compare -Wstrict-prototypes -Wundef -Wwrite-strings -Wno-address-of-packed-member -Wno-missing-field-initializers -D_GNU_SOURCE -fPIC -march=native -DALLOW_EXPERIMENTAL_API -DALLOW_INTERNAL_API -MD -MQ drivers/libtmp_rte_pmd_bnxt.a.p/net_bnxt_bnxt_cpr.c.o -MF drivers/libtmp_rte_pmd_bnxt.a.p/net_bnxt_bnxt_cpr.c.o.d -o drivers/libtmp_rte_pmd_bnxt.a.p/net_bnxt_bnxt_cpr.c.o -c ../drivers/net/bnxt/bnxt_cpr.c
../drivers/net/bnxt/bnxt_cpr.c:132:3: error: implicit declaration of function '_rte_eth_dev_callback_process' is invalid in C99 [-Werror,-Wimplicit-function-declaration]
                _rte_eth_dev_callback_process(bp->eth_dev,
                ^
../drivers/net/bnxt/bnxt_cpr.c:132:3: note: did you mean 'rte_eth_dev_callback_process'?
../lib/librte_ethdev/rte_ethdev_driver.h:844:5: note: 'rte_eth_dev_callback_process' declared here
int rte_eth_dev_callback_process(struct rte_eth_dev *dev,
    ^
../drivers/net/bnxt/bnxt_cpr.c:132:3: error: this function declaration is not a prototype [-Werror,-Wstrict-prototypes]
                _rte_eth_dev_callback_process(bp->eth_dev,
                ^
2 errors generated.
[949/2578] Compiling C object drivers/librte_pmd_bond.so.21.0.p/meson-generated_.._rte_pmd_bond.pmd.c.o
[950/2578] Compiling C object drivers/libtmp_rte_pmd_bnxt.a.p/net_bnxt_bnxt_ethdev.c.o
FAILED: drivers/libtmp_rte_pmd_bnxt.a.p/net_bnxt_bnxt_ethdev.c.o 
clang -Idrivers/libtmp_rte_pmd_bnxt.a.p -Idrivers -I../drivers -Idrivers/net/bnxt -I../drivers/net/bnxt -I../drivers/net/bnxt/tf_ulp -I../drivers/net/bnxt/tf_core -Ilib/librte_ethdev -I../lib/librte_ethdev -I. -I.. -Iconfig -I../config -Ilib/librte_eal/include -I../lib/librte_eal/include -Ilib/librte_eal/linux/include -I../lib/librte_eal/linux/include -Ilib/librte_eal/x86/include -I../lib/librte_eal/x86/include -Ilib/librte_eal/common -I../lib/librte_eal/common -Ilib/librte_eal -I../lib/librte_eal -Ilib/librte_kvargs -I../lib/librte_kvargs -Ilib/librte_metrics -I../lib/librte_metrics -Ilib/librte_telemetry -I../lib/librte_telemetry -Ilib/librte_net -I../lib/librte_net -Ilib/librte_mbuf -I../lib/librte_mbuf -Ilib/librte_mempool -I../lib/librte_mempool -Ilib/librte_ring -I../lib/librte_ring -Ilib/librte_meter -I../lib/librte_meter -Idrivers/bus/pci -I../drivers/bus/pci -I../drivers/bus/pci/linux -Ilib/librte_pci -I../lib/librte_pci -Idrivers/bus/vdev -I../drivers/bus/vdev -Xclang -fcolor-diagnostics -pipe -D_FILE_OFFSET_BITS=64 -Wall -Winvalid-pch -Werror -O3 -include rte_config.h -Wextra -Wcast-qual -Wdeprecated -Wformat-nonliteral -Wformat-security -Wmissing-declarations -Wmissing-prototypes -Wnested-externs -Wold-style-definition -Wpointer-arith -Wsign-compare -Wstrict-prototypes -Wundef -Wwrite-strings -Wno-address-of-packed-member -Wno-missing-field-initializers -D_GNU_SOURCE -fPIC -march=native -DALLOW_EXPERIMENTAL_API -DALLOW_INTERNAL_API -MD -MQ drivers/libtmp_rte_pmd_bnxt.a.p/net_bnxt_bnxt_ethdev.c.o -MF drivers/libtmp_rte_pmd_bnxt.a.p/net_bnxt_bnxt_ethdev.c.o.d -o drivers/libtmp_rte_pmd_bnxt.a.p/net_bnxt_bnxt_ethdev.c.o -c ../drivers/net/bnxt/bnxt_ethdev.c
../drivers/net/bnxt/bnxt_ethdev.c:4569:2: error: implicit declaration of function '_rte_eth_dev_callback_process' is invalid in C99 [-Werror,-Wimplicit-function-declaration]
        _rte_eth_dev_callback_process(bp->eth_dev,
        ^
../drivers/net/bnxt/bnxt_ethdev.c:4569:2: note: did you mean 'rte_eth_dev_callback_process'?
../lib/librte_ethdev/rte_ethdev_driver.h:844:5: note: 'rte_eth_dev_callback_process' declared here
int rte_eth_dev_callback_process(struct rte_eth_dev *dev,
    ^
../drivers/net/bnxt/bnxt_ethdev.c:4569:2: error: this function declaration is not a prototype [-Werror,-Wstrict-prototypes]
        _rte_eth_dev_callback_process(bp->eth_dev,
        ^
2 errors generated.
[951/2578] Compiling C object drivers/libtmp_rte_pmd_bnx2x.a.p/net_bnx2x_bnx2x_stats.c.o
[952/2578] Compiling C object drivers/libtmp_rte_pmd_bnxt.a.p/net_bnxt_bnxt_irq.c.o
[953/2578] Generating rte_pmd_bond.sym_chk with a meson_exe.py custom command
[954/2578] Compiling C object drivers/libtmp_rte_pmd_bnxt.a.p/net_bnxt_bnxt_flow.c.o
[955/2578] Compiling C object drivers/libtmp_rte_pmd_bnxt.a.p/net_bnxt_bnxt_hwrm.c.o
[956/2578] Compiling C object drivers/libtmp_rte_pmd_bnx2x.a.p/net_bnx2x_elink.c.o
[957/2578] Compiling C object drivers/libtmp_rte_pmd_bnx2x.a.p/net_bnx2x_bnx2x.c.o
ninja: build stopped: subcommand failed




*Build Failed #14:
OS: SUSE15-64
Target: x86_64-native-linuxapp-gcc
FAILED: drivers/libtmp_rte_pmd_bnxt.a.p/net_bnxt_bnxt_cpr.c.o 
gcc -Idrivers/libtmp_rte_pmd_bnxt.a.p -Idrivers -I../drivers -Idrivers/net/bnxt -I../drivers/net/bnxt -I../drivers/net/bnxt/tf_ulp -I../drivers/net/bnxt/tf_core -Ilib/librte_ethdev -I../lib/librte_ethdev -I. -I.. -Iconfig -I../config -Ilib/librte_eal/include -I../lib/librte_eal/include -Ilib/librte_eal/linux/include -I../lib/librte_eal/linux/include -Ilib/librte_eal/x86/include -I../lib/librte_eal/x86/include -Ilib/librte_eal/common -I../lib/librte_eal/common -Ilib/librte_eal -I../lib/librte_eal -Ilib/librte_kvargs -I../lib/librte_kvargs -Ilib/librte_metrics -I../lib/librte_metrics -Ilib/librte_telemetry -I../lib/librte_telemetry -Ilib/librte_net -I../lib/librte_net -Ilib/librte_mbuf -I../lib/librte_mbuf -Ilib/librte_mempool -I../lib/librte_mempool -Ilib/librte_ring -I../lib/librte_ring -Ilib/librte_meter -I../lib/librte_meter -Idrivers/bus/pci -I../drivers/bus/pci -I../drivers/bus/pci/linux -Ilib/librte_pci -I../lib/librte_pci -Idrivers/bus/vdev -I../drivers/bus/vdev -fdiagnostics-color=always -pipe -D_FILE_OFFSET_BITS=64 -Wall -Winvalid-pch -Werror -O3 -include rte_config.h -Wextra -Wcast-qual -Wdeprecated -Wformat-nonliteral -Wformat-security -Wmissing-declarations -Wmissing-prototypes -Wnested-externs -Wold-style-definition -Wpointer-arith -Wsign-compare -Wstrict-prototypes -Wundef -Wwrite-strings -Wno-missing-field-initializers -D_GNU_SOURCE -fPIC -march=native -DALLOW_EXPERIMENTAL_API -DALLOW_INTERNAL_API -Wno-format-truncation -MD -MQ drivers/libtmp_rte_pmd_bnxt.a.p/net_bnxt_bnxt_cpr.c.o -MF drivers/libtmp_rte_pmd_bnxt.a.p/net_bnxt_bnxt_cpr.c.o.d -o drivers/libtmp_rte_pmd_bnxt.a.p/net_bnxt_bnxt_cpr.c.o -c ../drivers/net/bnxt/bnxt_cpr.c
../drivers/net/bnxt/bnxt_cpr.c: In function ‘bnxt_handle_async_event’:
../drivers/net/bnxt/bnxt_cpr.c:132:3: error: implicit declaration of function ‘_rte_eth_dev_callback_process’; did you mean ‘rte_eth_dev_callback_process’? [-Werror=implicit-function-declaration]
   _rte_eth_dev_callback_process(bp->eth_dev,
   ^~~~~~~~~~~~~~~~~~~~~~~~~~~~~
   rte_eth_dev_callback_process
../drivers/net/bnxt/bnxt_cpr.c:132:3: error: nested extern declaration of ‘_rte_eth_dev_callback_process’ [-Werror=nested-externs]
cc1: all warnings being treated as errors
[938/2578] Compiling C object drivers/libtmp_rte_pmd_bond.a.p/net_bonding_rte_eth_bond_8023ad.c.o
[939/2578] Compiling C object drivers/libtmp_rte_pmd_bnxt.a.p/net_bnxt_tf_core_stack.c.o
[940/2578] Compiling C object drivers/libtmp_rte_pmd_bond.a.p/net_bonding_rte_eth_bond_pmd.c.o
[941/2578] Compiling C object drivers/libtmp_rte_pmd_bnxt.a.p/net_bnxt_tf_core_tf_em_internal.c.o
[942/2578] Compiling C object drivers/libtmp_rte_pmd_bnx2x.a.p/net_bnx2x_bnx2x_stats.c.o
[943/2578] Compiling C object drivers/libtmp_rte_pmd_bnx2x.a.p/net_bnx2x_ecore_sp.c.o
[944/2578] Compiling C object lib/librte_pipeline.a.p/librte_pipeline_rte_table_action.c.o
[945/2578] Compiling C object drivers/libtmp_rte_pmd_bnx2x.a.p/net_bnx2x_bnx2x.c.o
[946/2578] Compiling C object drivers/libtmp_rte_pmd_bnx2x.a.p/net_bnx2x_elink.c.o
ninja: build stopped: subcommand failed




*Build Failed #15:
OS: UB1804-64
Target: x86_64-native-linuxapp-gcc
FAILED: drivers/libtmp_rte_pmd_bnxt.a.p/net_bnxt_bnxt_cpr.c.o 
gcc -Idrivers/libtmp_rte_pmd_bnxt.a.p -Idrivers -I../drivers -Idrivers/net/bnxt -I../drivers/net/bnxt -I../drivers/net/bnxt/tf_ulp -I../drivers/net/bnxt/tf_core -Ilib/librte_ethdev -I../lib/librte_ethdev -I. -I.. -Iconfig -I../config -Ilib/librte_eal/include -I../lib/librte_eal/include -Ilib/librte_eal/linux/include -I../lib/librte_eal/linux/include -Ilib/librte_eal/x86/include -I../lib/librte_eal/x86/include -Ilib/librte_eal/common -I../lib/librte_eal/common -Ilib/librte_eal -I../lib/librte_eal -Ilib/librte_kvargs -I../lib/librte_kvargs -Ilib/librte_metrics -I../lib/librte_metrics -Ilib/librte_telemetry -I../lib/librte_telemetry -Ilib/librte_net -I../lib/librte_net -Ilib/librte_mbuf -I../lib/librte_mbuf -Ilib/librte_mempool -I../lib/librte_mempool -Ilib/librte_ring -I../lib/librte_ring -Ilib/librte_meter -I../lib/librte_meter -Idrivers/bus/pci -I../drivers/bus/pci -I../drivers/bus/pci/linux -Ilib/librte_pci -I../lib/librte_pci -Idrivers/bus/vdev -I../drivers/bus/vdev -fdiagnostics-color=always -pipe -D_FILE_OFFSET_BITS=64 -Wall -Winvalid-pch -Werror -O3 -include rte_config.h -Wextra -Wcast-qual -Wdeprecated -Wformat-nonliteral -Wformat-security -Wmissing-declarations -Wmissing-prototypes -Wnested-externs -Wold-style-definition -Wpointer-arith -Wsign-compare -Wstrict-prototypes -Wundef -Wwrite-strings -Wno-packed-not-aligned -Wno-missing-field-initializers -D_GNU_SOURCE -fPIC -march=native -mno-avx512f -DALLOW_EXPERIMENTAL_API -DALLOW_INTERNAL_API -Wno-format-truncation -MD -MQ drivers/libtmp_rte_pmd_bnxt.a.p/net_bnxt_bnxt_cpr.c.o -MF drivers/libtmp_rte_pmd_bnxt.a.p/net_bnxt_bnxt_cpr.c.o.d -o drivers/libtmp_rte_pmd_bnxt.a.p/net_bnxt_bnxt_cpr.c.o -c ../drivers/net/bnxt/bnxt_cpr.c
../drivers/net/bnxt/bnxt_cpr.c: In function ‘bnxt_handle_async_event’:
../drivers/net/bnxt/bnxt_cpr.c:132:3: error: implicit declaration of function ‘_rte_eth_dev_callback_process’; did you mean ‘rte_eth_dev_callback_process’? [-Werror=implicit-function-declaration]
   _rte_eth_dev_callback_process(bp->eth_dev,
   ^~~~~~~~~~~~~~~~~~~~~~~~~~~~~
   rte_eth_dev_callback_process
../drivers/net/bnxt/bnxt_cpr.c:132:3: error: nested extern declaration of ‘_rte_eth_dev_callback_process’ [-Werror=nested-externs]
cc1: all warnings being treated as errors
[941/2598] Linking static target drivers/libtmp_rte_pmd_bond.a
[942/2598] Compiling C object drivers/libtmp_rte_pmd_bnxt.a.p/net_bnxt_bnxt_filter.c.o
[943/2598] Generating pipeline.sym_chk with a meson_exe.py custom command
[944/2598] Compiling C object drivers/libtmp_rte_pmd_bnx2x.a.p/net_bnx2x_bnx2x_stats.c.o
[945/2598] Compiling C object drivers/libtmp_rte_pmd_bnxt.a.p/net_bnxt_bnxt_flow.c.o
[946/2598] Compiling C object drivers/libtmp_rte_pmd_bnxt.a.p/net_bnxt_bnxt_ethdev.c.o
FAILED: drivers/libtmp_rte_pmd_bnxt.a.p/net_bnxt_bnxt_ethdev.c.o 
gcc -Idrivers/libtmp_rte_pmd_bnxt.a.p -Idrivers -I../drivers -Idrivers/net/bnxt -I../drivers/net/bnxt -I../drivers/net/bnxt/tf_ulp -I../drivers/net/bnxt/tf_core -Ilib/librte_ethdev -I../lib/librte_ethdev -I. -I.. -Iconfig -I../config -Ilib/librte_eal/include -I../lib/librte_eal/include -Ilib/librte_eal/linux/include -I../lib/librte_eal/linux/include -Ilib/librte_eal/x86/include -I../lib/librte_eal/x86/include -Ilib/librte_eal/common -I../lib/librte_eal/common -Ilib/librte_eal -I../lib/librte_eal -Ilib/librte_kvargs -I../lib/librte_kvargs -Ilib/librte_metrics -I../lib/librte_metrics -Ilib/librte_telemetry -I../lib/librte_telemetry -Ilib/librte_net -I../lib/librte_net -Ilib/librte_mbuf -I../lib/librte_mbuf -Ilib/librte_mempool -I../lib/librte_mempool -Ilib/librte_ring -I../lib/librte_ring -Ilib/librte_meter -I../lib/librte_meter -Idrivers/bus/pci -I../drivers/bus/pci -I../drivers/bus/pci/linux -Ilib/librte_pci -I../lib/librte_pci -Idrivers/bus/vdev -I../drivers/bus/vdev -fdiagnostics-color=always -pipe -D_FILE_OFFSET_BITS=64 -Wall -Winvalid-pch -Werror -O3 -include rte_config.h -Wextra -Wcast-qual -Wdeprecated -Wformat-nonliteral -Wformat-security -Wmissing-declarations -Wmissing-prototypes -Wnested-externs -Wold-style-definition -Wpointer-arith -Wsign-compare -Wstrict-prototypes -Wundef -Wwrite-strings -Wno-packed-not-aligned -Wno-missing-field-initializers -D_GNU_SOURCE -fPIC -march=native -mno-avx512f -DALLOW_EXPERIMENTAL_API -DALLOW_INTERNAL_API -Wno-format-truncation -MD -MQ drivers/libtmp_rte_pmd_bnxt.a.p/net_bnxt_bnxt_ethdev.c.o -MF drivers/libtmp_rte_pmd_bnxt.a.p/net_bnxt_bnxt_ethdev.c.o.d -o drivers/libtmp_rte_pmd_bnxt.a.p/net_bnxt_bnxt_ethdev.c.o -c ../drivers/net/bnxt/bnxt_ethdev.c
../drivers/net/bnxt/bnxt_ethdev.c: In function ‘bnxt_dev_recover’:
../drivers/net/bnxt/bnxt_ethdev.c:4569:2: error: implicit declaration of function ‘_rte_eth_dev_callback_process’; did you mean ‘rte_eth_dev_callback_process’? [-Werror=implicit-function-declaration]
  _rte_eth_dev_callback_process(bp->eth_dev,
  ^~~~~~~~~~~~~~~~~~~~~~~~~~~~~
  rte_eth_dev_callback_process
../drivers/net/bnxt/bnxt_ethdev.c:4569:2: error: nested extern declaration of ‘_rte_eth_dev_callback_process’ [-Werror=nested-externs]
cc1: all warnings being treated as errors
[947/2598] Compiling C object drivers/libtmp_rte_pmd_bnx2x.a.p/net_bnx2x_bnx2x.c.o
[948/2598] Compiling C object drivers/libtmp_rte_pmd_bnxt.a.p/net_bnxt_bnxt_hwrm.c.o
[949/2598] Compiling C object drivers/libtmp_rte_pmd_bnx2x.a.p/net_bnx2x_elink.c.o
ninja: build stopped: subcommand failed




*Build Failed #16:
OS: UB2004-32
Target: i686-native-linuxapp-gcc
FAILED: drivers/libtmp_rte_pmd_bnxt.a.p/net_bnxt_bnxt_cpr.c.o 
gcc -Idrivers/libtmp_rte_pmd_bnxt.a.p -Idrivers -I../drivers -Idrivers/net/bnxt -I../drivers/net/bnxt -I../drivers/net/bnxt/tf_ulp -I../drivers/net/bnxt/tf_core -Ilib/librte_ethdev -I../lib/librte_ethdev -I. -I.. -Iconfig -I../config -Ilib/librte_eal/include -I../lib/librte_eal/include -Ilib/librte_eal/linux/include -I../lib/librte_eal/linux/include -Ilib/librte_eal/x86/include -I../lib/librte_eal/x86/include -Ilib/librte_eal/common -I../lib/librte_eal/common -Ilib/librte_eal -I../lib/librte_eal -Ilib/librte_kvargs -I../lib/librte_kvargs -Ilib/librte_metrics -I../lib/librte_metrics -Ilib/librte_telemetry -I../lib/librte_telemetry -Ilib/librte_net -I../lib/librte_net -Ilib/librte_mbuf -I../lib/librte_mbuf -Ilib/librte_mempool -I../lib/librte_mempool -Ilib/librte_ring -I../lib/librte_ring -Ilib/librte_meter -I../lib/librte_meter -Idrivers/bus/pci -I../drivers/bus/pci -I../drivers/bus/pci/linux -Ilib/librte_pci -I../lib/librte_pci -Idrivers/bus/vdev -I../drivers/bus/vdev -fdiagnostics-color=always -pipe -D_FILE_OFFSET_BITS=64 -Wall -Winvalid-pch -Werror -O3 -include rte_config.h -Wextra -Wcast-qual -Wdeprecated -Wformat-nonliteral -Wformat-security -Wmissing-declarations -Wmissing-prototypes -Wnested-externs -Wold-style-definition -Wpointer-arith -Wsign-compare -Wstrict-prototypes -Wundef -Wwrite-strings -Wno-address-of-packed-member -Wno-packed-not-aligned -Wno-missing-field-initializers -Wno-pointer-to-int-cast -D_GNU_SOURCE -m32 -fPIC -march=native -DALLOW_EXPERIMENTAL_API -DALLOW_INTERNAL_API -Wno-format-truncation -MD -MQ drivers/libtmp_rte_pmd_bnxt.a.p/net_bnxt_bnxt_cpr.c.o -MF drivers/libtmp_rte_pmd_bnxt.a.p/net_bnxt_bnxt_cpr.c.o.d -o drivers/libtmp_rte_pmd_bnxt.a.p/net_bnxt_bnxt_cpr.c.o -c ../drivers/net/bnxt/bnxt_cpr.c
../drivers/net/bnxt/bnxt_cpr.c: In function ‘bnxt_handle_async_event’:
../drivers/net/bnxt/bnxt_cpr.c:132:3: error: implicit declaration of function ‘_rte_eth_dev_callback_process’; did you mean ‘rte_eth_dev_callback_process’? [-Werror=implicit-function-declaration]
  132 |   _rte_eth_dev_callback_process(bp->eth_dev,
      |   ^~~~~~~~~~~~~~~~~~~~~~~~~~~~~
      |   rte_eth_dev_callback_process
../drivers/net/bnxt/bnxt_cpr.c:132:3: error: nested extern declaration of ‘_rte_eth_dev_callback_process’ [-Werror=nested-externs]
cc1: all warnings being treated as errors
[846/2339] Linking target drivers/librte_pmd_axgbe.so.21.0
[847/2339] Compiling C object drivers/libtmp_rte_pmd_bnxt.a.p/net_bnxt_bnxt_filter.c.o
[848/2339] Compiling C object drivers/libtmp_rte_pmd_bnxt.a.p/net_bnxt_bnxt_flow.c.o
[849/2339] Compiling C object drivers/libtmp_rte_pmd_bond.a.p/net_bonding_rte_eth_bond_8023ad.c.o
[850/2339] Compiling C object drivers/libtmp_rte_pmd_bond.a.p/net_bonding_rte_eth_bond_pmd.c.o
[851/2339] Compiling C object drivers/libtmp_rte_pmd_bnxt.a.p/net_bnxt_bnxt_ethdev.c.o
FAILED: drivers/libtmp_rte_pmd_bnxt.a.p/net_bnxt_bnxt_ethdev.c.o 
gcc -Idrivers/libtmp_rte_pmd_bnxt.a.p -Idrivers -I../drivers -Idrivers/net/bnxt -I../drivers/net/bnxt -I../drivers/net/bnxt/tf_ulp -I../drivers/net/bnxt/tf_core -Ilib/librte_ethdev -I../lib/librte_ethdev -I. -I.. -Iconfig -I../config -Ilib/librte_eal/include -I../lib/librte_eal/include -Ilib/librte_eal/linux/include -I../lib/librte_eal/linux/include -Ilib/librte_eal/x86/include -I../lib/librte_eal/x86/include -Ilib/librte_eal/common -I../lib/librte_eal/common -Ilib/librte_eal -I../lib/librte_eal -Ilib/librte_kvargs -I../lib/librte_kvargs -Ilib/librte_metrics -I../lib/librte_metrics -Ilib/librte_telemetry -I../lib/librte_telemetry -Ilib/librte_net -I../lib/librte_net -Ilib/librte_mbuf -I../lib/librte_mbuf -Ilib/librte_mempool -I../lib/librte_mempool -Ilib/librte_ring -I../lib/librte_ring -Ilib/librte_meter -I../lib/librte_meter -Idrivers/bus/pci -I../drivers/bus/pci -I../drivers/bus/pci/linux -Ilib/librte_pci -I../lib/librte_pci -Idrivers/bus/vdev -I../drivers/bus/vdev -fdiagnostics-color=always -pipe -D_FILE_OFFSET_BITS=64 -Wall -Winvalid-pch -Werror -O3 -include rte_config.h -Wextra -Wcast-qual -Wdeprecated -Wformat-nonliteral -Wformat-security -Wmissing-declarations -Wmissing-prototypes -Wnested-externs -Wold-style-definition -Wpointer-arith -Wsign-compare -Wstrict-prototypes -Wundef -Wwrite-strings -Wno-address-of-packed-member -Wno-packed-not-aligned -Wno-missing-field-initializers -Wno-pointer-to-int-cast -D_GNU_SOURCE -m32 -fPIC -march=native -DALLOW_EXPERIMENTAL_API -DALLOW_INTERNAL_API -Wno-format-truncation -MD -MQ drivers/libtmp_rte_pmd_bnxt.a.p/net_bnxt_bnxt_ethdev.c.o -MF drivers/libtmp_rte_pmd_bnxt.a.p/net_bnxt_bnxt_ethdev.c.o.d -o drivers/libtmp_rte_pmd_bnxt.a.p/net_bnxt_bnxt_ethdev.c.o -c ../drivers/net/bnxt/bnxt_ethdev.c
../drivers/net/bnxt/bnxt_ethdev.c: In function ‘bnxt_dev_recover’:
../drivers/net/bnxt/bnxt_ethdev.c:4569:2: error: implicit declaration of function ‘_rte_eth_dev_callback_process’; did you mean ‘rte_eth_dev_callback_process’? [-Werror=implicit-function-declaration]
 4569 |  _rte_eth_dev_callback_process(bp->eth_dev,
      |  ^~~~~~~~~~~~~~~~~~~~~~~~~~~~~
      |  rte_eth_dev_callback_process
../drivers/net/bnxt/bnxt_ethdev.c:4569:2: error: nested extern declaration of ‘_rte_eth_dev_callback_process’ [-Werror=nested-externs]
cc1: all warnings being treated as errors
[852/2339] Compiling C object drivers/libtmp_rte_pmd_bnxt.a.p/net_bnxt_bnxt_hwrm.c.o
[853/2339] Compiling C object lib/librte_vhost.a.p/librte_vhost_vhost_crypto.c.o
[854/2339] Compiling C object lib/librte_pipeline.a.p/librte_pipeline_rte_table_action.c.o
ninja: build stopped: subcommand failed




*Build Failed #17:
OS: UB2004-64
Target: x86_64-native-linuxapp-clang
FAILED: drivers/libtmp_rte_pmd_bnxt.a.p/net_bnxt_bnxt_cpr.c.o 
clang -Idrivers/libtmp_rte_pmd_bnxt.a.p -Idrivers -I../drivers -Idrivers/net/bnxt -I../drivers/net/bnxt -I../drivers/net/bnxt/tf_ulp -I../drivers/net/bnxt/tf_core -Ilib/librte_ethdev -I../lib/librte_ethdev -I. -I.. -Iconfig -I../config -Ilib/librte_eal/include -I../lib/librte_eal/include -Ilib/librte_eal/linux/include -I../lib/librte_eal/linux/include -Ilib/librte_eal/x86/include -I../lib/librte_eal/x86/include -Ilib/librte_eal/common -I../lib/librte_eal/common -Ilib/librte_eal -I../lib/librte_eal -Ilib/librte_kvargs -I../lib/librte_kvargs -Ilib/librte_metrics -I../lib/librte_metrics -Ilib/librte_telemetry -I../lib/librte_telemetry -Ilib/librte_net -I../lib/librte_net -Ilib/librte_mbuf -I../lib/librte_mbuf -Ilib/librte_mempool -I../lib/librte_mempool -Ilib/librte_ring -I../lib/librte_ring -Ilib/librte_meter -I../lib/librte_meter -Idrivers/bus/pci -I../drivers/bus/pci -I../drivers/bus/pci/linux -Ilib/librte_pci -I../lib/librte_pci -Idrivers/bus/vdev -I../drivers/bus/vdev -Xclang -fcolor-diagnostics -pipe -D_FILE_OFFSET_BITS=64 -Wall -Winvalid-pch -Werror -O3 -include rte_config.h -Wextra -Wcast-qual -Wdeprecated -Wformat-nonliteral -Wformat-security -Wmissing-declarations -Wmissing-prototypes -Wnested-externs -Wold-style-definition -Wpointer-arith -Wsign-compare -Wstrict-prototypes -Wundef -Wwrite-strings -Wno-address-of-packed-member -Wno-missing-field-initializers -D_GNU_SOURCE -fPIC -march=native -DALLOW_EXPERIMENTAL_API -DALLOW_INTERNAL_API -MD -MQ drivers/libtmp_rte_pmd_bnxt.a.p/net_bnxt_bnxt_cpr.c.o -MF drivers/libtmp_rte_pmd_bnxt.a.p/net_bnxt_bnxt_cpr.c.o.d -o drivers/libtmp_rte_pmd_bnxt.a.p/net_bnxt_bnxt_cpr.c.o -c ../drivers/net/bnxt/bnxt_cpr.c
../drivers/net/bnxt/bnxt_cpr.c:132:3: error: implicit declaration of function '_rte_eth_dev_callback_process' is invalid in C99 [-Werror,-Wimplicit-function-declaration]
                _rte_eth_dev_callback_process(bp->eth_dev,
                ^
../drivers/net/bnxt/bnxt_cpr.c:132:3: note: did you mean 'rte_eth_dev_callback_process'?
../lib/librte_ethdev/rte_ethdev_driver.h:844:5: note: 'rte_eth_dev_callback_process' declared here
int rte_eth_dev_callback_process(struct rte_eth_dev *dev,
    ^
1 error generated.
[940/2600] Compiling C object drivers/libtmp_rte_pmd_bond.a.p/net_bonding_rte_eth_bond_pmd.c.o
[941/2600] Compiling C object drivers/libtmp_rte_pmd_bnxt.a.p/net_bnxt_bnxt_ethdev.c.o
FAILED: drivers/libtmp_rte_pmd_bnxt.a.p/net_bnxt_bnxt_ethdev.c.o 
clang -Idrivers/libtmp_rte_pmd_bnxt.a.p -Idrivers -I../drivers -Idrivers/net/bnxt -I../drivers/net/bnxt -I../drivers/net/bnxt/tf_ulp -I../drivers/net/bnxt/tf_core -Ilib/librte_ethdev -I../lib/librte_ethdev -I. -I.. -Iconfig -I../config -Ilib/librte_eal/include -I../lib/librte_eal/include -Ilib/librte_eal/linux/include -I../lib/librte_eal/linux/include -Ilib/librte_eal/x86/include -I../lib/librte_eal/x86/include -Ilib/librte_eal/common -I../lib/librte_eal/common -Ilib/librte_eal -I../lib/librte_eal -Ilib/librte_kvargs -I../lib/librte_kvargs -Ilib/librte_metrics -I../lib/librte_metrics -Ilib/librte_telemetry -I../lib/librte_telemetry -Ilib/librte_net -I../lib/librte_net -Ilib/librte_mbuf -I../lib/librte_mbuf -Ilib/librte_mempool -I../lib/librte_mempool -Ilib/librte_ring -I../lib/librte_ring -Ilib/librte_meter -I../lib/librte_meter -Idrivers/bus/pci -I../drivers/bus/pci -I../drivers/bus/pci/linux -Ilib/librte_pci -I../lib/librte_pci -Idrivers/bus/vdev -I../drivers/bus/vdev -Xclang -fcolor-diagnostics -pipe -D_FILE_OFFSET_BITS=64 -Wall -Winvalid-pch -Werror -O3 -include rte_config.h -Wextra -Wcast-qual -Wdeprecated -Wformat-nonliteral -Wformat-security -Wmissing-declarations -Wmissing-prototypes -Wnested-externs -Wold-style-definition -Wpointer-arith -Wsign-compare -Wstrict-prototypes -Wundef -Wwrite-strings -Wno-address-of-packed-member -Wno-missing-field-initializers -D_GNU_SOURCE -fPIC -march=native -DALLOW_EXPERIMENTAL_API -DALLOW_INTERNAL_API -MD -MQ drivers/libtmp_rte_pmd_bnxt.a.p/net_bnxt_bnxt_ethdev.c.o -MF drivers/libtmp_rte_pmd_bnxt.a.p/net_bnxt_bnxt_ethdev.c.o.d -o drivers/libtmp_rte_pmd_bnxt.a.p/net_bnxt_bnxt_ethdev.c.o -c ../drivers/net/bnxt/bnxt_ethdev.c
../drivers/net/bnxt/bnxt_ethdev.c:4569:2: error: implicit declaration of function '_rte_eth_dev_callback_process' is invalid in C99 [-Werror,-Wimplicit-function-declaration]
        _rte_eth_dev_callback_process(bp->eth_dev,
        ^
../drivers/net/bnxt/bnxt_ethdev.c:4569:2: note: did you mean 'rte_eth_dev_callback_process'?
../lib/librte_ethdev/rte_ethdev_driver.h:844:5: note: 'rte_eth_dev_callback_process' declared here
int rte_eth_dev_callback_process(struct rte_eth_dev *dev,
    ^
../drivers/net/bnxt/bnxt_ethdev.c:4717:2: error: implicit declaration of function '_rte_eth_dev_callback_process' is invalid in C99 [-Werror,-Wimplicit-function-declaration]
        _rte_eth_dev_callback_process(bp->eth_dev,
        ^
2 errors generated.
[942/2600] Generating pipeline.sym_chk with a meson_exe.py custom command
[943/2600] Compiling C object drivers/libtmp_rte_pmd_bnxt.a.p/net_bnxt_bnxt_irq.c.o
[944/2600] Compiling C object drivers/libtmp_rte_pmd_bnx2x.a.p/net_bnx2x_bnx2x_stats.c.o
[945/2600] Compiling C object drivers/libtmp_rte_pmd_bnxt.a.p/net_bnxt_bnxt_flow.c.o
[946/2600] Compiling C object drivers/libtmp_rte_pmd_bnxt.a.p/net_bnxt_bnxt_hwrm.c.o
[947/2600] Compiling C object drivers/libtmp_rte_pmd_bnx2x.a.p/net_bnx2x_elink.c.o
[948/2600] Compiling C object drivers/libtmp_rte_pmd_bnx2x.a.p/net_bnx2x_bnx2x.c.o
ninja: build stopped: subcommand failed




*Build Failed #18:
OS: UB2004-64
Target: x86_64-native-linuxapp-gcc
FAILED: drivers/libtmp_rte_pmd_bnxt.a.p/net_bnxt_bnxt_cpr.c.o 
gcc -Idrivers/libtmp_rte_pmd_bnxt.a.p -Idrivers -I../drivers -Idrivers/net/bnxt -I../drivers/net/bnxt -I../drivers/net/bnxt/tf_ulp -I../drivers/net/bnxt/tf_core -Ilib/librte_ethdev -I../lib/librte_ethdev -I. -I.. -Iconfig -I../config -Ilib/librte_eal/include -I../lib/librte_eal/include -Ilib/librte_eal/linux/include -I../lib/librte_eal/linux/include -Ilib/librte_eal/x86/include -I../lib/librte_eal/x86/include -Ilib/librte_eal/common -I../lib/librte_eal/common -Ilib/librte_eal -I../lib/librte_eal -Ilib/librte_kvargs -I../lib/librte_kvargs -Ilib/librte_metrics -I../lib/librte_metrics -Ilib/librte_telemetry -I../lib/librte_telemetry -Ilib/librte_net -I../lib/librte_net -Ilib/librte_mbuf -I../lib/librte_mbuf -Ilib/librte_mempool -I../lib/librte_mempool -Ilib/librte_ring -I../lib/librte_ring -Ilib/librte_meter -I../lib/librte_meter -Idrivers/bus/pci -I../drivers/bus/pci -I../drivers/bus/pci/linux -Ilib/librte_pci -I../lib/librte_pci -Idrivers/bus/vdev -I../drivers/bus/vdev -fdiagnostics-color=always -pipe -D_FILE_OFFSET_BITS=64 -Wall -Winvalid-pch -Werror -O3 -include rte_config.h -Wextra -Wcast-qual -Wdeprecated -Wformat-nonliteral -Wformat-security -Wmissing-declarations -Wmissing-prototypes -Wnested-externs -Wold-style-definition -Wpointer-arith -Wsign-compare -Wstrict-prototypes -Wundef -Wwrite-strings -Wno-address-of-packed-member -Wno-packed-not-aligned -Wno-missing-field-initializers -Wno-zero-length-bounds -D_GNU_SOURCE -fPIC -march=native -DALLOW_EXPERIMENTAL_API -DALLOW_INTERNAL_API -Wno-format-truncation -MD -MQ drivers/libtmp_rte_pmd_bnxt.a.p/net_bnxt_bnxt_cpr.c.o -MF drivers/libtmp_rte_pmd_bnxt.a.p/net_bnxt_bnxt_cpr.c.o.d -o drivers/libtmp_rte_pmd_bnxt.a.p/net_bnxt_bnxt_cpr.c.o -c ../drivers/net/bnxt/bnxt_cpr.c
../drivers/net/bnxt/bnxt_cpr.c: In function ‘bnxt_handle_async_event’:
../drivers/net/bnxt/bnxt_cpr.c:132:3: error: implicit declaration of function ‘_rte_eth_dev_callback_process’; did you mean ‘rte_eth_dev_callback_process’? [-Werror=implicit-function-declaration]
  132 |   _rte_eth_dev_callback_process(bp->eth_dev,
      |   ^~~~~~~~~~~~~~~~~~~~~~~~~~~~~
      |   rte_eth_dev_callback_process
../drivers/net/bnxt/bnxt_cpr.c:132:3: error: nested extern declaration of ‘_rte_eth_dev_callback_process’ [-Werror=nested-externs]
cc1: all warnings being treated as errors
[944/2600] Compiling C object drivers/libtmp_rte_pmd_bnxt.a.p/net_bnxt_bnxt_filter.c.o
[945/2600] Generating rte_pmd_bond.sym_chk with a meson_exe.py custom command
[946/2600] Compiling C object drivers/libtmp_rte_pmd_bnx2x.a.p/net_bnx2x_bnx2x_stats.c.o
[947/2600] Compiling C object drivers/libtmp_rte_pmd_bnxt.a.p/net_bnxt_bnxt_flow.c.o
[948/2600] Compiling C object drivers/libtmp_rte_pmd_bnxt.a.p/net_bnxt_bnxt_ethdev.c.o
FAILED: drivers/libtmp_rte_pmd_bnxt.a.p/net_bnxt_bnxt_ethdev.c.o 
gcc -Idrivers/libtmp_rte_pmd_bnxt.a.p -Idrivers -I../drivers -Idrivers/net/bnxt -I../drivers/net/bnxt -I../drivers/net/bnxt/tf_ulp -I../drivers/net/bnxt/tf_core -Ilib/librte_ethdev -I../lib/librte_ethdev -I. -I.. -Iconfig -I../config -Ilib/librte_eal/include -I../lib/librte_eal/include -Ilib/librte_eal/linux/include -I../lib/librte_eal/linux/include -Ilib/librte_eal/x86/include -I../lib/librte_eal/x86/include -Ilib/librte_eal/common -I../lib/librte_eal/common -Ilib/librte_eal -I../lib/librte_eal -Ilib/librte_kvargs -I../lib/librte_kvargs -Ilib/librte_metrics -I../lib/librte_metrics -Ilib/librte_telemetry -I../lib/librte_telemetry -Ilib/librte_net -I../lib/librte_net -Ilib/librte_mbuf -I../lib/librte_mbuf -Ilib/librte_mempool -I../lib/librte_mempool -Ilib/librte_ring -I../lib/librte_ring -Ilib/librte_meter -I../lib/librte_meter -Idrivers/bus/pci -I../drivers/bus/pci -I../drivers/bus/pci/linux -Ilib/librte_pci -I../lib/librte_pci -Idrivers/bus/vdev -I../drivers/bus/vdev -fdiagnostics-color=always -pipe -D_FILE_OFFSET_BITS=64 -Wall -Winvalid-pch -Werror -O3 -include rte_config.h -Wextra -Wcast-qual -Wdeprecated -Wformat-nonliteral -Wformat-security -Wmissing-declarations -Wmissing-prototypes -Wnested-externs -Wold-style-definition -Wpointer-arith -Wsign-compare -Wstrict-prototypes -Wundef -Wwrite-strings -Wno-address-of-packed-member -Wno-packed-not-aligned -Wno-missing-field-initializers -Wno-zero-length-bounds -D_GNU_SOURCE -fPIC -march=native -DALLOW_EXPERIMENTAL_API -DALLOW_INTERNAL_API -Wno-format-truncation -MD -MQ drivers/libtmp_rte_pmd_bnxt.a.p/net_bnxt_bnxt_ethdev.c.o -MF drivers/libtmp_rte_pmd_bnxt.a.p/net_bnxt_bnxt_ethdev.c.o.d -o drivers/libtmp_rte_pmd_bnxt.a.p/net_bnxt_bnxt_ethdev.c.o -c ../drivers/net/bnxt/bnxt_ethdev.c
../drivers/net/bnxt/bnxt_ethdev.c: In function ‘bnxt_dev_recover’:
../drivers/net/bnxt/bnxt_ethdev.c:4569:2: error: implicit declaration of function ‘_rte_eth_dev_callback_process’; did you mean ‘rte_eth_dev_callback_process’? [-Werror=implicit-function-declaration]
 4569 |  _rte_eth_dev_callback_process(bp->eth_dev,
      |  ^~~~~~~~~~~~~~~~~~~~~~~~~~~~~
      |  rte_eth_dev_callback_process
../drivers/net/bnxt/bnxt_ethdev.c:4569:2: error: nested extern declaration of ‘_rte_eth_dev_callback_process’ [-Werror=nested-externs]
cc1: all warnings being treated as errors
[949/2600] Compiling C object drivers/libtmp_rte_pmd_bnx2x.a.p/net_bnx2x_bnx2x.c.o
[950/2600] Compiling C object drivers/libtmp_rte_pmd_bnxt.a.p/net_bnxt_bnxt_hwrm.c.o
[951/2600] Compiling C object drivers/libtmp_rte_pmd_bnx2x.a.p/net_bnx2x_elink.c.o
[952/2600] Compiling C object lib/librte_pipeline.a.p/librte_pipeline_rte_table_action.c.o
ninja: build stopped: subcommand failed




*Build Failed #19:
OS: UB2004-64
Target: x86_64-native-linuxapp-icc
FAILED: drivers/libtmp_rte_pmd_bnxt.a.p/net_bnxt_bnxt_cpr.c.o 
icc -Idrivers/libtmp_rte_pmd_bnxt.a.p -Idrivers -I../drivers -Idrivers/net/bnxt -I../drivers/net/bnxt -I../drivers/net/bnxt/tf_ulp -I../drivers/net/bnxt/tf_core -Ilib/librte_ethdev -I../lib/librte_ethdev -I. -I.. -Iconfig -I../config -Ilib/librte_eal/include -I../lib/librte_eal/include -Ilib/librte_eal/linux/include -I../lib/librte_eal/linux/include -Ilib/librte_eal/x86/include -I../lib/librte_eal/x86/include -Ilib/librte_eal/common -I../lib/librte_eal/common -Ilib/librte_eal -I../lib/librte_eal -Ilib/librte_kvargs -I../lib/librte_kvargs -Ilib/librte_metrics -I../lib/librte_metrics -Ilib/librte_telemetry -I../lib/librte_telemetry -Ilib/librte_net -I../lib/librte_net -Ilib/librte_mbuf -I../lib/librte_mbuf -Ilib/librte_mempool -I../lib/librte_mempool -Ilib/librte_ring -I../lib/librte_ring -Ilib/librte_meter -I../lib/librte_meter -Idrivers/bus/pci -I../drivers/bus/pci -I../drivers/bus/pci/linux -Ilib/librte_pci -I../lib/librte_pci -Idrivers/bus/vdev -I../drivers/bus/vdev -pipe -D_FILE_OFFSET_BITS=64 -Wall -w3 -diag-disable:remark -Werror -O3 -include rte_config.h -Wextra -Wcast-qual -Wdeprecated -Wformat-security -Wmissing-declarations -Wmissing-prototypes -Wold-style-definition -Wpointer-arith -Wsign-compare -Wstrict-prototypes -Wundef -Wwrite-strings -Wno-missing-field-initializers -diag-disable=188 -diag-disable=2203 -diag-disable=2279 -diag-disable=2557 -diag-disable=3179 -diag-disable=3656 -D_GNU_SOURCE -fPIC -march=native -DALLOW_EXPERIMENTAL_API -DALLOW_INTERNAL_API -MD -MQ drivers/libtmp_rte_pmd_bnxt.a.p/net_bnxt_bnxt_cpr.c.o -MF drivers/libtmp_rte_pmd_bnxt.a.p/net_bnxt_bnxt_cpr.c.o.d -o drivers/libtmp_rte_pmd_bnxt.a.p/net_bnxt_bnxt_cpr.c.o -c ../drivers/net/bnxt/bnxt_cpr.c
../drivers/net/bnxt/bnxt_cpr.c(132): error #266: function "_rte_eth_dev_callback_process" declared implicitly
  		_rte_eth_dev_callback_process(bp->eth_dev,
  		^

compilation aborted for ../drivers/net/bnxt/bnxt_cpr.c (code 2)
[935/2600] Linking target drivers/librte_pmd_axgbe.so.21.0
[936/2600] Compiling C object drivers/libtmp_rte_pmd_bnx2x.a.p/net_bnx2x_bnx2x_stats.c.o
[937/2600] Compiling C object drivers/libtmp_rte_pmd_bnxt.a.p/net_bnxt_bnxt_ethdev.c.o
FAILED: drivers/libtmp_rte_pmd_bnxt.a.p/net_bnxt_bnxt_ethdev.c.o 
icc -Idrivers/libtmp_rte_pmd_bnxt.a.p -Idrivers -I../drivers -Idrivers/net/bnxt -I../drivers/net/bnxt -I../drivers/net/bnxt/tf_ulp -I../drivers/net/bnxt/tf_core -Ilib/librte_ethdev -I../lib/librte_ethdev -I. -I.. -Iconfig -I../config -Ilib/librte_eal/include -I../lib/librte_eal/include -Ilib/librte_eal/linux/include -I../lib/librte_eal/linux/include -Ilib/librte_eal/x86/include -I../lib/librte_eal/x86/include -Ilib/librte_eal/common -I../lib/librte_eal/common -Ilib/librte_eal -I../lib/librte_eal -Ilib/librte_kvargs -I../lib/librte_kvargs -Ilib/librte_metrics -I../lib/librte_metrics -Ilib/librte_telemetry -I../lib/librte_telemetry -Ilib/librte_net -I../lib/librte_net -Ilib/librte_mbuf -I../lib/librte_mbuf -Ilib/librte_mempool -I../lib/librte_mempool -Ilib/librte_ring -I../lib/librte_ring -Ilib/librte_meter -I../lib/librte_meter -Idrivers/bus/pci -I../drivers/bus/pci -I../drivers/bus/pci/linux -Ilib/librte_pci -I../lib/librte_pci -Idrivers/bus/vdev -I../drivers/bus/vdev -pipe -D_FILE_OFFSET_BITS=64 -Wall -w3 -diag-disable:remark -Werror -O3 -include rte_config.h -Wextra -Wcast-qual -Wdeprecated -Wformat-security -Wmissing-declarations -Wmissing-prototypes -Wold-style-definition -Wpointer-arith -Wsign-compare -Wstrict-prototypes -Wundef -Wwrite-strings -Wno-missing-field-initializers -diag-disable=188 -diag-disable=2203 -diag-disable=2279 -diag-disable=2557 -diag-disable=3179 -diag-disable=3656 -D_GNU_SOURCE -fPIC -march=native -DALLOW_EXPERIMENTAL_API -DALLOW_INTERNAL_API -MD -MQ drivers/libtmp_rte_pmd_bnxt.a.p/net_bnxt_bnxt_ethdev.c.o -MF drivers/libtmp_rte_pmd_bnxt.a.p/net_bnxt_bnxt_ethdev.c.o.d -o drivers/libtmp_rte_pmd_bnxt.a.p/net_bnxt_bnxt_ethdev.c.o -c ../drivers/net/bnxt/bnxt_ethdev.c
../drivers/net/bnxt/bnxt_ethdev.c(4569): error #266: function "_rte_eth_dev_callback_process" declared implicitly
  	_rte_eth_dev_callback_process(bp->eth_dev,
  	^

../drivers/net/bnxt/bnxt_ethdev.c(4717): error #266: function "_rte_eth_dev_callback_process" declared implicitly
  	_rte_eth_dev_callback_process(bp->eth_dev,
  	^

compilation aborted for ../drivers/net/bnxt/bnxt_ethdev.c (code 2)
[938/2600] Compiling C object drivers/libtmp_rte_pmd_bnx2x.a.p/net_bnx2x_bnx2x_rxtx.c.o
[939/2600] Compiling C object drivers/libtmp_rte_pmd_bond.a.p/net_bonding_rte_eth_bond_pmd.c.o
[940/2600] Compiling C object drivers/libtmp_rte_pmd_bond.a.p/net_bonding_rte_eth_bond_8023ad.c.o
[941/2600] Compiling C object drivers/libtmp_rte_pmd_bnx2x.a.p/net_bnx2x_bnx2x.c.o
[942/2600] Compiling C object drivers/libtmp_rte_pmd_bnx2x.a.p/net_bnx2x_elink.c.o
[943/2600] Compiling C object lib/librte_pipeline.a.p/librte_pipeline_rte_table_action.c.o
ninja: build stopped: subcommand failed




*Build Failed #20:
OS: UB2004-64
Target: x86_64-native-linuxapp-doc
FAILED: drivers/libtmp_rte_pmd_bnxt.a.p/net_bnxt_bnxt_cpr.c.o 
gcc -Idrivers/libtmp_rte_pmd_bnxt.a.p -Idrivers -I../drivers -Idrivers/net/bnxt -I../drivers/net/bnxt -I../drivers/net/bnxt/tf_ulp -I../drivers/net/bnxt/tf_core -Ilib/librte_ethdev -I../lib/librte_ethdev -I. -I.. -Iconfig -I../config -Ilib/librte_eal/include -I../lib/librte_eal/include -Ilib/librte_eal/linux/include -I../lib/librte_eal/linux/include -Ilib/librte_eal/x86/include -I../lib/librte_eal/x86/include -Ilib/librte_eal/common -I../lib/librte_eal/common -Ilib/librte_eal -I../lib/librte_eal -Ilib/librte_kvargs -I../lib/librte_kvargs -Ilib/librte_metrics -I../lib/librte_metrics -Ilib/librte_telemetry -I../lib/librte_telemetry -Ilib/librte_net -I../lib/librte_net -Ilib/librte_mbuf -I../lib/librte_mbuf -Ilib/librte_mempool -I../lib/librte_mempool -Ilib/librte_ring -I../lib/librte_ring -Ilib/librte_meter -I../lib/librte_meter -Idrivers/bus/pci -I../drivers/bus/pci -I../drivers/bus/pci/linux -Ilib/librte_pci -I../lib/librte_pci -Idrivers/bus/vdev -I../drivers/bus/vdev -fdiagnostics-color=always -pipe -D_FILE_OFFSET_BITS=64 -Wall -Winvalid-pch -Werror -O3 -include rte_config.h -Wextra -Wcast-qual -Wdeprecated -Wformat-nonliteral -Wformat-security -Wmissing-declarations -Wmissing-prototypes -Wnested-externs -Wold-style-definition -Wpointer-arith -Wsign-compare -Wstrict-prototypes -Wundef -Wwrite-strings -Wno-address-of-packed-member -Wno-packed-not-aligned -Wno-missing-field-initializers -D_GNU_SOURCE -fPIC -march=native -DALLOW_EXPERIMENTAL_API -DALLOW_INTERNAL_API -Wno-format-truncation -MD -MQ drivers/libtmp_rte_pmd_bnxt.a.p/net_bnxt_bnxt_cpr.c.o -MF drivers/libtmp_rte_pmd_bnxt.a.p/net_bnxt_bnxt_cpr.c.o.d -o drivers/libtmp_rte_pmd_bnxt.a.p/net_bnxt_bnxt_cpr.c.o -c ../drivers/net/bnxt/bnxt_cpr.c
../drivers/net/bnxt/bnxt_cpr.c: In function ‘bnxt_handle_async_event’:
../drivers/net/bnxt/bnxt_cpr.c:132:3: error: implicit declaration of function ‘_rte_eth_dev_callback_process’; did you mean ‘rte_eth_dev_callback_process’? [-Werror=implicit-function-declaration]
  132 |   _rte_eth_dev_callback_process(bp->eth_dev,
      |   ^~~~~~~~~~~~~~~~~~~~~~~~~~~~~
      |   rte_eth_dev_callback_process
../drivers/net/bnxt/bnxt_cpr.c:132:3: error: nested extern declaration of ‘_rte_eth_dev_callback_process’ [-Werror=nested-externs]
cc1: all warnings being treated as errors
[939/2459] Generating rte_pmd_bond.pmd.c with a custom command
[940/2459] Compiling C object drivers/libtmp_rte_pmd_bnxt.a.p/net_bnxt_bnxt_filter.c.o
[941/2459] Compiling C object drivers/libtmp_rte_pmd_bnx2x.a.p/net_bnx2x_bnx2x_stats.c.o
[942/2459] Compiling C object drivers/libtmp_rte_pmd_bnxt.a.p/net_bnxt_bnxt_flow.c.o
[943/2459] Compiling C object drivers/libtmp_rte_pmd_bnxt.a.p/net_bnxt_bnxt_ethdev.c.o
FAILED: drivers/libtmp_rte_pmd_bnxt.a.p/net_bnxt_bnxt_ethdev.c.o 
gcc -Idrivers/libtmp_rte_pmd_bnxt.a.p -Idrivers -I../drivers -Idrivers/net/bnxt -I../drivers/net/bnxt -I../drivers/net/bnxt/tf_ulp -I../drivers/net/bnxt/tf_core -Ilib/librte_ethdev -I../lib/librte_ethdev -I. -I.. -Iconfig -I../config -Ilib/librte_eal/include -I../lib/librte_eal/include -Ilib/librte_eal/linux/include -I../lib/librte_eal/linux/include -Ilib/librte_eal/x86/include -I../lib/librte_eal/x86/include -Ilib/librte_eal/common -I../lib/librte_eal/common -Ilib/librte_eal -I../lib/librte_eal -Ilib/librte_kvargs -I../lib/librte_kvargs -Ilib/librte_metrics -I../lib/librte_metrics -Ilib/librte_telemetry -I../lib/librte_telemetry -Ilib/librte_net -I../lib/librte_net -Ilib/librte_mbuf -I../lib/librte_mbuf -Ilib/librte_mempool -I../lib/librte_mempool -Ilib/librte_ring -I../lib/librte_ring -Ilib/librte_meter -I../lib/librte_meter -Idrivers/bus/pci -I../drivers/bus/pci -I../drivers/bus/pci/linux -Ilib/librte_pci -I../lib/librte_pci -Idrivers/bus/vdev -I../drivers/bus/vdev -fdiagnostics-color=always -pipe -D_FILE_OFFSET_BITS=64 -Wall -Winvalid-pch -Werror -O3 -include rte_config.h -Wextra -Wcast-qual -Wdeprecated -Wformat-nonliteral -Wformat-security -Wmissing-declarations -Wmissing-prototypes -Wnested-externs -Wold-style-definition -Wpointer-arith -Wsign-compare -Wstrict-prototypes -Wundef -Wwrite-strings -Wno-address-of-packed-member -Wno-packed-not-aligned -Wno-missing-field-initializers -D_GNU_SOURCE -fPIC -march=native -DALLOW_EXPERIMENTAL_API -DALLOW_INTERNAL_API -Wno-format-truncation -MD -MQ drivers/libtmp_rte_pmd_bnxt.a.p/net_bnxt_bnxt_ethdev.c.o -MF drivers/libtmp_rte_pmd_bnxt.a.p/net_bnxt_bnxt_ethdev.c.o.d -o drivers/libtmp_rte_pmd_bnxt.a.p/net_bnxt_bnxt_ethdev.c.o -c ../drivers/net/bnxt/bnxt_ethdev.c
../drivers/net/bnxt/bnxt_ethdev.c: In function ‘bnxt_dev_recover’:
../drivers/net/bnxt/bnxt_ethdev.c:4569:2: error: implicit declaration of function ‘_rte_eth_dev_callback_process’; did you mean ‘rte_eth_dev_callback_process’? [-Werror=implicit-function-declaration]
 4569 |  _rte_eth_dev_callback_process(bp->eth_dev,
      |  ^~~~~~~~~~~~~~~~~~~~~~~~~~~~~
      |  rte_eth_dev_callback_process
../drivers/net/bnxt/bnxt_ethdev.c:4569:2: error: nested extern declaration of ‘_rte_eth_dev_callback_process’ [-Werror=nested-externs]
cc1: all warnings being treated as errors
[944/2459] Compiling C object drivers/libtmp_rte_pmd_bnx2x.a.p/net_bnx2x_bnx2x.c.o
[945/2459] Compiling C object drivers/libtmp_rte_pmd_bnxt.a.p/net_bnxt_bnxt_hwrm.c.o
[946/2459] Compiling C object drivers/libtmp_rte_pmd_bnx2x.a.p/net_bnx2x_elink.c.o
[947/2459] Compiling C object lib/librte_pipeline.a.p/librte_pipeline_rte_table_action.c.o
ninja: build stopped: subcommand failed


DPDK STV team


More information about the test-report mailing list