[dpdk-test-report] |FAILURE| pw(91217) [v4, 3/3] net/ice: support FDIR for IP fragment packet

sys_stv at intel.com sys_stv at intel.com
Tue Apr 13 15:33:47 CEST 2021


Test-Label: Intel-compilation
Test-Status: FAILURE
http://dpdk.org/patch/91217

_Compilation issues_

Submitter: Jeff Guo <jia.guo at intel.com>
Date: 2021-04-13 08:48:12
Reply_mail: 20210413084812.61712-4-jia.guo at intel.com

DPDK git baseline: Repo:dpdk, CommitID: ff43cd79e395f0eb8c763ec7ab0338526ad201d8


Meson Build Summary: 22 Builds Done, 8 Successful, 14 Failures, 0 Blocked

+------------------+------------+--------------+------------+------------+-----------+----------+
| os               | gcc-static | clang-static | icc-static | gcc-shared | gcc-debug | document |
+------------------+------------+--------------+------------+------------+-----------+----------+
| UB2004-64        | FAIL       | pass         | pass       |            |           | FAIL     |
| RHEL83-64        | FAIL       |              |            |            |           |          |
| FC33-64          | FAIL       | pass         |            |            |           |          |
| CentOsStream8-64 | FAIL       |              |            |            |           |          |
| UB2010-64        | FAIL       |              |            |            |           |          |
| WIN10-64         |            | pass         |            |            |           |          |
| UB2004-32        | FAIL       |              |            |            |           |          |
| CENTOS83-64      | FAIL       | pass         | pass       | FAIL       | FAIL      |          |
| FreeBSD1201-64   | FAIL       | pass         |            | FAIL       | FAIL      |          |
| SUSE15-64        | FAIL       | pass         |            |            |           |          |
+------------------+------------+--------------+------------+------------+-----------+----------+
Test environment and configuration as below:


OS: UB2004-64
	Kernel Version: 5.8.0-48-generic
	GCC Version: gcc (Ubuntu 10.2.0-5ubuntu1~20.04) 10.2.0
	Clang Version: 10.0.0-4ubuntu1
	x86_64-native-linuxapp-clang
	x86_64-native-linuxapp-gcc
	x86_64-native-linuxapp-icc
	x86_64-native-linuxapp-doc

OS: RHEL83-64
	Kernel Version: 4.18.0-240.el8.x86_64
	GCC Version: gcc (GCC) 8.3.1 20191121 (Red Hat 8.3.1-5)
	Clang Version: 10.0.1 (Red Hat 10.0.1-1.module+el8.3.0+7459+90c24896)
	x86_64-native-linuxapp-gcc

OS: FC33-64
	Kernel Version: 5.8.16-300.fc33.x86_64
	GCC Version: gcc (GCC) 10.2.1 20201005 (Red Hat 10.2.1-5)
	Clang Version: 11.0.0 (Fedora 11.0.0-1.fc33)
	x86_64-native-linuxapp-gcc
	x86_64-native-linuxapp-clang

OS: CentOsStream8-64
	Kernel Version: 4.18.0-257.el8.x86_64
	GCC Version: gcc (GCC) 8.4.1 20200928 (Red Hat 8.4.1-1)
	Clang Version: 11.0.0 (Red Hat 11.0.0-0.2.rc2.module_el8.4.0+533+50191577)
	x86_64-native-linuxapp-gcc

OS: UB2010-64
	Kernel Version: 5.8.0-25-generic
	GCC Version: gcc (Ubuntu 10.2.0-13ubuntu1) 10.2.0
	Clang Version: 11.0.0-2
	x86_64-native-linuxapp-gcc

OS: WIN10-64
	Kernel Version: N/A
	GCC Version: N/A
	Clang Version: Clang 8.0.0
	x86_64-windows-clang

OS: UB2004-32
	Kernel Version: 5.8.0-48-generic
	GCC Version: gcc (Ubuntu 10.2.0-5ubuntu1~20.04) 10.2.0
	Clang Version: 10.0.0-4ubuntu1
	i686-native-linuxapp-gcc

OS: CENTOS83-64
	Kernel Version: 4.18.0-240.1.1.el8_3.x86_64
	GCC Version: gcc (GCC) 8.3.1 20191121 (Red Hat 8.3.1-5)
	Clang Version: 10.0.1 (Red Hat 10.0.1-1.module_el8.3.0+467+cb298d5b)
	x86_64-native-linuxapp-gcc
	x86_64-native-linuxapp-clang
	x86_64-native-linuxapp-icc
	x86_64-native-linuxapp-gcc+shared
	x86_64-native-linuxapp-gcc+debug

OS: FreeBSD1201-64
	Kernel Version: 12.1-RELEASE
	GCC Version: gcc (FreeBSD Ports Collection) 9.2.0
	Clang Version: 8.0.1 (tags/RELEASE_801/final 366581) (based on LLVM 8.0.1)
	x86_64-native-bsdapp-gcc
	x86_64-native-bsdapp-clang
	x86_64-native-bsdapp-gcc+shared
	x86_64-native-bsdapp-gcc+debug

OS: SUSE15-64
	Kernel Version: 5.3.18-lp152.57-default
	GCC Version: gcc (SUSE Linux) 7.5.0
	Clang Version: 9.0.1
	x86_64-native-linuxapp-clang
	x86_64-native-linuxapp-gcc



*Build Failed #1:
OS: CENTOS83-64
Target: x86_64-native-linuxapp-gcc
FAILED: drivers/libtmp_rte_net_ice.a.p/net_ice_ice_fdir_filter.c.o 
gcc -Idrivers/libtmp_rte_net_ice.a.p -Idrivers -I../drivers -Idrivers/net/ice -I../drivers/net/ice -Idrivers/net/ice/base -I../drivers/net/ice/base -Idrivers/common/iavf -I../drivers/common/iavf -Ilib/librte_ethdev -I../lib/librte_ethdev -I. -I.. -Iconfig -I../config -Ilib/librte_eal/include -I../lib/librte_eal/include -Ilib/librte_eal/linux/include -I../lib/librte_eal/linux/include -Ilib/librte_eal/x86/include -I../lib/librte_eal/x86/include -Ilib/librte_eal/common -I../lib/librte_eal/common -Ilib/librte_eal -I../lib/librte_eal -Ilib/librte_kvargs -I../lib/librte_kvargs -Ilib/librte_metrics -I../lib/librte_metrics -Ilib/librte_telemetry -I../lib/librte_telemetry -Ilib/librte_net -I../lib/librte_net -Ilib/librte_mbuf -I../lib/librte_mbuf -Ilib/librte_mempool -I../lib/librte_mempool -Ilib/librte_ring -I../lib/librte_ring -Ilib/librte_meter -I../lib/librte_meter -Idrivers/bus/pci -I../drivers/bus/pci -I../drivers/bus/pci/linux -Ilib/librte_pci -I../lib/librte_pci -Idrivers/bus/vdev -I../drivers/bus/vdev -Ilib/librte_hash -I../lib/librte_hash -Ilib/librte_rcu -I../lib/librte_rcu -fdiagnostics-color=always -pipe -D_FILE_OFFSET_BITS=64 -Wall -Winvalid-pch -Werror -O3 -include rte_config.h -Wextra -Wcast-qual -Wdeprecated -Wformat -Wformat-nonliteral -Wformat-security -Wmissing-declarations -Wmissing-prototypes -Wnested-externs -Wold-style-definition -Wpointer-arith -Wsign-compare -Wstrict-prototypes -Wundef -Wwrite-strings -Wno-packed-not-aligned -Wno-missing-field-initializers -D_GNU_SOURCE -fPIC -march=native -DALLOW_EXPERIMENTAL_API -DALLOW_INTERNAL_API -Wno-format-truncation -DCC_AVX512_SUPPORT -MD -MQ drivers/libtmp_rte_net_ice.a.p/net_ice_ice_fdir_filter.c.o -MF drivers/libtmp_rte_net_ice.a.p/net_ice_ice_fdir_filter.c.o.d -o drivers/libtmp_rte_net_ice.a.p/net_ice_ice_fdir_filter.c.o -c ../drivers/net/ice/ice_fdir_filter.c
../drivers/net/ice/ice_fdir_filter.c: In function ‘ice_fdir_parse’:
../drivers/net/ice/ice_fdir_filter.c:1658:19: error: ‘item_type’ may be used uninitialized in this function [-Werror=maybe-uninitialized]
         item_type ==
         ~~~~~~~~~~^~
         RTE_FLOW_ITEM_TYPE_IPV6_FRAG_EXT)) {
         ~~~~~~~~~~~~~~~~~~~~~~~~~~~~~~~~
../drivers/net/ice/ice_fdir_filter.c:1611:26: note: ‘item_type’ was declared here
  enum rte_flow_item_type item_type;
                          ^~~~~~~~~
cc1: all warnings being treated as errors
[1329/2727] Generating rte_net_ice_mingw with a custom command
[1330/2727] Linking static target drivers/net/ice/libice_avx512_lib.a
[1331/2727] Compiling C object drivers/libtmp_rte_net_ice.a.p/net_ice_ice_acl_filter.c.o
[1332/2727] Compiling C object drivers/libtmp_rte_net_ice.a.p/net_ice_ice_dcf_parent.c.o
[1333/2727] Compiling C object drivers/libtmp_rte_net_ice.a.p/net_ice_ice_dcf_vf_representor.c.o
[1334/2727] Compiling C object drivers/libtmp_rte_net_ice.a.p/net_ice_ice_ethdev.c.o
[1335/2727] Compiling C object drivers/libtmp_rte_net_ice.a.p/net_ice_ice_dcf.c.o
[1336/2727] Compiling C object drivers/libtmp_rte_net_ice.a.p/net_ice_ice_rxtx_vec_avx2.c.o
[1337/2727] Compiling C object drivers/libtmp_rte_net_ice.a.p/net_ice_ice_dcf_ethdev.c.o
[1338/2727] Compiling C object drivers/libtmp_rte_net_ice.a.p/net_ice_ice_rxtx.c.o
[1339/2727] Compiling C object drivers/libtmp_rte_net_ice.a.p/net_ice_ice_rxtx_vec_sse.c.o
ninja: build stopped




*Build Failed #2:
OS: CENTOS83-64
Target: x86_64-native-linuxapp-gcc+shared
FAILED: drivers/libtmp_rte_net_ice.a.p/net_ice_ice_fdir_filter.c.o 
gcc -Idrivers/libtmp_rte_net_ice.a.p -Idrivers -I../drivers -Idrivers/net/ice -I../drivers/net/ice -Idrivers/net/ice/base -I../drivers/net/ice/base -Idrivers/common/iavf -I../drivers/common/iavf -Ilib/librte_ethdev -I../lib/librte_ethdev -I. -I.. -Iconfig -I../config -Ilib/librte_eal/include -I../lib/librte_eal/include -Ilib/librte_eal/linux/include -I../lib/librte_eal/linux/include -Ilib/librte_eal/x86/include -I../lib/librte_eal/x86/include -Ilib/librte_eal/common -I../lib/librte_eal/common -Ilib/librte_eal -I../lib/librte_eal -Ilib/librte_kvargs -I../lib/librte_kvargs -Ilib/librte_metrics -I../lib/librte_metrics -Ilib/librte_telemetry -I../lib/librte_telemetry -Ilib/librte_net -I../lib/librte_net -Ilib/librte_mbuf -I../lib/librte_mbuf -Ilib/librte_mempool -I../lib/librte_mempool -Ilib/librte_ring -I../lib/librte_ring -Ilib/librte_meter -I../lib/librte_meter -Idrivers/bus/pci -I../drivers/bus/pci -I../drivers/bus/pci/linux -Ilib/librte_pci -I../lib/librte_pci -Idrivers/bus/vdev -I../drivers/bus/vdev -Ilib/librte_hash -I../lib/librte_hash -Ilib/librte_rcu -I../lib/librte_rcu -fdiagnostics-color=always -pipe -D_FILE_OFFSET_BITS=64 -Wall -Winvalid-pch -Werror -O3 -include rte_config.h -Wextra -Wcast-qual -Wdeprecated -Wformat -Wformat-nonliteral -Wformat-security -Wmissing-declarations -Wmissing-prototypes -Wnested-externs -Wold-style-definition -Wpointer-arith -Wsign-compare -Wstrict-prototypes -Wundef -Wwrite-strings -Wno-packed-not-aligned -Wno-missing-field-initializers -D_GNU_SOURCE -fPIC -march=native -DALLOW_EXPERIMENTAL_API -DALLOW_INTERNAL_API -Wno-format-truncation -DCC_AVX512_SUPPORT -MD -MQ drivers/libtmp_rte_net_ice.a.p/net_ice_ice_fdir_filter.c.o -MF drivers/libtmp_rte_net_ice.a.p/net_ice_ice_fdir_filter.c.o.d -o drivers/libtmp_rte_net_ice.a.p/net_ice_ice_fdir_filter.c.o -c ../drivers/net/ice/ice_fdir_filter.c
../drivers/net/ice/ice_fdir_filter.c: In function ‘ice_fdir_parse’:
../drivers/net/ice/ice_fdir_filter.c:1658:19: error: ‘item_type’ may be used uninitialized in this function [-Werror=maybe-uninitialized]
         item_type ==
         ~~~~~~~~~~^~
         RTE_FLOW_ITEM_TYPE_IPV6_FRAG_EXT)) {
         ~~~~~~~~~~~~~~~~~~~~~~~~~~~~~~~~
../drivers/net/ice/ice_fdir_filter.c:1611:26: note: ‘item_type’ was declared here
  enum rte_flow_item_type item_type;
                          ^~~~~~~~~
cc1: all warnings being treated as errors
[1359/2563] Compiling C object drivers/net/ice/base/libice_base.a.p/ice_flex_pipe.c.o
[1360/2563] Compiling C object drivers/libtmp_rte_net_ice.a.p/net_ice_ice_dcf_vf_representor.c.o
[1361/2563] Compiling C object drivers/libtmp_rte_net_ice.a.p/net_ice_ice_switch_filter.c.o
[1362/2563] Compiling C object drivers/net/igc/base/libigc_base.a.p/igc_mac.c.o
[1363/2563] Compiling C object drivers/libtmp_rte_net_ice.a.p/net_ice_ice_dcf_parent.c.o
[1364/2563] Compiling C object drivers/libtmp_rte_net_ice.a.p/net_ice_ice_dcf_ethdev.c.o
[1365/2563] Compiling C object drivers/libtmp_rte_net_ice.a.p/net_ice_ice_dcf.c.o
[1366/2563] Compiling C object drivers/libtmp_rte_net_ice.a.p/net_ice_ice_ethdev.c.o
[1367/2563] Compiling C object drivers/libtmp_rte_net_ice.a.p/net_ice_ice_rxtx_vec_avx2.c.o
[1368/2563] Compiling C object drivers/libtmp_rte_net_ice.a.p/net_ice_ice_rxtx.c.o
[1369/2563] Compiling C object drivers/libtmp_rte_net_ice.a.p/net_ice_ice_rxtx_vec_sse.c.o
ninja: build stopped




*Build Failed #3:
OS: CENTOS83-64
Target: x86_64-native-linuxapp-gcc+debug
FAILED: drivers/libtmp_rte_net_ice.a.p/net_ice_ice_fdir_filter.c.o 
gcc -Idrivers/libtmp_rte_net_ice.a.p -Idrivers -I../drivers -Idrivers/net/ice -I../drivers/net/ice -Idrivers/net/ice/base -I../drivers/net/ice/base -Idrivers/common/iavf -I../drivers/common/iavf -Ilib/librte_ethdev -I../lib/librte_ethdev -I. -I.. -Iconfig -I../config -Ilib/librte_eal/include -I../lib/librte_eal/include -Ilib/librte_eal/linux/include -I../lib/librte_eal/linux/include -Ilib/librte_eal/x86/include -I../lib/librte_eal/x86/include -Ilib/librte_eal/common -I../lib/librte_eal/common -Ilib/librte_eal -I../lib/librte_eal -Ilib/librte_kvargs -I../lib/librte_kvargs -Ilib/librte_metrics -I../lib/librte_metrics -Ilib/librte_telemetry -I../lib/librte_telemetry -Ilib/librte_net -I../lib/librte_net -Ilib/librte_mbuf -I../lib/librte_mbuf -Ilib/librte_mempool -I../lib/librte_mempool -Ilib/librte_ring -I../lib/librte_ring -Ilib/librte_meter -I../lib/librte_meter -Idrivers/bus/pci -I../drivers/bus/pci -I../drivers/bus/pci/linux -Ilib/librte_pci -I../lib/librte_pci -Idrivers/bus/vdev -I../drivers/bus/vdev -Ilib/librte_hash -I../lib/librte_hash -Ilib/librte_rcu -I../lib/librte_rcu -fdiagnostics-color=always -pipe -D_FILE_OFFSET_BITS=64 -Wall -Winvalid-pch -Werror -O2 -g -include rte_config.h -Wextra -Wcast-qual -Wdeprecated -Wformat -Wformat-nonliteral -Wformat-security -Wmissing-declarations -Wmissing-prototypes -Wnested-externs -Wold-style-definition -Wpointer-arith -Wsign-compare -Wstrict-prototypes -Wundef -Wwrite-strings -Wno-packed-not-aligned -Wno-missing-field-initializers -D_GNU_SOURCE -fPIC -march=native -DALLOW_EXPERIMENTAL_API -DALLOW_INTERNAL_API -Wno-format-truncation -DCC_AVX512_SUPPORT -MD -MQ drivers/libtmp_rte_net_ice.a.p/net_ice_ice_fdir_filter.c.o -MF drivers/libtmp_rte_net_ice.a.p/net_ice_ice_fdir_filter.c.o.d -o drivers/libtmp_rte_net_ice.a.p/net_ice_ice_fdir_filter.c.o -c ../drivers/net/ice/ice_fdir_filter.c
../drivers/net/ice/ice_fdir_filter.c: In function ‘ice_fdir_parse’:
../drivers/net/ice/ice_fdir_filter.c:1658:19: error: ‘item_type’ may be used uninitialized in this function [-Werror=maybe-uninitialized]
         item_type ==
         ~~~~~~~~~~^~
         RTE_FLOW_ITEM_TYPE_IPV6_FRAG_EXT)) {
         ~~~~~~~~~~~~~~~~~~~~~~~~~~~~~~~~
../drivers/net/ice/ice_fdir_filter.c:1611:26: note: ‘item_type’ was declared here
  enum rte_flow_item_type item_type;
                          ^~~~~~~~~
cc1: all warnings being treated as errors
[1347/2730] Compiling C object drivers/libtmp_rte_net_ice.a.p/net_ice_ice_ethdev.c.o
[1348/2730] Compiling C object drivers/libtmp_rte_net_ice.a.p/net_ice_ice_dcf.c.o
[1349/2730] Compiling C object drivers/libtmp_rte_net_ice.a.p/net_ice_ice_dcf_vf_representor.c.o
[1350/2730] Compiling C object drivers/net/igc/base/libigc_base.a.p/igc_mac.c.o
[1351/2730] Compiling C object drivers/libtmp_rte_net_ice.a.p/net_ice_ice_dcf_parent.c.o
[1352/2730] Compiling C object drivers/net/igc/base/libigc_base.a.p/igc_i225.c.o
[1353/2730] Compiling C object drivers/libtmp_rte_net_ice.a.p/net_ice_ice_rxtx_vec_avx2.c.o
[1354/2730] Compiling C object drivers/libtmp_rte_net_ice.a.p/net_ice_ice_rxtx.c.o
[1355/2730] Compiling C object drivers/libtmp_rte_net_ice.a.p/net_ice_ice_rxtx_vec_sse.c.o
ninja: build stopped




*Build Failed #4:
OS: FC33-64
Target: x86_64-native-linuxapp-gcc
FAILED: drivers/libtmp_rte_net_ice.a.p/net_ice_ice_fdir_filter.c.o 
gcc -Idrivers/libtmp_rte_net_ice.a.p -Idrivers -I../drivers -Idrivers/net/ice -I../drivers/net/ice -Idrivers/net/ice/base -I../drivers/net/ice/base -Idrivers/common/iavf -I../drivers/common/iavf -Ilib/librte_ethdev -I../lib/librte_ethdev -I. -I.. -Iconfig -I../config -Ilib/librte_eal/include -I../lib/librte_eal/include -Ilib/librte_eal/linux/include -I../lib/librte_eal/linux/include -Ilib/librte_eal/x86/include -I../lib/librte_eal/x86/include -Ilib/librte_eal/common -I../lib/librte_eal/common -Ilib/librte_eal -I../lib/librte_eal -Ilib/librte_kvargs -I../lib/librte_kvargs -Ilib/librte_metrics -I../lib/librte_metrics -Ilib/librte_telemetry -I../lib/librte_telemetry -Ilib/librte_net -I../lib/librte_net -Ilib/librte_mbuf -I../lib/librte_mbuf -Ilib/librte_mempool -I../lib/librte_mempool -Ilib/librte_ring -I../lib/librte_ring -Ilib/librte_meter -I../lib/librte_meter -Idrivers/bus/pci -I../drivers/bus/pci -I../drivers/bus/pci/linux -Ilib/librte_pci -I../lib/librte_pci -Idrivers/bus/vdev -I../drivers/bus/vdev -Ilib/librte_hash -I../lib/librte_hash -Ilib/librte_rcu -I../lib/librte_rcu -fdiagnostics-color=always -pipe -D_FILE_OFFSET_BITS=64 -Wall -Winvalid-pch -Werror -O3 -include rte_config.h -Wextra -Wcast-qual -Wdeprecated -Wformat -Wformat-nonliteral -Wformat-security -Wmissing-declarations -Wmissing-prototypes -Wnested-externs -Wold-style-definition -Wpointer-arith -Wsign-compare -Wstrict-prototypes -Wundef -Wwrite-strings -Wno-address-of-packed-member -Wno-packed-not-aligned -Wno-missing-field-initializers -Wno-zero-length-bounds -D_GNU_SOURCE -fPIC -march=native -DALLOW_EXPERIMENTAL_API -DALLOW_INTERNAL_API -Wno-format-truncation -DCC_AVX512_SUPPORT -MD -MQ drivers/libtmp_rte_net_ice.a.p/net_ice_ice_fdir_filter.c.o -MF drivers/libtmp_rte_net_ice.a.p/net_ice_ice_fdir_filter.c.o.d -o drivers/libtmp_rte_net_ice.a.p/net_ice_ice_fdir_filter.c.o -c ../drivers/net/ice/ice_fdir_filter.c
../drivers/net/ice/ice_fdir_filter.c: In function ‘ice_fdir_parse’:
../drivers/net/ice/ice_fdir_filter.c:1658:19: error: ‘item_type’ may be used uninitialized in this function [-Werror=maybe-uninitialized]
 1658 |         item_type ==
      |         ~~~~~~~~~~^~
 1659 |         RTE_FLOW_ITEM_TYPE_IPV6_FRAG_EXT)) {
      |         ~~~~~~~~~~~~~~~~~~~~~~~~~~~~~~~~
../drivers/net/ice/ice_fdir_filter.c:1611:26: note: ‘item_type’ was declared here
 1611 |  enum rte_flow_item_type item_type;
      |                          ^~~~~~~~~
cc1: all warnings being treated as errors
[1334/2729] Compiling C object drivers/libtmp_rte_net_ice.a.p/net_ice_ice_acl_filter.c.o
[1335/2729] Compiling C object drivers/libtmp_rte_net_ice.a.p/net_ice_ice_dcf_ethdev.c.o
[1336/2729] Compiling C object drivers/libtmp_rte_net_ice.a.p/net_ice_ice_ethdev.c.o
[1337/2729] Compiling C object drivers/net/igc/base/libigc_base.a.p/igc_i225.c.o
[1338/2729] Compiling C object drivers/libtmp_rte_net_ice.a.p/net_ice_ice_rxtx.c.o
[1339/2729] Compiling C object drivers/libtmp_rte_net_ice.a.p/net_ice_ice_dcf_vf_representor.c.o
[1340/2729] Compiling C object drivers/net/igc/base/libigc_base.a.p/igc_mac.c.o
[1341/2729] Compiling C object drivers/libtmp_rte_net_ice.a.p/net_ice_ice_rxtx_vec_avx2.c.o
[1342/2729] Compiling C object drivers/libtmp_rte_net_ice.a.p/net_ice_ice_dcf.c.o
[1343/2729] Compiling C object drivers/libtmp_rte_net_ice.a.p/net_ice_ice_dcf_parent.c.o
[1344/2729] Compiling C object drivers/libtmp_rte_net_ice.a.p/net_ice_ice_rxtx_vec_sse.c.o
ninja: build stopped




*Build Failed #5:
OS: FreeBSD1201-64
Target: x86_64-native-bsdapp-gcc
FAILED: drivers/libtmp_rte_net_ice.a.p/net_ice_ice_fdir_filter.c.o 
gcc -Idrivers/libtmp_rte_net_ice.a.p -Idrivers -I../drivers -Idrivers/net/ice -I../drivers/net/ice -Idrivers/net/ice/base -I../drivers/net/ice/base -Idrivers/common/iavf -I../drivers/common/iavf -Ilib/librte_ethdev -I../lib/librte_ethdev -I. -I.. -Iconfig -I../config -Ilib/librte_eal/include -I../lib/librte_eal/include -Ilib/librte_eal/freebsd/include -I../lib/librte_eal/freebsd/include -Ilib/librte_eal/x86/include -I../lib/librte_eal/x86/include -Ilib/librte_eal/common -I../lib/librte_eal/common -Ilib/librte_eal -I../lib/librte_eal -Ilib/librte_kvargs -I../lib/librte_kvargs -Ilib/librte_metrics -I../lib/librte_metrics -Ilib/librte_telemetry -I../lib/librte_telemetry -Ilib/librte_net -I../lib/librte_net -Ilib/librte_mbuf -I../lib/librte_mbuf -Ilib/librte_mempool -I../lib/librte_mempool -Ilib/librte_ring -I../lib/librte_ring -Ilib/librte_meter -I../lib/librte_meter -Idrivers/bus/pci -I../drivers/bus/pci -I../drivers/bus/pci/bsd -Ilib/librte_pci -I../lib/librte_pci -Idrivers/bus/vdev -I../drivers/bus/vdev -Ilib/librte_hash -I../lib/librte_hash -Ilib/librte_rcu -I../lib/librte_rcu -fdiagnostics-color=always -pipe -D_FILE_OFFSET_BITS=64 -Wall -Winvalid-pch -Werror -O3 -include rte_config.h -Wextra -Wcast-qual -Wdeprecated -Wformat -Wformat-nonliteral -Wformat-security -Wmissing-declarations -Wmissing-prototypes -Wnested-externs -Wold-style-definition -Wpointer-arith -Wsign-compare -Wstrict-prototypes -Wundef -Wwrite-strings -Wno-address-of-packed-member -Wno-packed-not-aligned -Wno-missing-field-initializers -D_GNU_SOURCE -D__BSD_VISIBLE -fPIC -march=native -mno-avx512f -DALLOW_EXPERIMENTAL_API -DALLOW_INTERNAL_API -Wno-format-truncation -MD -MQ drivers/libtmp_rte_net_ice.a.p/net_ice_ice_fdir_filter.c.o -MF drivers/libtmp_rte_net_ice.a.p/net_ice_ice_fdir_filter.c.o.d -o drivers/libtmp_rte_net_ice.a.p/net_ice_ice_fdir_filter.c.o -c ../drivers/net/ice/ice_fdir_filter.c
../drivers/net/ice/ice_fdir_filter.c: In function 'ice_fdir_parse':
../drivers/net/ice/ice_fdir_filter.c:1658:19: error: 'item_type' may be used uninitialized in this function [-Werror=maybe-uninitialized]
 1658 |         item_type ==
      |         ~~~~~~~~~~^~
 1659 |         RTE_FLOW_ITEM_TYPE_IPV6_FRAG_EXT)) {
      |         ~~~~~~~~~~~~~~~~~~~~~~~~~~~~~~~~
../drivers/net/ice/ice_fdir_filter.c:1611:26: note: 'item_type' was declared here
 1611 |  enum rte_flow_item_type item_type;
      |                          ^~~~~~~~~
cc1: all warnings being treated as errors
[1010/1945] Compiling C object drivers/libtmp_rte_net_ice.a.p/net_ice_ice_hash.c.o
[1011/1945] Compiling C object drivers/libtmp_rte_net_ice.a.p/net_ice_ice_acl_filter.c.o
[1012/1945] Compiling C object drivers/libtmp_rte_net_ice.a.p/net_ice_ice_dcf.c.o
[1013/1945] Compiling C object drivers/libtmp_rte_net_ice.a.p/net_ice_ice_rxtx_vec_avx2.c.o
[1014/1945] Compiling C object drivers/libtmp_rte_net_ice.a.p/net_ice_ice_rxtx_vec_sse.c.o
ninja: build stopped




*Build Failed #6:
OS: FreeBSD1201-64
Target: x86_64-native-bsdapp-gcc+shared
FAILED: drivers/libtmp_rte_net_ice.a.p/net_ice_ice_fdir_filter.c.o 
gcc -Idrivers/libtmp_rte_net_ice.a.p -Idrivers -I../drivers -Idrivers/net/ice -I../drivers/net/ice -Idrivers/net/ice/base -I../drivers/net/ice/base -Idrivers/common/iavf -I../drivers/common/iavf -Ilib/librte_ethdev -I../lib/librte_ethdev -I. -I.. -Iconfig -I../config -Ilib/librte_eal/include -I../lib/librte_eal/include -Ilib/librte_eal/freebsd/include -I../lib/librte_eal/freebsd/include -Ilib/librte_eal/x86/include -I../lib/librte_eal/x86/include -Ilib/librte_eal/common -I../lib/librte_eal/common -Ilib/librte_eal -I../lib/librte_eal -Ilib/librte_kvargs -I../lib/librte_kvargs -Ilib/librte_metrics -I../lib/librte_metrics -Ilib/librte_telemetry -I../lib/librte_telemetry -Ilib/librte_net -I../lib/librte_net -Ilib/librte_mbuf -I../lib/librte_mbuf -Ilib/librte_mempool -I../lib/librte_mempool -Ilib/librte_ring -I../lib/librte_ring -Ilib/librte_meter -I../lib/librte_meter -Idrivers/bus/pci -I../drivers/bus/pci -I../drivers/bus/pci/bsd -Ilib/librte_pci -I../lib/librte_pci -Idrivers/bus/vdev -I../drivers/bus/vdev -Ilib/librte_hash -I../lib/librte_hash -Ilib/librte_rcu -I../lib/librte_rcu -fdiagnostics-color=always -pipe -D_FILE_OFFSET_BITS=64 -Wall -Winvalid-pch -Werror -O3 -include rte_config.h -Wextra -Wcast-qual -Wdeprecated -Wformat -Wformat-nonliteral -Wformat-security -Wmissing-declarations -Wmissing-prototypes -Wnested-externs -Wold-style-definition -Wpointer-arith -Wsign-compare -Wstrict-prototypes -Wundef -Wwrite-strings -Wno-address-of-packed-member -Wno-packed-not-aligned -Wno-missing-field-initializers -D_GNU_SOURCE -D__BSD_VISIBLE -fPIC -march=native -mno-avx512f -DALLOW_EXPERIMENTAL_API -DALLOW_INTERNAL_API -Wno-format-truncation -MD -MQ drivers/libtmp_rte_net_ice.a.p/net_ice_ice_fdir_filter.c.o -MF drivers/libtmp_rte_net_ice.a.p/net_ice_ice_fdir_filter.c.o.d -o drivers/libtmp_rte_net_ice.a.p/net_ice_ice_fdir_filter.c.o -c ../drivers/net/ice/ice_fdir_filter.c
../drivers/net/ice/ice_fdir_filter.c: In function 'ice_fdir_parse':
../drivers/net/ice/ice_fdir_filter.c:1658:19: error: 'item_type' may be used uninitialized in this function [-Werror=maybe-uninitialized]
 1658 |         item_type ==
      |         ~~~~~~~~~~^~
 1659 |         RTE_FLOW_ITEM_TYPE_IPV6_FRAG_EXT)) {
      |         ~~~~~~~~~~~~~~~~~~~~~~~~~~~~~~~~
../drivers/net/ice/ice_fdir_filter.c:1611:26: note: 'item_type' was declared here
 1611 |  enum rte_flow_item_type item_type;
      |                          ^~~~~~~~~
cc1: all warnings being treated as errors
[1031/1827] Compiling C object drivers/libtmp_rte_net_ice.a.p/net_ice_ice_acl_filter.c.o
[1032/1827] Compiling C object drivers/libtmp_rte_net_ice.a.p/net_ice_ice_ethdev.c.o
[1033/1827] Compiling C object drivers/libtmp_rte_net_ice.a.p/net_ice_ice_rxtx_vec_avx2.c.o
[1034/1827] Compiling C object drivers/libtmp_rte_net_ice.a.p/net_ice_ice_rxtx.c.o
[1035/1827] Compiling C object drivers/libtmp_rte_net_ice.a.p/net_ice_ice_rxtx_vec_sse.c.o
ninja: build stopped




*Build Failed #7:
OS: FreeBSD1201-64
Target: x86_64-native-bsdapp-gcc+debug
FAILED: drivers/libtmp_rte_net_ice.a.p/net_ice_ice_fdir_filter.c.o 
gcc -Idrivers/libtmp_rte_net_ice.a.p -Idrivers -I../drivers -Idrivers/net/ice -I../drivers/net/ice -Idrivers/net/ice/base -I../drivers/net/ice/base -Idrivers/common/iavf -I../drivers/common/iavf -Ilib/librte_ethdev -I../lib/librte_ethdev -I. -I.. -Iconfig -I../config -Ilib/librte_eal/include -I../lib/librte_eal/include -Ilib/librte_eal/freebsd/include -I../lib/librte_eal/freebsd/include -Ilib/librte_eal/x86/include -I../lib/librte_eal/x86/include -Ilib/librte_eal/common -I../lib/librte_eal/common -Ilib/librte_eal -I../lib/librte_eal -Ilib/librte_kvargs -I../lib/librte_kvargs -Ilib/librte_metrics -I../lib/librte_metrics -Ilib/librte_telemetry -I../lib/librte_telemetry -Ilib/librte_net -I../lib/librte_net -Ilib/librte_mbuf -I../lib/librte_mbuf -Ilib/librte_mempool -I../lib/librte_mempool -Ilib/librte_ring -I../lib/librte_ring -Ilib/librte_meter -I../lib/librte_meter -Idrivers/bus/pci -I../drivers/bus/pci -I../drivers/bus/pci/bsd -Ilib/librte_pci -I../lib/librte_pci -Idrivers/bus/vdev -I../drivers/bus/vdev -Ilib/librte_hash -I../lib/librte_hash -Ilib/librte_rcu -I../lib/librte_rcu -fdiagnostics-color=always -pipe -D_FILE_OFFSET_BITS=64 -Wall -Winvalid-pch -Werror -O2 -g -include rte_config.h -Wextra -Wcast-qual -Wdeprecated -Wformat -Wformat-nonliteral -Wformat-security -Wmissing-declarations -Wmissing-prototypes -Wnested-externs -Wold-style-definition -Wpointer-arith -Wsign-compare -Wstrict-prototypes -Wundef -Wwrite-strings -Wno-address-of-packed-member -Wno-packed-not-aligned -Wno-missing-field-initializers -D_GNU_SOURCE -D__BSD_VISIBLE -fPIC -march=native -mno-avx512f -DALLOW_EXPERIMENTAL_API -DALLOW_INTERNAL_API -Wno-format-truncation -MD -MQ drivers/libtmp_rte_net_ice.a.p/net_ice_ice_fdir_filter.c.o -MF drivers/libtmp_rte_net_ice.a.p/net_ice_ice_fdir_filter.c.o.d -o drivers/libtmp_rte_net_ice.a.p/net_ice_ice_fdir_filter.c.o -c ../drivers/net/ice/ice_fdir_filter.c
../drivers/net/ice/ice_fdir_filter.c: In function 'ice_fdir_parse':
../drivers/net/ice/ice_fdir_filter.c:1658:19: error: 'item_type' may be used uninitialized in this function [-Werror=maybe-uninitialized]
 1658 |         item_type ==
      |         ~~~~~~~~~~^~
 1659 |         RTE_FLOW_ITEM_TYPE_IPV6_FRAG_EXT)) {
      |         ~~~~~~~~~~~~~~~~~~~~~~~~~~~~~~~~
../drivers/net/ice/ice_fdir_filter.c:1611:26: note: 'item_type' was declared here
 1611 |  enum rte_flow_item_type item_type;
      |                          ^~~~~~~~~
cc1: all warnings being treated as errors
[1009/1945] Compiling C object drivers/libtmp_rte_net_ice.a.p/net_ice_ice_acl_filter.c.o
[1010/1945] Compiling C object drivers/libtmp_rte_net_ice.a.p/net_ice_ice_ethdev.c.o
[1011/1945] Compiling C object drivers/libtmp_rte_net_ice.a.p/net_ice_ice_rxtx.c.o
[1012/1945] Compiling C object drivers/libtmp_rte_net_ice.a.p/net_ice_ice_rxtx_vec_sse.c.o
[1013/1945] Compiling C object drivers/libtmp_rte_net_ice.a.p/net_ice_ice_rxtx_vec_avx2.c.o
ninja: build stopped




*Build Failed #8:
OS: RHEL83-64
Target: x86_64-native-linuxapp-gcc
FAILED: drivers/libtmp_rte_net_ice.a.p/net_ice_ice_fdir_filter.c.o 
gcc -Idrivers/libtmp_rte_net_ice.a.p -Idrivers -I../drivers -Idrivers/net/ice -I../drivers/net/ice -Idrivers/net/ice/base -I../drivers/net/ice/base -Idrivers/common/iavf -I../drivers/common/iavf -Ilib/librte_ethdev -I../lib/librte_ethdev -I. -I.. -Iconfig -I../config -Ilib/librte_eal/include -I../lib/librte_eal/include -Ilib/librte_eal/linux/include -I../lib/librte_eal/linux/include -Ilib/librte_eal/x86/include -I../lib/librte_eal/x86/include -Ilib/librte_eal/common -I../lib/librte_eal/common -Ilib/librte_eal -I../lib/librte_eal -Ilib/librte_kvargs -I../lib/librte_kvargs -Ilib/librte_metrics -I../lib/librte_metrics -Ilib/librte_telemetry -I../lib/librte_telemetry -Ilib/librte_net -I../lib/librte_net -Ilib/librte_mbuf -I../lib/librte_mbuf -Ilib/librte_mempool -I../lib/librte_mempool -Ilib/librte_ring -I../lib/librte_ring -Ilib/librte_meter -I../lib/librte_meter -Idrivers/bus/pci -I../drivers/bus/pci -I../drivers/bus/pci/linux -Ilib/librte_pci -I../lib/librte_pci -Idrivers/bus/vdev -I../drivers/bus/vdev -Ilib/librte_hash -I../lib/librte_hash -Ilib/librte_rcu -I../lib/librte_rcu -fdiagnostics-color=always -pipe -D_FILE_OFFSET_BITS=64 -Wall -Winvalid-pch -Werror -O3 -include rte_config.h -Wextra -Wcast-qual -Wdeprecated -Wformat -Wformat-nonliteral -Wformat-security -Wmissing-declarations -Wmissing-prototypes -Wnested-externs -Wold-style-definition -Wpointer-arith -Wsign-compare -Wstrict-prototypes -Wundef -Wwrite-strings -Wno-packed-not-aligned -Wno-missing-field-initializers -D_GNU_SOURCE -fPIC -march=native -DALLOW_EXPERIMENTAL_API -DALLOW_INTERNAL_API -Wno-format-truncation -DCC_AVX512_SUPPORT -MD -MQ drivers/libtmp_rte_net_ice.a.p/net_ice_ice_fdir_filter.c.o -MF drivers/libtmp_rte_net_ice.a.p/net_ice_ice_fdir_filter.c.o.d -o drivers/libtmp_rte_net_ice.a.p/net_ice_ice_fdir_filter.c.o -c ../drivers/net/ice/ice_fdir_filter.c
../drivers/net/ice/ice_fdir_filter.c: In function ‘ice_fdir_parse’:
../drivers/net/ice/ice_fdir_filter.c:1658:19: error: ‘item_type’ may be used uninitialized in this function [-Werror=maybe-uninitialized]
         item_type ==
         ~~~~~~~~~~^~
         RTE_FLOW_ITEM_TYPE_IPV6_FRAG_EXT)) {
         ~~~~~~~~~~~~~~~~~~~~~~~~~~~~~~~~
../drivers/net/ice/ice_fdir_filter.c:1611:26: note: ‘item_type’ was declared here
  enum rte_flow_item_type item_type;
                          ^~~~~~~~~
cc1: all warnings being treated as errors
[1341/2730] Compiling C object drivers/libtmp_rte_net_ice.a.p/net_ice_ice_switch_filter.c.o
[1342/2730] Compiling C object drivers/libtmp_rte_net_ice.a.p/net_ice_ice_acl_filter.c.o
[1343/2730] Compiling C object drivers/libtmp_rte_net_ice.a.p/net_ice_ice_dcf_ethdev.c.o
[1344/2730] Compiling C object drivers/libtmp_rte_net_ice.a.p/net_ice_ice_dcf.c.o
[1345/2730] Compiling C object drivers/libtmp_rte_net_ice.a.p/net_ice_ice_ethdev.c.o
[1346/2730] Compiling C object drivers/libtmp_rte_net_ice.a.p/net_ice_ice_dcf_vf_representor.c.o
[1347/2730] Compiling C object drivers/libtmp_rte_net_ice.a.p/net_ice_ice_rxtx.c.o
[1348/2730] Compiling C object drivers/libtmp_rte_net_ice.a.p/net_ice_ice_rxtx_vec_avx2.c.o
[1349/2730] Compiling C object drivers/libtmp_rte_net_ice.a.p/net_ice_ice_rxtx_vec_sse.c.o
ninja: build stopped




*Build Failed #9:
OS: SUSE15-64
Target: x86_64-native-linuxapp-gcc
FAILED: drivers/libtmp_rte_net_ice.a.p/net_ice_ice_fdir_filter.c.o 
gcc -Idrivers/libtmp_rte_net_ice.a.p -Idrivers -I../drivers -Idrivers/net/ice -I../drivers/net/ice -Idrivers/net/ice/base -I../drivers/net/ice/base -Idrivers/common/iavf -I../drivers/common/iavf -Ilib/librte_ethdev -I../lib/librte_ethdev -I. -I.. -Iconfig -I../config -Ilib/librte_eal/include -I../lib/librte_eal/include -Ilib/librte_eal/linux/include -I../lib/librte_eal/linux/include -Ilib/librte_eal/x86/include -I../lib/librte_eal/x86/include -Ilib/librte_eal/common -I../lib/librte_eal/common -Ilib/librte_eal -I../lib/librte_eal -Ilib/librte_kvargs -I../lib/librte_kvargs -Ilib/librte_metrics -I../lib/librte_metrics -Ilib/librte_telemetry -I../lib/librte_telemetry -Ilib/librte_net -I../lib/librte_net -Ilib/librte_mbuf -I../lib/librte_mbuf -Ilib/librte_mempool -I../lib/librte_mempool -Ilib/librte_ring -I../lib/librte_ring -Ilib/librte_meter -I../lib/librte_meter -Idrivers/bus/pci -I../drivers/bus/pci -I../drivers/bus/pci/linux -Ilib/librte_pci -I../lib/librte_pci -Idrivers/bus/vdev -I../drivers/bus/vdev -Ilib/librte_hash -I../lib/librte_hash -Ilib/librte_rcu -I../lib/librte_rcu -fdiagnostics-color=always -pipe -D_FILE_OFFSET_BITS=64 -Wall -Winvalid-pch -Werror -O3 -include rte_config.h -Wextra -Wcast-qual -Wdeprecated -Wformat -Wformat-nonliteral -Wformat-security -Wmissing-declarations -Wmissing-prototypes -Wnested-externs -Wold-style-definition -Wpointer-arith -Wsign-compare -Wstrict-prototypes -Wundef -Wwrite-strings -Wno-missing-field-initializers -D_GNU_SOURCE -fPIC -march=native -DALLOW_EXPERIMENTAL_API -DALLOW_INTERNAL_API -Wno-format-truncation -DCC_AVX512_SUPPORT -MD -MQ drivers/libtmp_rte_net_ice.a.p/net_ice_ice_fdir_filter.c.o -MF drivers/libtmp_rte_net_ice.a.p/net_ice_ice_fdir_filter.c.o.d -o drivers/libtmp_rte_net_ice.a.p/net_ice_ice_fdir_filter.c.o -c ../drivers/net/ice/ice_fdir_filter.c
../drivers/net/ice/ice_fdir_filter.c: In function ‘ice_fdir_parse’:
../drivers/net/ice/ice_fdir_filter.c:1658:19: error: ‘item_type’ may be used uninitialized in this function [-Werror=maybe-uninitialized]
         item_type ==
         ~~~~~~~~~~^~
         RTE_FLOW_ITEM_TYPE_IPV6_FRAG_EXT)) {
         ~~~~~~~~~~~~~~~~~~~~~~~~~~~~~~~~
../drivers/net/ice/ice_fdir_filter.c:1611:26: note: ‘item_type’ was declared here
  enum rte_flow_item_type item_type;
                          ^~~~~~~~~
cc1: all warnings being treated as errors
[1325/2659] Compiling C object drivers/libtmp_rte_net_ice.a.p/net_ice_ice_hash.c.o
[1326/2659] Compiling C object drivers/net/ice/libice_avx512_lib.a.p/ice_rxtx_vec_avx512.c.o
[1327/2659] Compiling C object drivers/libtmp_rte_net_ice.a.p/net_ice_ice_acl_filter.c.o
[1328/2659] Compiling C object drivers/libtmp_rte_net_ice.a.p/net_ice_ice_ethdev.c.o
[1329/2659] Compiling C object drivers/libtmp_rte_net_ice.a.p/net_ice_ice_rxtx.c.o
[1330/2659] Compiling C object drivers/libtmp_rte_net_ice.a.p/net_ice_ice_rxtx_vec_avx2.c.o
[1331/2659] Compiling C object drivers/libtmp_rte_net_ice.a.p/net_ice_ice_rxtx_vec_sse.c.o
ninja: build stopped




*Build Failed #10:
OS: CentOsStream8-64
Target: x86_64-native-linuxapp-gcc
FAILED: drivers/libtmp_rte_net_ice.a.p/net_ice_ice_fdir_filter.c.o 
gcc -Idrivers/libtmp_rte_net_ice.a.p -Idrivers -I../drivers -Idrivers/net/ice -I../drivers/net/ice -Idrivers/net/ice/base -I../drivers/net/ice/base -Idrivers/common/iavf -I../drivers/common/iavf -Ilib/librte_ethdev -I../lib/librte_ethdev -I. -I.. -Iconfig -I../config -Ilib/librte_eal/include -I../lib/librte_eal/include -Ilib/librte_eal/linux/include -I../lib/librte_eal/linux/include -Ilib/librte_eal/x86/include -I../lib/librte_eal/x86/include -Ilib/librte_eal/common -I../lib/librte_eal/common -Ilib/librte_eal -I../lib/librte_eal -Ilib/librte_kvargs -I../lib/librte_kvargs -Ilib/librte_metrics -I../lib/librte_metrics -Ilib/librte_telemetry -I../lib/librte_telemetry -Ilib/librte_net -I../lib/librte_net -Ilib/librte_mbuf -I../lib/librte_mbuf -Ilib/librte_mempool -I../lib/librte_mempool -Ilib/librte_ring -I../lib/librte_ring -Ilib/librte_meter -I../lib/librte_meter -Idrivers/bus/pci -I../drivers/bus/pci -I../drivers/bus/pci/linux -Ilib/librte_pci -I../lib/librte_pci -Idrivers/bus/vdev -I../drivers/bus/vdev -Ilib/librte_hash -I../lib/librte_hash -Ilib/librte_rcu -I../lib/librte_rcu -fdiagnostics-color=always -pipe -D_FILE_OFFSET_BITS=64 -Wall -Winvalid-pch -Werror -O3 -include rte_config.h -Wextra -Wcast-qual -Wdeprecated -Wformat -Wformat-nonliteral -Wformat-security -Wmissing-declarations -Wmissing-prototypes -Wnested-externs -Wold-style-definition -Wpointer-arith -Wsign-compare -Wstrict-prototypes -Wundef -Wwrite-strings -Wno-packed-not-aligned -Wno-missing-field-initializers -D_GNU_SOURCE -fPIC -march=native -DALLOW_EXPERIMENTAL_API -DALLOW_INTERNAL_API -Wno-format-truncation -DCC_AVX512_SUPPORT -MD -MQ drivers/libtmp_rte_net_ice.a.p/net_ice_ice_fdir_filter.c.o -MF drivers/libtmp_rte_net_ice.a.p/net_ice_ice_fdir_filter.c.o.d -o drivers/libtmp_rte_net_ice.a.p/net_ice_ice_fdir_filter.c.o -c ../drivers/net/ice/ice_fdir_filter.c
../drivers/net/ice/ice_fdir_filter.c: In function ‘ice_fdir_parse’:
../drivers/net/ice/ice_fdir_filter.c:1658:19: error: ‘item_type’ may be used uninitialized in this function [-Werror=maybe-uninitialized]
         item_type ==
         ~~~~~~~~~~^~
         RTE_FLOW_ITEM_TYPE_IPV6_FRAG_EXT)) {
         ~~~~~~~~~~~~~~~~~~~~~~~~~~~~~~~~
../drivers/net/ice/ice_fdir_filter.c:1611:26: note: ‘item_type’ was declared here
  enum rte_flow_item_type item_type;
                          ^~~~~~~~~
cc1: all warnings being treated as errors
[1340/2721] Compiling C object drivers/net/igc/base/libigc_base.a.p/igc_mac.c.o
[1341/2721] Compiling C object drivers/net/igc/base/libigc_base.a.p/igc_i225.c.o
[1342/2721] Compiling C object drivers/net/igc/base/libigc_base.a.p/igc_manage.c.o
[1343/2721] Compiling C object drivers/libtmp_rte_net_ice.a.p/net_ice_ice_dcf_parent.c.o
[1344/2721] Compiling C object drivers/libtmp_rte_net_ice.a.p/net_ice_ice_dcf.c.o
[1345/2721] Compiling C object drivers/libtmp_rte_net_ice.a.p/net_ice_ice_dcf_vf_representor.c.o
[1346/2721] Compiling C object drivers/libtmp_rte_net_ice.a.p/net_ice_ice_rxtx_vec_avx2.c.o
[1347/2721] Compiling C object drivers/libtmp_rte_net_ice.a.p/net_ice_ice_dcf_ethdev.c.o
[1348/2721] Compiling C object drivers/libtmp_rte_net_ice.a.p/net_ice_ice_ethdev.c.o
[1349/2721] Compiling C object drivers/libtmp_rte_net_ice.a.p/net_ice_ice_rxtx_vec_sse.c.o
[1350/2721] Compiling C object drivers/libtmp_rte_net_ice.a.p/net_ice_ice_rxtx.c.o
ninja: build stopped




*Build Failed #11:
OS: UB2004-32
Target: i686-native-linuxapp-gcc
FAILED: drivers/libtmp_rte_net_ice.a.p/net_ice_ice_fdir_filter.c.o 
gcc -Idrivers/libtmp_rte_net_ice.a.p -Idrivers -I../drivers -Idrivers/net/ice -I../drivers/net/ice -Idrivers/net/ice/base -I../drivers/net/ice/base -Idrivers/common/iavf -I../drivers/common/iavf -Ilib/librte_ethdev -I../lib/librte_ethdev -I. -I.. -Iconfig -I../config -Ilib/librte_eal/include -I../lib/librte_eal/include -Ilib/librte_eal/linux/include -I../lib/librte_eal/linux/include -Ilib/librte_eal/x86/include -I../lib/librte_eal/x86/include -Ilib/librte_eal/common -I../lib/librte_eal/common -Ilib/librte_eal -I../lib/librte_eal -Ilib/librte_kvargs -I../lib/librte_kvargs -Ilib/librte_metrics -I../lib/librte_metrics -Ilib/librte_telemetry -I../lib/librte_telemetry -Ilib/librte_net -I../lib/librte_net -Ilib/librte_mbuf -I../lib/librte_mbuf -Ilib/librte_mempool -I../lib/librte_mempool -Ilib/librte_ring -I../lib/librte_ring -Ilib/librte_meter -I../lib/librte_meter -Idrivers/bus/pci -I../drivers/bus/pci -I../drivers/bus/pci/linux -Ilib/librte_pci -I../lib/librte_pci -Idrivers/bus/vdev -I../drivers/bus/vdev -Ilib/librte_hash -I../lib/librte_hash -Ilib/librte_rcu -I../lib/librte_rcu -fdiagnostics-color=always -pipe -D_FILE_OFFSET_BITS=64 -Wall -Winvalid-pch -Werror -O3 -include rte_config.h -Wextra -Wcast-qual -Wdeprecated -Wformat -Wformat-nonliteral -Wformat-security -Wmissing-declarations -Wmissing-prototypes -Wnested-externs -Wold-style-definition -Wpointer-arith -Wsign-compare -Wstrict-prototypes -Wundef -Wwrite-strings -Wno-address-of-packed-member -Wno-packed-not-aligned -Wno-missing-field-initializers -Wno-zero-length-bounds -Wno-pointer-to-int-cast -D_GNU_SOURCE -m32 -fPIC -march=native -DALLOW_EXPERIMENTAL_API -DALLOW_INTERNAL_API -Wno-format-truncation -DCC_AVX512_SUPPORT -MD -MQ drivers/libtmp_rte_net_ice.a.p/net_ice_ice_fdir_filter.c.o -MF drivers/libtmp_rte_net_ice.a.p/net_ice_ice_fdir_filter.c.o.d -o drivers/libtmp_rte_net_ice.a.p/net_ice_ice_fdir_filter.c.o -c ../drivers/net/ice/ice_fdir_filter.c
../drivers/net/ice/ice_fdir_filter.c: In function ‘ice_fdir_parse’:
../drivers/net/ice/ice_fdir_filter.c:1658:19: error: ‘item_type’ may be used uninitialized in this function [-Werror=maybe-uninitialized]
 1658 |         item_type ==
      |         ~~~~~~~~~~^~
 1659 |         RTE_FLOW_ITEM_TYPE_IPV6_FRAG_EXT)) {
      |         ~~~~~~~~~~~~~~~~~~~~~~~~~~~~~~~~
../drivers/net/ice/ice_fdir_filter.c:1611:26: note: ‘item_type’ was declared here
 1611 |  enum rte_flow_item_type item_type;
      |                          ^~~~~~~~~
cc1: all warnings being treated as errors
[1119/2243] Generating rte_net_ice_mingw with a custom command
[1120/2243] Compiling C object drivers/libtmp_rte_net_ice.a.p/net_ice_ice_ethdev.c.o
[1121/2243] Compiling C object drivers/libtmp_rte_net_ice.a.p/net_ice_ice_dcf_vf_representor.c.o
[1122/2243] Compiling C object drivers/libtmp_rte_net_ice.a.p/net_ice_ice_dcf_parent.c.o
[1123/2243] Compiling C object drivers/libtmp_rte_net_ice.a.p/net_ice_ice_dcf.c.o
[1124/2243] Compiling C object drivers/libtmp_rte_net_ice.a.p/net_ice_ice_rxtx.c.o
[1125/2243] Compiling C object drivers/libtmp_rte_net_ice.a.p/net_ice_ice_dcf_ethdev.c.o
[1126/2243] Compiling C object drivers/libtmp_rte_net_ice.a.p/net_ice_ice_rxtx_vec_avx2.c.o
[1127/2243] Compiling C object drivers/libtmp_rte_net_ice.a.p/net_ice_ice_rxtx_vec_sse.c.o
ninja: build stopped




*Build Failed #12:
OS: UB2004-64
Target: x86_64-native-linuxapp-gcc
FAILED: drivers/libtmp_rte_net_ice.a.p/net_ice_ice_fdir_filter.c.o 
gcc -Idrivers/libtmp_rte_net_ice.a.p -Idrivers -I../drivers -Idrivers/net/ice -I../drivers/net/ice -Idrivers/net/ice/base -I../drivers/net/ice/base -Idrivers/common/iavf -I../drivers/common/iavf -Ilib/librte_ethdev -I../lib/librte_ethdev -I. -I.. -Iconfig -I../config -Ilib/librte_eal/include -I../lib/librte_eal/include -Ilib/librte_eal/linux/include -I../lib/librte_eal/linux/include -Ilib/librte_eal/x86/include -I../lib/librte_eal/x86/include -Ilib/librte_eal/common -I../lib/librte_eal/common -Ilib/librte_eal -I../lib/librte_eal -Ilib/librte_kvargs -I../lib/librte_kvargs -Ilib/librte_metrics -I../lib/librte_metrics -Ilib/librte_telemetry -I../lib/librte_telemetry -Ilib/librte_net -I../lib/librte_net -Ilib/librte_mbuf -I../lib/librte_mbuf -Ilib/librte_mempool -I../lib/librte_mempool -Ilib/librte_ring -I../lib/librte_ring -Ilib/librte_meter -I../lib/librte_meter -Idrivers/bus/pci -I../drivers/bus/pci -I../drivers/bus/pci/linux -Ilib/librte_pci -I../lib/librte_pci -Idrivers/bus/vdev -I../drivers/bus/vdev -Ilib/librte_hash -I../lib/librte_hash -Ilib/librte_rcu -I../lib/librte_rcu -fdiagnostics-color=always -pipe -D_FILE_OFFSET_BITS=64 -Wall -Winvalid-pch -Werror -O3 -include rte_config.h -Wextra -Wcast-qual -Wdeprecated -Wformat -Wformat-nonliteral -Wformat-security -Wmissing-declarations -Wmissing-prototypes -Wnested-externs -Wold-style-definition -Wpointer-arith -Wsign-compare -Wstrict-prototypes -Wundef -Wwrite-strings -Wno-address-of-packed-member -Wno-packed-not-aligned -Wno-missing-field-initializers -Wno-zero-length-bounds -D_GNU_SOURCE -fPIC -march=native -DALLOW_EXPERIMENTAL_API -DALLOW_INTERNAL_API -Wno-format-truncation -DCC_AVX512_SUPPORT -MD -MQ drivers/libtmp_rte_net_ice.a.p/net_ice_ice_fdir_filter.c.o -MF drivers/libtmp_rte_net_ice.a.p/net_ice_ice_fdir_filter.c.o.d -o drivers/libtmp_rte_net_ice.a.p/net_ice_ice_fdir_filter.c.o -c ../drivers/net/ice/ice_fdir_filter.c
../drivers/net/ice/ice_fdir_filter.c: In function ‘ice_fdir_parse’:
../drivers/net/ice/ice_fdir_filter.c:1658:19: error: ‘item_type’ may be used uninitialized in this function [-Werror=maybe-uninitialized]
 1658 |         item_type ==
      |         ~~~~~~~~~~^~
 1659 |         RTE_FLOW_ITEM_TYPE_IPV6_FRAG_EXT)) {
      |         ~~~~~~~~~~~~~~~~~~~~~~~~~~~~~~~~
../drivers/net/ice/ice_fdir_filter.c:1611:26: note: ‘item_type’ was declared here
 1611 |  enum rte_flow_item_type item_type;
      |                          ^~~~~~~~~
cc1: all warnings being treated as errors
[1337/2717] Compiling C object drivers/libtmp_rte_net_ice.a.p/net_ice_ice_acl_filter.c.o
[1338/2717] Compiling C object drivers/libtmp_rte_net_ice.a.p/net_ice_ice_dcf_ethdev.c.o
[1339/2717] Compiling C object drivers/libtmp_rte_net_ice.a.p/net_ice_ice_ethdev.c.o
[1340/2717] Compiling C object drivers/libtmp_rte_net_ice.a.p/net_ice_ice_dcf_vf_representor.c.o
[1341/2717] Compiling C object drivers/libtmp_rte_net_ice.a.p/net_ice_ice_dcf.c.o
[1342/2717] Compiling C object drivers/libtmp_rte_net_ice.a.p/net_ice_ice_dcf_parent.c.o
[1343/2717] Compiling C object drivers/libtmp_rte_net_ice.a.p/net_ice_ice_rxtx_vec_avx2.c.o
[1344/2717] Compiling C object drivers/libtmp_rte_net_ice.a.p/net_ice_ice_rxtx.c.o
[1345/2717] Compiling C object drivers/libtmp_rte_net_ice.a.p/net_ice_ice_rxtx_vec_sse.c.o
ninja: build stopped




*Build Failed #13:
OS: UB2004-64
Target: x86_64-native-linuxapp-doc
FAILED: drivers/a715181@@tmp_rte_net_ice at sta/net_ice_ice_fdir_filter.c.o 
gcc -Idrivers/a715181@@tmp_rte_net_ice at sta -Idrivers -I../drivers -Idrivers/net/ice -I../drivers/net/ice -Idrivers/net/ice/base -I../drivers/net/ice/base -Idrivers/net/ice/../../common/iavf -I../drivers/net/ice/../../common/iavf -Ilib/librte_ethdev -I../lib/librte_ethdev -I. -I../ -Iconfig -I../config -Ilib/librte_eal/include -I../lib/librte_eal/include -Ilib/librte_eal/linux/include -I../lib/librte_eal/linux/include -Ilib/librte_eal/x86/include -I../lib/librte_eal/x86/include -Ilib/librte_eal/common -I../lib/librte_eal/common -Ilib/librte_eal -I../lib/librte_eal -Ilib/librte_kvargs -I../lib/librte_kvargs -Ilib/librte_telemetry/../librte_metrics -I../lib/librte_telemetry/../librte_metrics -Ilib/librte_telemetry -I../lib/librte_telemetry -Ilib/librte_net -I../lib/librte_net -Ilib/librte_mbuf -I../lib/librte_mbuf -Ilib/librte_mempool -I../lib/librte_mempool -Ilib/librte_ring -I../lib/librte_ring -Ilib/librte_meter -I../lib/librte_meter -Idrivers/bus/pci -I../drivers/bus/pci -I../drivers/bus/pci/linux -Ilib/librte_pci -I../lib/librte_pci -Idrivers/bus/vdev -I../drivers/bus/vdev -Ilib/librte_hash -I../lib/librte_hash -Ilib/librte_rcu -I../lib/librte_rcu -Idrivers/common/iavf -I../drivers/common/iavf -fdiagnostics-color=always -pipe -D_FILE_OFFSET_BITS=64 -Wall -Winvalid-pch -Werror -O3 -include rte_config.h -Wextra -Wcast-qual -Wdeprecated -Wformat -Wformat-nonliteral -Wformat-security -Wmissing-declarations -Wmissing-prototypes -Wnested-externs -Wold-style-definition -Wpointer-arith -Wsign-compare -Wstrict-prototypes -Wundef -Wwrite-strings -Wno-address-of-packed-member -Wno-packed-not-aligned -Wno-missing-field-initializers -Wno-zero-length-bounds -D_GNU_SOURCE -fPIC -march=native -DALLOW_EXPERIMENTAL_API -DALLOW_INTERNAL_API -Wno-format-truncation -DCC_AVX512_SUPPORT -MD -MQ 'drivers/a715181@@tmp_rte_net_ice at sta/net_ice_ice_fdir_filter.c.o' -MF 'drivers/a715181@@tmp_rte_net_ice at sta/net_ice_ice_fdir_filter.c.o.d' -o 'drivers/a715181@@tmp_rte_net_ice at sta/net_ice_ice_fdir_filter.c.o' -c ../drivers/net/ice/ice_fdir_filter.c
../drivers/net/ice/ice_fdir_filter.c: In function ‘ice_fdir_parse’:
../drivers/net/ice/ice_fdir_filter.c:1658:19: error: ‘item_type’ may be used uninitialized in this function [-Werror=maybe-uninitialized]
 1658 |         item_type ==
      |         ~~~~~~~~~~^~
 1659 |         RTE_FLOW_ITEM_TYPE_IPV6_FRAG_EXT)) {
      |         ~~~~~~~~~~~~~~~~~~~~~~~~~~~~~~~~
../drivers/net/ice/ice_fdir_filter.c:1611:26: note: ‘item_type’ was declared here
 1611 |  enum rte_flow_item_type item_type;
      |                          ^~~~~~~~~
cc1: all warnings being treated as errors
[1333/2480] Compiling C object 'drivers/a715181@@tmp_rte_net_ice at sta/net_ice_ice_dcf.c.o'.
[1334/2480] Compiling C object 'drivers/a715181@@tmp_rte_net_ice at sta/net_ice_ice_switch_filter.c.o'.
[1335/2480] Compiling C object 'drivers/a715181@@tmp_rte_net_ice at sta/net_ice_ice_ethdev.c.o'.
[1336/2480] Compiling C object 'drivers/a715181@@tmp_rte_net_ice at sta/net_ice_ice_dcf_vf_representor.c.o'.
[1337/2480] Compiling C object 'drivers/a715181@@tmp_rte_net_ice at sta/net_ice_ice_dcf_parent.c.o'.
[1338/2480] Compiling C object 'drivers/a715181@@tmp_rte_net_ice at sta/net_ice_ice_dcf_ethdev.c.o'.
[1339/2480] Compiling C object 'drivers/a715181@@tmp_rte_net_ice at sta/net_ice_ice_rxtx_vec_avx2.c.o'.
[1340/2480] Compiling C object 'drivers/a715181@@tmp_rte_net_ice at sta/net_ice_ice_rxtx_vec_sse.c.o'.
[1341/2480] Compiling C object 'drivers/a715181@@tmp_rte_net_ice at sta/net_ice_ice_rxtx.c.o'.
ninja: build stopped




*Build Failed #14:
OS: UB2010-64
Target: x86_64-native-linuxapp-gcc
FAILED: drivers/a715181@@tmp_rte_net_ice at sta/net_ice_ice_fdir_filter.c.o 
gcc -Idrivers/a715181@@tmp_rte_net_ice at sta -Idrivers -I../drivers -Idrivers/net/ice -I../drivers/net/ice -Idrivers/net/ice/base -I../drivers/net/ice/base -Idrivers/net/ice/../../common/iavf -I../drivers/net/ice/../../common/iavf -Ilib/librte_ethdev -I../lib/librte_ethdev -I. -I../ -Iconfig -I../config -Ilib/librte_eal/include -I../lib/librte_eal/include -Ilib/librte_eal/linux/include -I../lib/librte_eal/linux/include -Ilib/librte_eal/x86/include -I../lib/librte_eal/x86/include -Ilib/librte_eal/common -I../lib/librte_eal/common -Ilib/librte_eal -I../lib/librte_eal -Ilib/librte_kvargs -I../lib/librte_kvargs -Ilib/librte_telemetry/../librte_metrics -I../lib/librte_telemetry/../librte_metrics -Ilib/librte_telemetry -I../lib/librte_telemetry -Ilib/librte_net -I../lib/librte_net -Ilib/librte_mbuf -I../lib/librte_mbuf -Ilib/librte_mempool -I../lib/librte_mempool -Ilib/librte_ring -I../lib/librte_ring -Ilib/librte_meter -I../lib/librte_meter -Idrivers/bus/pci -I../drivers/bus/pci -I../drivers/bus/pci/linux -Ilib/librte_pci -I../lib/librte_pci -Idrivers/bus/vdev -I../drivers/bus/vdev -Ilib/librte_hash -I../lib/librte_hash -Ilib/librte_rcu -I../lib/librte_rcu -Idrivers/common/iavf -I../drivers/common/iavf -fdiagnostics-color=always -pipe -D_FILE_OFFSET_BITS=64 -Wall -Winvalid-pch -Werror -O3 -include rte_config.h -Wextra -Wcast-qual -Wdeprecated -Wformat -Wformat-nonliteral -Wformat-security -Wmissing-declarations -Wmissing-prototypes -Wnested-externs -Wold-style-definition -Wpointer-arith -Wsign-compare -Wstrict-prototypes -Wundef -Wwrite-strings -Wno-address-of-packed-member -Wno-packed-not-aligned -Wno-missing-field-initializers -Wno-zero-length-bounds -D_GNU_SOURCE -fPIC -march=native -DALLOW_EXPERIMENTAL_API -DALLOW_INTERNAL_API -Wno-format-truncation -DCC_AVX512_SUPPORT -MD -MQ 'drivers/a715181@@tmp_rte_net_ice at sta/net_ice_ice_fdir_filter.c.o' -MF 'drivers/a715181@@tmp_rte_net_ice at sta/net_ice_ice_fdir_filter.c.o.d' -o 'drivers/a715181@@tmp_rte_net_ice at sta/net_ice_ice_fdir_filter.c.o' -c ../drivers/net/ice/ice_fdir_filter.c
../drivers/net/ice/ice_fdir_filter.c: In function ‘ice_fdir_parse’:
../drivers/net/ice/ice_fdir_filter.c:1658:19: error: ‘item_type’ may be used uninitialized in this function [-Werror=maybe-uninitialized]
 1658 |         item_type ==
      |         ~~~~~~~~~~^~
 1659 |         RTE_FLOW_ITEM_TYPE_IPV6_FRAG_EXT)) {
      |         ~~~~~~~~~~~~~~~~~~~~~~~~~~~~~~~~
../drivers/net/ice/ice_fdir_filter.c:1611:26: note: ‘item_type’ was declared here
 1611 |  enum rte_flow_item_type item_type;
      |                          ^~~~~~~~~
cc1: all warnings being treated as errors
[1344/2720] Compiling C object 'drivers/a715181@@tmp_rte_net_ice at sta/net_ice_ice_dcf.c.o'.
[1345/2720] Compiling C object 'drivers/net/igc/base/94439f5@@igc_base at sta/igc_nvm.c.o'.
[1346/2720] Compiling C object 'drivers/a715181@@tmp_rte_net_ice at sta/net_ice_ice_dcf_vf_representor.c.o'.
[1347/2720] Compiling C object 'drivers/a715181@@tmp_rte_net_ice at sta/net_ice_ice_ethdev.c.o'.
[1348/2720] Compiling C object 'drivers/a715181@@tmp_rte_net_ice at sta/net_ice_ice_rxtx.c.o'.
[1349/2720] Compiling C object 'drivers/a715181@@tmp_rte_net_ice at sta/net_ice_ice_dcf_parent.c.o'.
[1350/2720] Compiling C object 'drivers/a715181@@tmp_rte_net_ice at sta/net_ice_ice_dcf_ethdev.c.o'.
[1351/2720] Compiling C object 'drivers/a715181@@tmp_rte_net_ice at sta/net_ice_ice_rxtx_vec_avx2.c.o'.
[1352/2720] Compiling C object 'drivers/a715181@@tmp_rte_net_ice at sta/net_ice_ice_rxtx_vec_sse.c.o'.
ninja: build stopped


DPDK STV team


More information about the test-report mailing list