[dpdk-test-report] |FAILURE| pw(91226) [v6, 3/3] net/ice: support FDIR for IP fragment packet

sys_stv at intel.com sys_stv at intel.com
Tue Apr 13 16:39:59 CEST 2021


Test-Label: Intel-compilation
Test-Status: FAILURE
http://dpdk.org/patch/91226

_Compilation issues_

Submitter: Jeff Guo <jia.guo at intel.com>
Date: 2021-04-13 10:06:30
Reply_mail: 20210413100630.81805-4-jia.guo at intel.com

DPDK git baseline: Repo:dpdk-next-net-intel, CommitID: 86803011549cfaeb2a7cec9679bd2d4286678632


Meson Build Summary: 22 Builds Done, 21 Successful, 1 Failures, 0 Blocked

+------------------+------------+--------------+------------+------------+-----------+----------+
| os               | gcc-static | clang-static | icc-static | gcc-shared | gcc-debug | document |
+------------------+------------+--------------+------------+------------+-----------+----------+
| UB2004-64        | pass       | pass         | pass       |            |           | pass     |
| RHEL83-64        | pass       |              |            |            |           |          |
| FC33-64          | pass       | pass         |            |            |           |          |
| CentOsStream8-64 | pass       |              |            |            |           |          |
| UB2010-64        | pass       |              |            |            |           |          |
| WIN10-64         |            | pass         |            |            |           |          |
| UB2004-32        | FAIL       |              |            |            |           |          |
| CENTOS83-64      | pass       | pass         | pass       | pass       | pass      |          |
| FreeBSD1201-64   | pass       | pass         |            | pass       | pass      |          |
| SUSE15-64        | pass       | pass         |            |            |           |          |
+------------------+------------+--------------+------------+------------+-----------+----------+
Test environment and configuration as below:


OS: UB2004-64
	Kernel Version: 5.8.0-48-generic
	GCC Version: gcc (Ubuntu 10.2.0-5ubuntu1~20.04) 10.2.0
	Clang Version: 10.0.0-4ubuntu1
	x86_64-native-linuxapp-clang
	x86_64-native-linuxapp-gcc
	x86_64-native-linuxapp-icc
	x86_64-native-linuxapp-doc

OS: RHEL83-64
	Kernel Version: 4.18.0-240.el8.x86_64
	GCC Version: gcc (GCC) 8.3.1 20191121 (Red Hat 8.3.1-5)
	Clang Version: 10.0.1 (Red Hat 10.0.1-1.module+el8.3.0+7459+90c24896)
	x86_64-native-linuxapp-gcc

OS: FC33-64
	Kernel Version: 5.8.16-300.fc33.x86_64
	GCC Version: gcc (GCC) 10.2.1 20201005 (Red Hat 10.2.1-5)
	Clang Version: 11.0.0 (Fedora 11.0.0-1.fc33)
	x86_64-native-linuxapp-gcc
	x86_64-native-linuxapp-clang

OS: CentOsStream8-64
	Kernel Version: 4.18.0-257.el8.x86_64
	GCC Version: gcc (GCC) 8.4.1 20200928 (Red Hat 8.4.1-1)
	Clang Version: 11.0.0 (Red Hat 11.0.0-0.2.rc2.module_el8.4.0+533+50191577)
	x86_64-native-linuxapp-gcc

OS: UB2010-64
	Kernel Version: 5.8.0-25-generic
	GCC Version: gcc (Ubuntu 10.2.0-13ubuntu1) 10.2.0
	Clang Version: 11.0.0-2
	x86_64-native-linuxapp-gcc

OS: WIN10-64
	Kernel Version: N/A
	GCC Version: N/A
	Clang Version: Clang 8.0.0
	x86_64-windows-clang

OS: UB2004-32
	Kernel Version: 5.8.0-48-generic
	GCC Version: gcc (Ubuntu 10.2.0-5ubuntu1~20.04) 10.2.0
	Clang Version: 10.0.0-4ubuntu1
	i686-native-linuxapp-gcc

OS: CENTOS83-64
	Kernel Version: 4.18.0-240.1.1.el8_3.x86_64
	GCC Version: gcc (GCC) 8.3.1 20191121 (Red Hat 8.3.1-5)
	Clang Version: 10.0.1 (Red Hat 10.0.1-1.module_el8.3.0+467+cb298d5b)
	x86_64-native-linuxapp-gcc
	x86_64-native-linuxapp-clang
	x86_64-native-linuxapp-icc
	x86_64-native-linuxapp-gcc+shared
	x86_64-native-linuxapp-gcc+debug

OS: FreeBSD1201-64
	Kernel Version: 12.1-RELEASE
	GCC Version: gcc (FreeBSD Ports Collection) 9.2.0
	Clang Version: 8.0.1 (tags/RELEASE_801/final 366581) (based on LLVM 8.0.1)
	x86_64-native-bsdapp-gcc
	x86_64-native-bsdapp-clang
	x86_64-native-bsdapp-gcc+shared
	x86_64-native-bsdapp-gcc+debug

OS: SUSE15-64
	Kernel Version: 5.3.18-lp152.57-default
	GCC Version: gcc (SUSE Linux) 7.5.0
	Clang Version: 9.0.1
	x86_64-native-linuxapp-clang
	x86_64-native-linuxapp-gcc



*Build Failed #1:
OS: UB2004-32
Target: i686-native-linuxapp-gcc
FAILED: drivers/net/ice/base/libice_base.a.p/ice_flow.c.o 
gcc -Idrivers/net/ice/base/libice_base.a.p -Idrivers/net/ice/base -I../drivers/net/ice/base -I. -I.. -Iconfig -I../config -Ilib/librte_eal/include -I../lib/librte_eal/include -Ilib/librte_eal/linux/include -I../lib/librte_eal/linux/include -Ilib/librte_eal/x86/include -I../lib/librte_eal/x86/include -Ilib/librte_eal/common -I../lib/librte_eal/common -Ilib/librte_eal -I../lib/librte_eal -Ilib/librte_kvargs -I../lib/librte_kvargs -Ilib/librte_metrics -I../lib/librte_metrics -Ilib/librte_telemetry -I../lib/librte_telemetry -fdiagnostics-color=always -pipe -D_FILE_OFFSET_BITS=64 -Wall -Winvalid-pch -Werror -O3 -include rte_config.h -Wextra -Wcast-qual -Wdeprecated -Wformat -Wformat-nonliteral -Wformat-security -Wmissing-declarations -Wmissing-prototypes -Wnested-externs -Wold-style-definition -Wpointer-arith -Wsign-compare -Wstrict-prototypes -Wundef -Wwrite-strings -Wno-address-of-packed-member -Wno-packed-not-aligned -Wno-missing-field-initializers -Wno-zero-length-bounds -Wno-pointer-to-int-cast -D_GNU_SOURCE -m32 -fPIC -march=native -DALLOW_EXPERIMENTAL_API -DALLOW_INTERNAL_API -Wno-format-truncation -Wno-unused-value -Wno-unused-but-set-variable -Wno-unused-variable -Wno-unused-parameter -MD -MQ drivers/net/ice/base/libice_base.a.p/ice_flow.c.o -MF drivers/net/ice/base/libice_base.a.p/ice_flow.c.o.d -o drivers/net/ice/base/libice_base.a.p/ice_flow.c.o -c ../drivers/net/ice/base/ice_flow.c
In file included from ../drivers/net/ice/base/ice_osdep.h:29,
                 from ../drivers/net/ice/base/ice_type.h:52,
                 from ../drivers/net/ice/base/ice_common.h:8,
                 from ../drivers/net/ice/base/ice_flow.c:5:
../drivers/net/ice/base/ice_flow.c: In function ‘ice_flow_rem_vsi_prof’:
../drivers/net/ice/base/../ice_logs.h:36:49: error: format ‘%lu’ expects argument of type ‘long unsigned int’, but argument 7 has type ‘u64’ {aka ‘long long unsigned int’} [-Werror=format=]
   36 |  rte_log(RTE_LOG_ ## level, ice_logtype_driver, "%s(): " fmt, \
      |                                                 ^~~~~~~~
../drivers/net/ice/base/ice_osdep.h:159:3: note: in expansion of macro ‘PMD_DRV_LOG_RAW’
  159 |   PMD_DRV_LOG_RAW(DEBUG, "ice %02x.%x " s, \
      |   ^~~~~~~~~~~~~~~
../drivers/net/ice/base/ice_flow.c:3398:3: note: in expansion of macro ‘ice_debug’
 3398 |   ice_debug(hw, ICE_DBG_PKG,
      |   ^~~~~~~~~
cc1: all warnings being treated as errors
[1201/2382] Compiling C object drivers/libtmp_rte_net_ice.a.p/net_ice_ice_generic_flow.c.o
[1202/2382] Compiling C object drivers/net/ice/libice_avx512_lib.a.p/ice_rxtx_vec_avx512.c.o
[1203/2382] Compiling C object drivers/libtmp_rte_net_ice.a.p/net_ice_ice_fdir_filter.c.o
[1204/2382] Compiling C object drivers/libtmp_rte_net_ice.a.p/net_ice_ice_hash.c.o
[1205/2382] Compiling C object drivers/libtmp_rte_net_ice.a.p/net_ice_ice_switch_filter.c.o
[1206/2382] Compiling C object drivers/libtmp_rte_net_ice.a.p/net_ice_ice_acl_filter.c.o
[1207/2382] Compiling C object drivers/net/iavf/libiavf_avx512_lib.a.p/iavf_rxtx_vec_avx512.c.o
[1208/2382] Compiling C object drivers/libtmp_rte_net_ice.a.p/net_ice_ice_ethdev.c.o
[1209/2382] Compiling C object drivers/libtmp_rte_net_ice.a.p/net_ice_ice_rxtx.c.o
ninja: build stopped


DPDK STV team


More information about the test-report mailing list