[dpdk-test-report] |FAILURE| pw(96505) sid(18119) job(PER_PATCH_BUILD7037)[v2, 3/3] common/cnxk: add telemetry endpoints to npa

sys_stv at intel.com sys_stv at intel.com
Sun Aug 1 20:16:28 CEST 2021


Test-Label: Intel-compilation
Test-Status: FAILURE
http://dpdk.org/patch/96505

_Compilation issues_

Submitter: Gowrishankar Muthukrishnan <gmuthukrishn at marvell.com>
Date: 2021-08-01 17:37:41
Reply_mail: 89b4c9fa2f40b8127629754e2ef7575db39d725a.1627839051.git.gmuthukrishn at marvell.com

DPDK git baseline: Repo:dpdk, CommitID: 90a05c5012049c0973d98d25953ebc600b67105b


Meson Build Summary: 22 Builds Done, 21 Successful, 1 Failures, 0 Blocked

+----------------+------------+--------------+------------+------------+-----------+----------+
| os             | gcc-static | clang-static | icc-static | gcc-shared | gcc-debug | document |
+----------------+------------+--------------+------------+------------+-----------+----------+
| UB2004-64      | pass       | pass         | pass       |            |           | pass     |
| RHEL83-64      | pass       | pass         | pass       | pass       | pass      |          |
| FC34-64        | pass       | pass         |            |            |           |          |
| UB2104-64      | pass       |              |            |            |           |          |
| WIN10-64       |            | pass         |            |            |           |          |
| UB2004-32      | fail       |              |            |            |           |          |
| CENTOS83-64    | pass       | pass         |            |            |           |          |
| FreeBSD1201-64 | pass       | pass         |            | pass       | pass      |          |
| SUSE15-64      | pass       | pass         |            |            |           |          |
+----------------+------------+--------------+------------+------------+-----------+----------+
Test environment and configuration as below:


OS: UB2004-64
	Kernel Version: 5.8.0-48-generic
	GCC Version: gcc (Ubuntu 10.2.0-5ubuntu1~20.04) 10.2.0
	Clang Version: 10.0.0-4ubuntu1
	x86_64-native-linuxapp-clang
	x86_64-native-linuxapp-gcc
	x86_64-native-linuxapp-icc
	x86_64-native-linuxapp-doc

OS: RHEL83-64
	Kernel Version: 4.18.0-305.3.1.el8.x86_64
	GCC Version: gcc (GCC) 8.4.1 20200928 (Red Hat 8.4.1-1)
	Clang Version: 11.0.0 (Red Hat 11.0.0-1.module_el8.4.0+587+5187cac0)
	x86_64-native-linuxapp-gcc
	x86_64-native-linuxapp-clang
	x86_64-native-linuxapp-gcc+shared
	x86_64-native-linuxapp-gcc+debug
	x86_64-native-linuxapp-icc

OS: FC34-64
	Kernel Version: 5.11.15-300.fc34.x86_64
	GCC Version: gcc (GCC) 11.0.1 20210324 (Red Hat 11.0.1-0)
	Clang Version: 12.0.0 (Fedora 12.0.0-0.3.rc1.fc34)
	x86_64-native-linuxapp-gcc
	x86_64-native-linuxapp-clang

OS: UB2104-64
	Kernel Version: 5.11.0-16-generic
	GCC Version: gcc (Ubuntu 10.3.0-1ubuntu1) 10.3.0
	Clang Version: 12.0.0-1ubuntu1
	x86_64-native-linuxapp-gcc

OS: WIN10-64
	Kernel Version: N/A
	GCC Version: N/A
	Clang Version: Clang 8.0.0
	x86_64-windows-clang

OS: UB2004-32
	Kernel Version: 5.8.0-48-generic
	GCC Version: gcc (Ubuntu 10.2.0-5ubuntu1~20.04) 10.2.0
	Clang Version: 10.0.0-4ubuntu1
	i686-native-linuxapp-gcc

OS: CENTOS83-64
	Kernel Version: 4.18.0-240.1.1.el8_3.x86_64
	GCC Version: gcc (GCC) 8.3.1 20191121 (Red Hat 8.3.1-5)
	Clang Version: 10.0.1 (Red Hat 10.0.1-1.module_el8.3.0+467+cb298d5b)
	x86_64-native-linuxapp-gcc
	x86_64-native-linuxapp-clang

OS: FreeBSD1201-64
	Kernel Version: 12.1-RELEASE
	GCC Version: gcc (FreeBSD Ports Collection) 9.2.0
	Clang Version: 8.0.1 (tags/RELEASE_801/final 366581) (based on LLVM 8.0.1)
	x86_64-native-bsdapp-gcc
	x86_64-native-bsdapp-clang
	x86_64-native-bsdapp-gcc+shared
	x86_64-native-bsdapp-gcc+debug

OS: SUSE15-64
	Kernel Version: 5.3.18-lp152.57-default
	GCC Version: gcc (SUSE Linux) 7.5.0
	Clang Version: 9.0.1
	x86_64-native-linuxapp-clang
	x86_64-native-linuxapp-gcc



*Build Failed #1:
OS: UB2004-32
Target: i686-native-linuxapp-gcc
FAILED: lib/librte_telemetry.a.p/telemetry_telemetry.c.o 
gcc -Ilib/librte_telemetry.a.p -Ilib -I../lib -I. -I.. -Iconfig -I../config -Ilib/eal/include -I../lib/eal/include -Ilib/eal/linux/include -I../lib/eal/linux/include -Ilib/eal/x86/include -I../lib/eal/x86/include -Ilib/metrics -I../lib/metrics -Ilib/telemetry -I../lib/telemetry -fdiagnostics-color=always -pipe -D_FILE_OFFSET_BITS=64 -Wall -Winvalid-pch -Werror -O3 -include rte_config.h -Wextra -Wcast-qual -Wdeprecated -Wformat -Wformat-nonliteral -Wformat-security -Wmissing-declarations -Wmissing-prototypes -Wnested-externs -Wold-style-definition -Wpointer-arith -Wsign-compare -Wstrict-prototypes -Wundef -Wwrite-strings -Wno-address-of-packed-member -Wno-packed-not-aligned -Wno-missing-field-initializers -Wno-zero-length-bounds -Wno-pointer-to-int-cast -D_GNU_SOURCE -m32 -fPIC -march=native -DALLOW_EXPERIMENTAL_API -DALLOW_INTERNAL_API -Wno-format-truncation -DRTE_LOG_DEFAULT_LOGTYPE=lib.telemetry -MD -MQ lib/librte_telemetry.a.p/telemetry_telemetry.c.o -MF lib/librte_telemetry.a.p/telemetry_telemetry.c.o.d -o lib/librte_telemetry.a.p/telemetry_telemetry.c.o -c ../lib/telemetry/telemetry.c
In file included from ../lib/telemetry/telemetry.c:22:
../lib/telemetry/telemetry_json.h: In function ‘rte_tel_json_add_array_ptr’:
../lib/telemetry/telemetry_json.h:112:40: error: format ‘%ld’ expects argument of type ‘long int’, but argument 4 has type ‘unsigned int’ [-Werror=format=]
  112 |   return __json_snprintf(buf, len, "[%ld]", (uintptr_t)ptr);
      |                                      ~~^    ~~~~~~~~~~~~~~
      |                                        |    |
      |                                        |    unsigned int
      |                                        long int
      |                                      %d
../lib/telemetry/telemetry_json.h:114:50: error: format ‘%ld’ expects argument of type ‘long int’, but argument 4 has type ‘unsigned int’ [-Werror=format=]
  114 |  ret = __json_snprintf(buf + end, len - end, ",%ld]", (uintptr_t)ptr);
      |                                                ~~^    ~~~~~~~~~~~~~~
      |                                                  |    |
      |                                                  |    unsigned int
      |                                                  long int
      |                                                %d
../lib/telemetry/telemetry_json.h: In function ‘rte_tel_json_add_obj_ptr’:
../lib/telemetry/telemetry_json.h:162:47: error: format ‘%ld’ expects argument of type ‘long int’, but argument 5 has type ‘unsigned int’ [-Werror=format=]
  162 |   return __json_snprintf(buf, len, "{\"%s\":%ld}", name,
      |                                             ~~^
      |                                               |
      |                                               long int
      |                                             %d
  163 |     (uintptr_t)ptr);
      |     ~~~~~~~~~~~~~~                             
      |     |
      |     unsigned int
../lib/telemetry/telemetry_json.h:165:57: error: format ‘%ld’ expects argument of type ‘long int’, but argument 5 has type ‘unsigned int’ [-Werror=format=]
  165 |  ret = __json_snprintf(buf + end, len - end, ",\"%s\":%ld}", name,
      |                                                       ~~^
      |                                                         |
      |                                                         long int
      |                                                       %d
  166 |     (uintptr_t)ptr);
      |     ~~~~~~~~~~~~~~                                       
      |     |
      |     unsigned int
cc1: all warnings being treated as errors
[21/2296] Compiling C object lib/librte_eal.a.p/eal_common_eal_common_launch.c.o
[22/2296] Compiling C object lib/librte_eal.a.p/eal_common_eal_common_dev.c.o
[23/2296] Compiling C object lib/librte_eal.a.p/eal_common_eal_common_mcfg.c.o
[24/2296] Compiling C object lib/librte_eal.a.p/eal_common_eal_common_memalloc.c.o
[25/2296] Compiling C object lib/librte_eal.a.p/eal_common_eal_common_log.c.o
[26/2296] Compiling C object lib/librte_eal.a.p/eal_common_eal_common_lcore.c.o
[27/2296] Generating symbol file lib/librte_kvargs.so.21.3.p/librte_kvargs.so.21.3.symbols
[28/2296] Compiling C object lib/librte_eal.a.p/eal_common_eal_common_fbarray.c.o
[29/2296] Compiling C object lib/librte_eal.a.p/eal_common_eal_common_memory.c.o
ninja: build stopped


DPDK STV team


More information about the test-report mailing list