[dpdk-test-report] |FAILURE| pw96552-96561 [PATCH] [v12, 10/10] Add unit tests for thread API

dpdklab at iol.unh.edu dpdklab at iol.unh.edu
Tue Aug 3 15:52:56 CEST 2021


Test-Label: iol-testing
Test-Status: FAILURE
http://dpdk.org/patch/96552

_build patch failure_

Submitter: Narcisa Ana Maria Vasile <navasile at linux.microsoft.com>
Date: Monday, August 02 2021 17:32:26 
Applied on: CommitID:31a2db5a177649f4b979e148c89d9f248c0ca97a
Apply patch set 96552-96561 failed:

ninja: error: loading 'build.ninja': No such file or directory

https://lab.dpdk.org/results/dashboard/patchsets/18090/

UNH-IOL DPDK Community Lab


More information about the test-report mailing list