[dpdk-test-report] |FAILURE| pw97419-97455 [PATCH] [38/38] net/sfc: update comment about representor support

dpdklab at iol.unh.edu dpdklab at iol.unh.edu
Fri Aug 27 19:03:32 CEST 2021


Test-Label: iol-testing
Test-Status: FAILURE
http://dpdk.org/patch/97419

_build patch failure_

Submitter: Andrew Rybchenko <Andrew.Rybchenko at oktetlabs.ru>
Date: Friday, August 27 2021 06:57:17 
Applied on: CommitID:43665e95e1277930dd43a20d879fe86ea874f3b6
Apply patch set 97419-97455 failed:

[1/995] Linking static target drivers/libtmp_rte_net_mlx5.a
[2/995] Linking static target drivers/libtmp_rte_net_octeontx2.a
[3/995] Compiling C object drivers/librte_net_qede.a.p/meson-generated_.._rte_net_qede.pmd.c.o
[4/995] Compiling C object drivers/librte_net_qede.so.22.0.p/meson-generated_.._rte_net_qede.pmd.c.o
[5/995] Generating rte_net_softnic_def with a custom command
[6/995] Linking target drivers/librte_net_ring.so.22.0
[7/995] Generating rte_net_softnic_mingw with a custom command
[8/995] Linking static target drivers/librte_net_qede.a
[9/995] Compiling C object drivers/libtmp_rte_net_softnic.a.p/net_softnic_rte_eth_softnic_link.c.o
[10/995] Compiling C object drivers/libtmp_rte_net_sfc.a.p/net_sfc_sfc_repr.c.o
FAILED: drivers/libtmp_rte_net_sfc.a.p/net_sfc_sfc_repr.c.o 
cc -Idrivers/libtmp_rte_net_sfc.a.p -Idrivers -I../drivers -Idrivers/net/sfc -I../drivers/net/sfc -Ilib/ethdev -I../lib/ethdev -I. -I.. -Iconfig -I../config -Ilib/eal/include -I../lib/eal/include -Ilib/eal/linux/include -I../lib/eal/linux/include -Ilib/eal/x86/include -I../lib/eal/x86/include -Ilib/eal/common -I../lib/eal/common -Ilib/eal -I../lib/eal -Ilib/kvargs -I../lib/kvargs -Ilib/metrics -I../lib/metrics -Ilib/telemetry -I../lib/telemetry -Ilib/net -I../lib/net -Ilib/mbuf -I../lib/mbuf -Ilib/mempool -I../lib/mempool -Ilib/ring -I../lib/ring -Ilib/meter -I../lib/meter -Idrivers/bus/pci -I../drivers/bus/pci -I../drivers/bus/pci/linux -Ilib/pci -I../lib/pci -Idrivers/bus/vdev -I../drivers/bus/vdev -Idrivers/common/sfc_efx -I../drivers/common/sfc_efx -Idrivers/common/sfc_efx/base -I../drivers/common/sfc_efx/base -fdiagnostics-color=always -D_FILE_OFFSET_BITS=64 -Wall -Winvalid-pch -O3 -include rte_config.h -Wextra -Wcast-qual -Wdeprecated -Wformat -Wformat-nonliteral -Wformat-security -Wmissing-declarations -Wmissing-prototypes -Wnested-externs -Wold-style-definition -Wpointer-arith -Wsign-compare -Wstrict-prototypes -Wundef -Wwrite-strings -Wno-missing-field-initializers -D_GNU_SOURCE -fPIC -march=native -DALLOW_EXPERIMENTAL_API -DALLOW_INTERNAL_API -Wno-format-truncation -Wno-strict-aliasing -Wdisabled-optimization -Waggregate-return -Wbad-function-cast -DRTE_LOG_DEFAULT_LOGTYPE=pmd.net.sfc -MD -MQ drivers/libtmp_rte_net_sfc.a.p/net_sfc_sfc_repr.c.o -MF drivers/libtmp_rte_net_sfc.a.p/net_sfc_sfc_repr.c.o.d -o drivers/libtmp_rte_net_sfc.a.p/net_sfc_sfc_repr.c.o -c ../drivers/net/sfc/sfc_repr.c
../drivers/net/sfc/sfc_repr.c: In function ‘sfc_repr_eth_dev_init’:
../drivers/net/sfc/sfc_repr.c:1013:13: error: ‘struct rte_eth_dev_data’ has no member named ‘parent_port_id’; did you mean ‘port_id’?
  dev->data->parent_port_id = srs->pf_port_id;
             ^~~~~~~~~~~~~~
             port_id
[11/995] Compiling C object drivers/libtmp_rte_net_softnic.a.p/net_softnic_rte_eth_softnic_swq.c.o
[12/995] Compiling C object drivers/libtmp_rte_net_tap.a.p/net_tap_tap_tcmsgs.c.o
[13/995] Generating rte_net_mlx5.pmd.c with a custom command
[14/995] Compiling C object drivers/libtmp_rte_net_softnic.a.p/net_softnic_rte_eth_softnic_tap.c.o
[15/995] Compiling C object drivers/libtmp_rte_net_tap.a.p/net_tap_tap_intr.c.o
[16/995] Compiling C object drivers/libtmp_rte_net_softnic.a.p/net_softnic_rte_eth_softnic_mempool.c.o
[17/995] Compiling C object drivers/libtmp_rte_net_tap.a.p/net_tap_tap_bpf_api.c.o
[18/995] Compiling C object drivers/libtmp_rte_net_softnic.a.p/net_softnic_rte_eth_softnic_meter.c.o
[19/995] Compiling C object drivers/libtmp_rte_net_tap.a.p/net_tap_tap_netlink.c.o
[20/995] Compiling C object drivers/libtmp_rte_net_softnic.a.p/net_softnic_rte_eth_softnic_pipeline.c.o
[21/995] Generating rte_net_octeontx2.pmd.c with a custom command
[22/995] Generating rte_net_qede.sym_chk with a custom command (wrapped by meson to capture output)
[23/995] Compiling C object drivers/libtmp_rte_net_tap.a.p/net_tap_tap_flow.c.o
[24/995] Compiling C object drivers/libtmp_rte_net_softnic.a.p/net_softnic_rte_eth_softnic_flow.c.o
[25/995] Compiling C object drivers/libtmp_rte_net_softnic.a.p/net_softnic_rte_eth_softnic_tm.c.o
[26/995] Compiling C object drivers/libtmp_rte_net_softnic.a.p/net_softnic_rte_eth_softnic_thread.c.o
[27/995] Compiling C object drivers/libtmp_rte_net_tap.a.p/net_tap_rte_eth_tap.c.o
ninja: build stopped: subcommand failed.

https://lab.dpdk.org/results/dashboard/patchsets/18382/

UNH-IOL DPDK Community Lab


More information about the test-report mailing list