[dpdk-test-report] |FAILURE| pw(86732) [v7, 9/9] doc: update GENEVE TLV option support

sys_stv at intel.com sys_stv at intel.com
Mon Jan 18 18:04:03 CET 2021


Test-Label: Intel-compilation
Test-Status: FAILURE
http://dpdk.org/patch/86732

_Compilation issues_

Submitter: Shiri Kuzin <shirik at nvidia.com>
Date: 2021-01-17 10:21:23
Reply_mail: 20210117102123.19045-10-shirik at nvidia.com

DPDK git baseline: Repo:dpdk-next-net, CommitID: 3ffb3123bf69c58f5dae221cd04c6d697f341ae9


Meson Build Summary: 22 Builds Done, 20 Successful, 2 Failures, 0 Blocked

+------------------+------------+--------------+------------+------------+-----------+----------+
| os               | gcc-static | clang-static | icc-static | gcc-shared | gcc-debug | document |
+------------------+------------+--------------+------------+------------+-----------+----------+
| UB2004-64        | pass       | pass         | pass       |            |           | FAIL     |
| RHEL83-64        | pass       |              |            |            |           |          |
| FC33-64          | pass       | pass         |            |            |           |          |
| CentOsStream8-64 | pass       |              |            |            |           |          |
| UB2010-64        | pass       |              |            |            |           |          |
| WIN10-64         |            | FAIL         |            |            |           |          |
| UB2004-32        | pass       |              |            |            |           |          |
| CENTOS83-64      | pass       | pass         | pass       | pass       | pass      |          |
| FreeBSD1201-64   | pass       | pass         |            | pass       | pass      |          |
| SUSE15-64        | pass       | pass         |            |            |           |          |
+------------------+------------+--------------+------------+------------+-----------+----------+
Test environment and configuration as below:


OS: UB2004-64
	Kernel Version: 5.6.0-050600-generic
	CPU info: Intel(R) Xeon(R) Platinum 8180 CPU @ 2.50GHz
	GCC Version: gcc (Ubuntu 10-20200416-0ubuntu1) 10.0.1 20200416 (experimental) [master revision 3c3f12e2a76:dcee354ce56:44b326839d864fc10c459916abcc97f35a9ac3de]
	Clang Version: 10.0.0-4ubuntu1
	x86_64-native-linuxapp-clang
	x86_64-native-linuxapp-gcc
	x86_64-native-linuxapp-icc
	x86_64-native-linuxapp-doc

OS: RHEL83-64
	Kernel Version: 4.18.0-240.el8.x86_64
	CPU info: Intel(R) Xeon(R) CPU E5-2699 v4 @ 2.20GHz
	GCC Version: gcc (GCC) 8.3.1 20191121 (Red Hat 8.3.1-5)
	Clang Version: 10.0.1 (Red Hat 10.0.1-1.module+el8.3.0+7459+90c24896)
	x86_64-native-linuxapp-gcc

OS: FC33-64
	Kernel Version: 5.8.16-300.fc33.x86_64
	CPU info: Intel(R) Xeon(R) CPU E5-2699 v4 @ 2.20GHz
	GCC Version: gcc (GCC) 10.2.1 20201005 (Red Hat 10.2.1-5)
	Clang Version: 11.0.0 (Fedora 11.0.0-1.fc33)
	x86_64-native-linuxapp-gcc
	x86_64-native-linuxapp-clang

OS: CentOsStream8-64
	Kernel Version: 4.18.0-257.el8.x86_64
	CPU info: Intel(R) Xeon(R) CPU E5-2699 v4 @ 2.20GHz
	GCC Version: gcc (GCC) 8.4.1 20200928 (Red Hat 8.4.1-1)
	Clang Version: 11.0.0 (Red Hat 11.0.0-0.2.rc2.module_el8.4.0+533+50191577)
	x86_64-native-linuxapp-gcc

OS: UB2010-64
	Kernel Version: 5.8.0-25-generic
	CPU info: Intel(R) Xeon(R) CPU E5-2699 v4 @ 2.20GHz
	GCC Version: gcc (Ubuntu 10.2.0-13ubuntu1) 10.2.0
	Clang Version: 11.0.0-2
	x86_64-native-linuxapp-gcc

OS: WIN10-64
	Kernel Version: N/A
	CPU info: N/A
	GCC Version: N/A
	Clang Version: Clang 8.0.0
	x86_64-windows-clang

OS: UB2004-32
	Kernel Version: 5.6.0-050600-generic
	CPU info: Intel(R) Xeon(R) Platinum 8180 CPU @ 2.50GHz
	GCC Version: gcc (Ubuntu 9.3.0-10ubuntu2) 9.3.0
	Clang Version: 10.0.0-4ubuntu1
	i686-native-linuxapp-gcc

OS: CENTOS83-64
	Kernel Version: 4.18.0-240.1.1.el8_3.x86_64
	CPU info: Intel(R) Xeon(R) Platinum 8180 CPU @ 2.50GHz
	GCC Version: gcc (GCC) 8.3.1 20191121 (Red Hat 8.3.1-5)
	Clang Version: 10.0.1 (Red Hat 10.0.1-1.module_el8.3.0+467+cb298d5b)
	x86_64-native-linuxapp-gcc
	x86_64-native-linuxapp-clang
	x86_64-native-linuxapp-icc
	x86_64-native-linuxapp-gcc+shared
	x86_64-native-linuxapp-gcc+debug

OS: FreeBSD1201-64
	Kernel Version: 12.1-RELEASE
	CPU info: Intel(R) Xeon(R) CPU E5-2699 v3 @ 2.30GHz (2294.74-MHz K8-class CPU)
	GCC Version: gcc (FreeBSD Ports Collection) 9.2.0
	Clang Version: 8.0.1 (tags/RELEASE_801/final 366581) (based on LLVM 8.0.1)
	x86_64-native-bsdapp-gcc
	x86_64-native-bsdapp-clang
	x86_64-native-bsdapp-gcc+shared
	x86_64-native-bsdapp-gcc+debug

OS: SUSE15-64
	Kernel Version: 5.3.18-lp152.57-default
	CPU info: Intel(R) Xeon(R) CPU E5-2699 v4 @ 2.20GHz
	GCC Version: gcc (SUSE Linux) 7.5.0
	Clang Version: 9.0.1
	x86_64-native-linuxapp-clang
	x86_64-native-linuxapp-gcc



*Build Failed #1:
OS: UB2004-64
Target: x86_64-native-linuxapp-doc
FAILED: doc/guides/html 
/usr/bin/python3 ../buildtools/call-sphinx-build.py /usr/bin/sphinx-build 21.02.0-rc0 /root/UB2004-64_K5.4.0_GCC9.3.0/x86_64-native-linuxapp-doc/bc740c23b97a49a889f97789faf0c7b5/dpdk/doc/guides /root/UB2004-64_K5.4.0_GCC9.3.0/x86_64-native-linuxapp-doc/bc740c23b97a49a889f97789faf0c7b5/dpdk/x86_64-native-linuxapp-doc/doc/guides -W
Install the sphinx ReadTheDocs theme for improved html documentation layout: https://sphinx-rtd-theme.readthedocs.io/

Warning, treated as error:
/root/UB2004-64_K5.4.0_GCC9.3.0/x86_64-native-linuxapp-doc/bc740c23b97a49a889f97789faf0c7b5/dpdk/doc/guides/nics/mlx5.rst:101:Bullet list ends without a blank line; unexpected unindent.
[2594/2618] Compiling C object app/test/dpdk-test.p/test_ring.c.o
[2595/2618] Compiling C object drivers/libtmp_rte_event_octeontx2.a.p/event_octeontx2_otx2_worker.c.o
[2596/2618] Compiling C object drivers/libtmp_rte_event_octeontx2.a.p/event_octeontx2_otx2_worker_dual.c.o
ninja: build stopped




*Build Failed #2:
OS: WIN10-64
Target: x86_64-windows-clang
FAILED: drivers/net/i40e/libi40e_avx512_lib.a.p/i40e_rxtx_vec_avx512.c.obj 
"clang" "-Idrivers\net/i40e\libi40e_avx512_lib.a.p" "-Idrivers\net/i40e" "-I..\drivers\net\i40e" "-Idrivers\net\i40e" "-Idrivers\net\i40e\base" "-I..\drivers\net\i40e\base" "-Ilib\librte_ethdev" "-I..\lib\librte_ethdev" "-I." "-I.." "-Iconfig" "-I..\config" "-Ilib\librte_eal\include" "-I..\lib\librte_eal\include" "-Ilib\librte_eal\windows\include" "-I..\lib\librte_eal\windows\include" "-Ilib\librte_eal\x86\include" "-I..\lib\librte_eal\x86\include" "-Ilib\librte_eal\common" "-I..\lib\librte_eal\common" "-Ilib\librte_eal" "-I..\lib\librte_eal" "-Ilib\librte_kvargs" "-I..\lib\librte_kvargs" "-Ilib\librte_net" "-I..\lib\librte_net" "-Ilib\librte_mbuf" "-I..\lib\librte_mbuf" "-Ilib\librte_mempool" "-I..\lib\librte_mempool" "-Ilib\librte_ring" "-I..\lib\librte_ring" "-Ilib\librte_meter" "-I..\lib\librte_meter" "-I..\lib\librte_metrics" "-Ilib\librte_telemetry" "-I..\lib\librte_telemetry" "-Ilib\librte_hash" "-I..\lib\librte_hash" "-Ilib\librte_rcu" "-I..\lib\librte_rcu" "-Xclang" "-fcolor-diagnostics" "-pipe" "-D_FILE_OFFSET_BITS=64" "-Wall" "-Winvalid-pch" "-O3" "-include" "rte_config.h" "-Wextra" "-Wcast-qual" "-Wdeprecated" "-Wformat" "-Wformat-nonliteral" "-Wformat-security" "-Wmissing-declarations" "-Wmissing-prototypes" "-Wnested-externs" "-Wold-style-definition" "-Wpointer-arith" "-Wsign-compare" "-Wstrict-prototypes" "-Wundef" "-Wwrite-strings" "-Wno-address-of-packed-member" "-Wno-missing-field-initializers" "-D_GNU_SOURCE" "-D_WIN32_WINNT=0x0A00" "-D_CRT_SECURE_NO_WARNINGS" "-march=native" "-DALLOW_EXPERIMENTAL_API" "-DALLOW_INTERNAL_API" "-DPF_DRIVER" "-DVF_DRIVER" "-DINTEGRATED_VF" "-DX722_A0_SUPPORT" "-DCC_AVX2_SUPPORT" "-DCC_AVX512_SUPPORT" "-mavx512f" "-mavx512bw" "-march=skylake-avx512" -MD -MQ drivers/net/i40e/libi40e_avx512_lib.a.p/i40e_rxtx_vec_avx512.c.obj -MF "drivers\net/i40e\libi40e_avx512_lib.a.p\i40e_rxtx_vec_avx512.c.obj.d" -o drivers/net/i40e/libi40e_avx512_lib.a.p/i40e_rxtx_vec_avx512.c.obj "-c" ../drivers/net/i40e/i40e_rxtx_vec_avx512.c
In file included from ../drivers/net/i40e/i40e_rxtx_vec_avx512.c:15:
In file included from C:\Program Files\LLVM\lib\clang\8.0.0\include\x86intrin.h:36:
C:\Program Files\LLVM\lib\clang\8.0.0\include\prfchwintrin.h:64:1: error: conflicting types for '__m_prefetchw'
_m_prefetchw(void *__P)
^
..\lib\librte_eal\windows\include\rte_windows.h:24:22: note: expanded from macro '_m_prefetchw'
#define _m_prefetchw __m_prefetchw
                     ^
C:\Program Files (x86)\Windows Kits\10\include\10.0.17763.0\um\winnt.h:3275:1: note: previous declaration is here
_m_prefetchw (
^
..\lib\librte_eal\windows\include\rte_windows.h:24:22: note: expanded from macro '_m_prefetchw'
#define _m_prefetchw __m_prefetchw
                     ^
1 error generated.
[190/225] Compiling C object drivers/net/i40e/base/libi40e_base.a.p/i40e_nvm.c.obj
[191/225] Compiling C object drivers/librte_net_i40e.a.p/net_i40e_i40e_pf.c.obj
[192/225] Compiling C object drivers/librte_net_i40e.a.p/net_i40e_i40e_ethdev_vf.c.obj
[193/225] Compiling C object drivers/librte_net_i40e.a.p/net_i40e_i40e_rxtx_vec_sse.c.obj
[194/225] Compiling C object drivers/librte_net_i40e.a.p/net_i40e_i40e_fdir.c.obj
[195/225] Compiling C object drivers/librte_net_i40e.a.p/net_i40e_i40e_rxtx.c.obj
[196/225] Compiling C object drivers/librte_net_i40e.a.p/net_i40e_rte_pmd_i40e.c.obj
[197/225] Compiling C object drivers/librte_net_i40e.a.p/net_i40e_i40e_rxtx_vec_avx2.c.obj
[198/225] Compiling C object drivers/rte_net_i40e-21.dll.p/net_i40e_i40e_ethdev_vf.c.obj
[199/225] Compiling C object drivers/rte_net_i40e-21.dll.p/net_i40e_i40e_fdir.c.obj
[200/225] Compiling C object drivers/rte_net_i40e-21.dll.p/net_i40e_i40e_rxtx.c.obj
[201/225] Compiling C object drivers/librte_net_i40e.a.p/net_i40e_i40e_ethdev.c.obj
[202/225] Compiling C object drivers/rte_net_i40e-21.dll.p/net_i40e_i40e_ethdev.c.obj
ninja: build stopped


DPDK STV team


More information about the test-report mailing list