[dpdk-test-report] |FAILURE| pw86982-86987 [PATCH] [v3, 6/6] power: clean up includes

dpdklab at iol.unh.edu dpdklab at iol.unh.edu
Wed Jan 20 15:48:59 CET 2021


Test-Label: Performance-Testing
Test-Status: FAILURE
http://dpdk.org/patch/86982

_build patch failure_

Submitter: David Hunt <david.hunt at intel.com>
Date: Wednesday, January 20 2021 13:55:56 
Applied on: CommitID:7d3046ed73fdcf705d7c571f1b8e7ca9e9b53e33
Apply patch set 86982-86987 failed:

[1/2239] Linking static target lib/librte_sched.a.
[2/2239] Linking target lib/librte_timer.so.21.1.
[3/2239] Linking target lib/librte_mempool.so.21.1.
[4/2239] Linking target lib/librte_acl.so.21.1.
[5/2239] Generating rte_ipsec_mingw with a custom command.
[6/2239] Linking target lib/librte_jobstats.so.21.1.
[7/2239] Linking target lib/librte_rawdev.so.21.1.
[8/2239] Linking target lib/librte_rcu.so.21.1.
[9/2239] Linking target lib/librte_cfgfile.so.21.1.
[10/2239] Linking target lib/librte_stack.so.21.1.
[11/2239] Generating rte_ipsec_def with a custom command.
[12/2239] Compiling C object 'lib/76b5a35@@rte_fib at sta/librte_fib_rte_fib.c.o'.
[13/2239] Compiling C object 'lib/76b5a35@@rte_ipsec at sta/librte_ipsec_ses.c.o'.
[14/2239] Generating symbol file 'lib/76b5a35@@rte_pci at sha/librte_pci.so.21.1.symbols'.
[15/2239] Generating symbol file 'lib/76b5a35@@rte_metrics at sha/librte_metrics.so.21.1.symbols'.
[16/2239] Generating rte_fib_def with a custom command.
[17/2239] Generating symbol file 'lib/76b5a35@@rte_acl at sha/librte_acl.so.21.1.symbols'.
[18/2239] Generating symbol file 'lib/76b5a35@@rte_mempool at sha/librte_mempool.so.21.1.symbols'.
[19/2239] Generating rte_fib_mingw with a custom command.
[20/2239] Compiling C object 'lib/76b5a35@@rte_ipsec at sta/librte_ipsec_sa.c.o'.
[21/2239] Generating symbol file 'lib/76b5a35@@rte_rawdev at sha/librte_rawdev.so.21.1.symbols'.
[22/2239] Generating symbol file 'lib/76b5a35@@rte_timer at sha/librte_timer.so.21.1.symbols'.
[23/2239] Generating symbol file 'lib/76b5a35@@rte_rcu at sha/librte_rcu.so.21.1.symbols'.
[24/2239] Linking target lib/librte_mbuf.so.21.1.
[25/2239] Linking target lib/librte_rib.so.21.1.
[26/2239] Generating symbol file 'lib/76b5a35@@rte_stack at sha/librte_stack.so.21.1.symbols'.
[27/2239] Linking target lib/librte_hash.so.21.1.
[28/2239] Generating sched.sym_chk with a meson_exe.py custom command.
[29/2239] Compiling C object 'lib/76b5a35@@rte_fib at sta/librte_fib_rte_fib6.c.o'.
[30/2239] Compiling C object 'lib/76b5a35@@rte_ipsec at sta/librte_ipsec_ipsec_sad.c.o'.
[31/2239] Compiling C object 'lib/76b5a35@@rte_fib at sta/librte_fib_dir24_8_avx512.c.o'.
[32/2239] Compiling C object 'drivers/a715181@@tmp_rte_net_axgbe at sta/net_axgbe_axgbe_i2c.c.o'.
[33/2239] Generating symbol file 'lib/76b5a35@@rte_rib at sha/librte_rib.so.21.1.symbols'.
[34/2239] Compiling C object 'drivers/a715181@@tmp_rte_net_axgbe at sta/net_axgbe_axgbe_rxtx_vec_sse.c.o'.
[35/2239] Generating power.sym_chk with a meson_exe.py custom command.
FAILED: lib/power.sym_chk 
/usr/local/bin/meson --internal exe --capture lib/power.sym_chk -- /home-local/jenkins-local/jenkins-agent/workspace/Apply-Custom-Patch-Set/dpdk/buildtools/check-symbols.sh /home-local/jenkins-local/jenkins-agent/workspace/Apply-Custom-Patch-Set/dpdk/lib/librte_power/version.map lib/librte_power.a
rte_power_guest_channel_send_msg is flagged as experimental
but is not listed in version map
Please add rte_power_guest_channel_send_msg to the version map
[36/2239] Generating symbol file 'lib/76b5a35@@rte_mbuf at sha/librte_mbuf.so.21.1.symbols'.
[37/2239] Generating symbol file 'lib/76b5a35@@rte_hash at sha/librte_hash.so.21.1.symbols'.
[38/2239] Compiling C object 'lib/76b5a35@@rte_ipsec at sta/librte_ipsec_esp_inb.c.o'.
[39/2239] Compiling C object 'lib/76b5a35@@rte_port at sta/librte_port_rte_port_frag.c.o'.
[40/2239] Compiling C object 'drivers/a715181@@tmp_rte_net_axgbe at sta/net_axgbe_axgbe_phy_impl.c.o'.
[41/2239] Compiling C object 'drivers/a715181@@tmp_rte_net_axgbe at sta/net_axgbe_axgbe_rxtx.c.o'.
[42/2239] Compiling C object 'lib/76b5a35@@rte_port at sta/librte_port_rte_port_fd.c.o'.
[43/2239] Compiling C object 'lib/76b5a35@@rte_ipsec at sta/librte_ipsec_esp_outb.c.o'.
[44/2239] Compiling C object 'lib/76b5a35@@rte_port at sta/librte_port_rte_port_ethdev.c.o'.
[45/2239] Compiling C object 'lib/76b5a35@@rte_port at sta/librte_port_rte_port_ras.c.o'.
[46/2239] Compiling C object 'lib/76b5a35@@rte_port at sta/librte_port_rte_port_sched.c.o'.
[47/2239] Compiling C object 'lib/76b5a35@@rte_fib at sta/librte_fib_trie.c.o'.
[48/2239] Compiling C object 'lib/76b5a35@@rte_port at sta/librte_port_rte_port_source_sink.c.o'.
[49/2239] Compiling C object 'lib/76b5a35@@rte_fib at sta/librte_fib_dir24_8.c.o'.
[50/2239] Compiling C object 'lib/76b5a35@@rte_vhost at sta/librte_vhost_virtio_net.c.o'.
[51/2239] Compiling C object 'lib/76b5a35@@rte_port at sta/librte_port_rte_port_ring.c.o'.
[52/2239] Compiling C object 'lib/76b5a35@@rte_vhost at sta/librte_vhost_vhost_crypto.c.o'.
ninja: build stopped: subcommand failed.

https://lab.dpdk.org/results/dashboard/patchsets/15303/

UNH-IOL DPDK Community Lab


More information about the test-report mailing list