[dpdk-test-report] |FAILURE| pw95235 [PATCH] [V2, 3/5] pipeline: add support for selector tables

dpdklab at iol.unh.edu dpdklab at iol.unh.edu
Sat Jul 3 01:58:30 CEST 2021


Test-Label: iol-testing
Test-Status: FAILURE
http://dpdk.org/patch/95235

_build patch failure_

Submitter: Cristian Dumitrescu <cristian.dumitrescu at intel.com>
Date: Friday, July 02 2021 22:40:06 
Applied on: CommitID:5e2226f194027d3b3e35cb5b444d126928433017
Apply patch set 95235 failed:

[1/2348] Compiling C object lib/librte_bpf.a.p/bpf_bpf_exec.c.o
[2/2348] Compiling C object lib/librte_flow_classify.a.p/flow_classify_rte_flow_classify_parse.c.o
[3/2348] Compiling C object lib/librte_flow_classify.a.p/flow_classify_rte_flow_classify.c.o
[4/2348] Compiling C object lib/librte_bpf.a.p/bpf_bpf.c.o
[5/2348] Compiling C object lib/librte_bpf.a.p/bpf_bpf_load.c.o
[6/2348] Compiling C object lib/librte_bpf.a.p/bpf_bpf_jit_x86.c.o
[7/2348] Compiling C object lib/librte_bpf.a.p/bpf_bpf_pkt.c.o
[8/2348] Compiling C object lib/librte_bpf.a.p/bpf_bpf_validate.c.o
[9/2348] Linking static target lib/librte_flow_classify.a
[10/2348] Compiling C object lib/librte_bpf.a.p/bpf_bpf_load_elf.c.o
[11/2348] Compiling C object lib/librte_graph.a.p/graph_node.c.o
[12/2348] Generating rte_net_atlantic_def with a custom command
[13/2348] Generating rte_net_atlantic_mingw with a custom command
[14/2348] Compiling C object lib/librte_graph.a.p/graph_graph.c.o
[15/2348] Generating rte_flow_classify_mingw with a custom command
[16/2348] Compiling C object lib/librte_graph.a.p/graph_graph_ops.c.o
[17/2348] Compiling C object lib/librte_graph.a.p/graph_graph_debug.c.o
[18/2348] Compiling C object lib/librte_graph.a.p/graph_graph_stats.c.o
[19/2348] Linking static target lib/librte_bpf.a
[20/2348] Generating rte_flow_classify_def with a custom command
[21/2348] Compiling C object lib/librte_graph.a.p/graph_graph_populate.c.o
[22/2348] Generating rte_bpf_def with a custom command
[23/2348] Generating rte_bpf_mingw with a custom command
[24/2348] Compiling C object lib/librte_node.a.p/node_ethdev_ctrl.c.o
[25/2348] Compiling C object lib/librte_node.a.p/node_ethdev_rx.c.o
[26/2348] Compiling C object lib/librte_node.a.p/node_ethdev_tx.c.o
[27/2348] Compiling C object lib/librte_node.a.p/node_ip4_lookup.c.o
[28/2348] Compiling C object lib/librte_node.a.p/node_null.c.o
[29/2348] Compiling C object lib/librte_node.a.p/node_ip4_rewrite.c.o
[30/2348] Linking static target lib/librte_graph.a
[31/2348] Generating rte_graph_def with a custom command
[32/2348] Linking target lib/librte_eal.so.21.3
[33/2348] Generating rte_graph_mingw with a custom command
[34/2348] Compiling C object lib/librte_node.a.p/node_log.c.o
[35/2348] Compiling C object lib/librte_node.a.p/node_pkt_drop.c.o
[36/2348] Generating rte_node_def with a custom command
[37/2348] Compiling C object lib/librte_node.a.p/node_pkt_cls.c.o
[38/2348] Compiling C object drivers/libtmp_rte_common_cpt.a.p/common_cpt_cpt_fpm_tables.c.o
[39/2348] Compiling C object drivers/libtmp_rte_common_dpaax.a.p/common_dpaax_dpaa_of.c.o
[40/2348] Compiling C object drivers/libtmp_rte_common_cpt.a.p/common_cpt_cpt_pmd_ops_helper.c.o
[41/2348] Compiling C object drivers/libtmp_rte_common_dpaax.a.p/common_dpaax_dpaax_iova_table.c.o
[42/2348] Compiling C object drivers/libtmp_rte_common_dpaax.a.p/common_dpaax_caamflib.c.o
[43/2348] Linking static target lib/librte_node.a
[44/2348] Generating rte_node_mingw with a custom command
[45/2348] Compiling C object lib/librte_pipeline.a.p/pipeline_rte_swx_pipeline_spec.c.o
FAILED: lib/librte_pipeline.a.p/pipeline_rte_swx_pipeline_spec.c.o 
ccache cc -Ilib/librte_pipeline.a.p -Ilib -I../lib -Ilib/pipeline -I../lib/pipeline -I. -I.. -Iconfig -I../config -Ilib/eal/include -I../lib/eal/include -Ilib/eal/linux/include -I../lib/eal/linux/include -Ilib/eal/x86/include -I../lib/eal/x86/include -Ilib/eal/common -I../lib/eal/common -Ilib/eal -I../lib/eal -Ilib/kvargs -I../lib/kvargs -Ilib/metrics -I../lib/metrics -Ilib/telemetry -I../lib/telemetry -Ilib/port -I../lib/port -Ilib/ethdev -I../lib/ethdev -Ilib/net -I../lib/net -Ilib/mbuf -I../lib/mbuf -Ilib/mempool -I../lib/mempool -Ilib/ring -I../lib/ring -Ilib/meter -I../lib/meter -Ilib/sched -I../lib/sched -Ilib/ip_frag -I../lib/ip_frag -Ilib/hash -I../lib/hash -Ilib/rcu -I../lib/rcu -Ilib/cryptodev -I../lib/cryptodev -Ilib/eventdev -I../lib/eventdev -Ilib/timer -I../lib/timer -Ilib/kni -I../lib/kni -Ilib/pci -I../lib/pci -Ilib/table -I../lib/table -Ilib/lpm -I../lib/lpm -Ilib/acl -I../lib/acl -fdiagnostics-color=always -D_FILE_OFFSET_BITS=64 -Wall -Winvalid-pch -O3 -include rte_config.h -Wextra -Wcast-qual -Wdeprecated -Wformat -Wformat-nonliteral -Wformat-security -Wmissing-declarations -Wmissing-prototypes -Wnested-externs -Wold-style-definition -Wpointer-arith -Wsign-compare -Wstrict-prototypes -Wundef -Wwrite-strings -Wno-missing-field-initializers -D_GNU_SOURCE -fPIC -march=native -DALLOW_EXPERIMENTAL_API -DALLOW_INTERNAL_API -Wno-format-truncation -DRTE_LOG_DEFAULT_LOGTYPE=lib.pipeline -MD -MQ lib/librte_pipeline.a.p/pipeline_rte_swx_pipeline_spec.c.o -MF lib/librte_pipeline.a.p/pipeline_rte_swx_pipeline_spec.c.o.d -o lib/librte_pipeline.a.p/pipeline_rte_swx_pipeline_spec.c.o -c ../lib/pipeline/rte_swx_pipeline_spec.c
In file included from ../lib/pipeline/rte_swx_pipeline_spec.c:11:0:
../lib/pipeline/rte_swx_ctl.h:25:10: fatal error: rte_swx_table_selector.h: No such file or directory
 #include "rte_swx_table_selector.h"
          ^~~~~~~~~~~~~~~~~~~~~~~~~~
compilation terminated.
[46/2348] Compiling C object drivers/libtmp_rte_common_iavf.a.p/common_iavf_iavf_common.c.o
[47/2348] Linking static target drivers/libtmp_rte_common_cpt.a
[48/2348] Compiling C object drivers/libtmp_rte_common_iavf.a.p/common_iavf_iavf_adminq.c.o
[49/2348] Generating rte_common_cpt_def with a custom command
[50/2348] Linking static target drivers/libtmp_rte_common_dpaax.a
[51/2348] Compiling C object drivers/libtmp_rte_common_iavf.a.p/common_iavf_iavf_impl.c.o
[52/2348] Generating rte_common_dpaax_def with a custom command
[53/2348] Generating rte_common_cpt_mingw with a custom command
[54/2348] Generating rte_common_dpaax_mingw with a custom command
[55/2348] Compiling C object lib/librte_pipeline.a.p/pipeline_rte_swx_ctl.c.o
FAILED: lib/librte_pipeline.a.p/pipeline_rte_swx_ctl.c.o 
ccache cc -Ilib/librte_pipeline.a.p -Ilib -I../lib -Ilib/pipeline -I../lib/pipeline -I. -I.. -Iconfig -I../config -Ilib/eal/include -I../lib/eal/include -Ilib/eal/linux/include -I../lib/eal/linux/include -Ilib/eal/x86/include -I../lib/eal/x86/include -Ilib/eal/common -I../lib/eal/common -Ilib/eal -I../lib/eal -Ilib/kvargs -I../lib/kvargs -Ilib/metrics -I../lib/metrics -Ilib/telemetry -I../lib/telemetry -Ilib/port -I../lib/port -Ilib/ethdev -I../lib/ethdev -Ilib/net -I../lib/net -Ilib/mbuf -I../lib/mbuf -Ilib/mempool -I../lib/mempool -Ilib/ring -I../lib/ring -Ilib/meter -I../lib/meter -Ilib/sched -I../lib/sched -Ilib/ip_frag -I../lib/ip_frag -Ilib/hash -I../lib/hash -Ilib/rcu -I../lib/rcu -Ilib/cryptodev -I../lib/cryptodev -Ilib/eventdev -I../lib/eventdev -Ilib/timer -I../lib/timer -Ilib/kni -I../lib/kni -Ilib/pci -I../lib/pci -Ilib/table -I../lib/table -Ilib/lpm -I../lib/lpm -Ilib/acl -I../lib/acl -fdiagnostics-color=always -D_FILE_OFFSET_BITS=64 -Wall -Winvalid-pch -O3 -include rte_config.h -Wextra -Wcast-qual -Wdeprecated -Wformat -Wformat-nonliteral -Wformat-security -Wmissing-declarations -Wmissing-prototypes -Wnested-externs -Wold-style-definition -Wpointer-arith -Wsign-compare -Wstrict-prototypes -Wundef -Wwrite-strings -Wno-missing-field-initializers -D_GNU_SOURCE -fPIC -march=native -DALLOW_EXPERIMENTAL_API -DALLOW_INTERNAL_API -Wno-format-truncation -DRTE_LOG_DEFAULT_LOGTYPE=lib.pipeline -MD -MQ lib/librte_pipeline.a.p/pipeline_rte_swx_ctl.c.o -MF lib/librte_pipeline.a.p/pipeline_rte_swx_ctl.c.o.d -o lib/librte_pipeline.a.p/pipeline_rte_swx_ctl.c.o -c ../lib/pipeline/rte_swx_ctl.c
../lib/pipeline/rte_swx_ctl.c:13:10: fatal error: rte_swx_table_selector.h: No such file or directory
 #include <rte_swx_table_selector.h>
          ^~~~~~~~~~~~~~~~~~~~~~~~~~
compilation terminated.
[56/2348] Generating rte_common_iavf_def with a custom command
[57/2348] Compiling C object lib/librte_pipeline.a.p/pipeline_rte_swx_pipeline.c.o
FAILED: lib/librte_pipeline.a.p/pipeline_rte_swx_pipeline.c.o 
ccache cc -Ilib/librte_pipeline.a.p -Ilib -I../lib -Ilib/pipeline -I../lib/pipeline -I. -I.. -Iconfig -I../config -Ilib/eal/include -I../lib/eal/include -Ilib/eal/linux/include -I../lib/eal/linux/include -Ilib/eal/x86/include -I../lib/eal/x86/include -Ilib/eal/common -I../lib/eal/common -Ilib/eal -I../lib/eal -Ilib/kvargs -I../lib/kvargs -Ilib/metrics -I../lib/metrics -Ilib/telemetry -I../lib/telemetry -Ilib/port -I../lib/port -Ilib/ethdev -I../lib/ethdev -Ilib/net -I../lib/net -Ilib/mbuf -I../lib/mbuf -Ilib/mempool -I../lib/mempool -Ilib/ring -I../lib/ring -Ilib/meter -I../lib/meter -Ilib/sched -I../lib/sched -Ilib/ip_frag -I../lib/ip_frag -Ilib/hash -I../lib/hash -Ilib/rcu -I../lib/rcu -Ilib/cryptodev -I../lib/cryptodev -Ilib/eventdev -I../lib/eventdev -Ilib/timer -I../lib/timer -Ilib/kni -I../lib/kni -Ilib/pci -I../lib/pci -Ilib/table -I../lib/table -Ilib/lpm -I../lib/lpm -Ilib/acl -I../lib/acl -fdiagnostics-color=always -D_FILE_OFFSET_BITS=64 -Wall -Winvalid-pch -O3 -include rte_config.h -Wextra -Wcast-qual -Wdeprecated -Wformat -Wformat-nonliteral -Wformat-security -Wmissing-declarations -Wmissing-prototypes -Wnested-externs -Wold-style-definition -Wpointer-arith -Wsign-compare -Wstrict-prototypes -Wundef -Wwrite-strings -Wno-missing-field-initializers -D_GNU_SOURCE -fPIC -march=native -DALLOW_EXPERIMENTAL_API -DALLOW_INTERNAL_API -Wno-format-truncation -DRTE_LOG_DEFAULT_LOGTYPE=lib.pipeline -MD -MQ lib/librte_pipeline.a.p/pipeline_rte_swx_pipeline.c.o -MF lib/librte_pipeline.a.p/pipeline_rte_swx_pipeline.c.o.d -o lib/librte_pipeline.a.p/pipeline_rte_swx_pipeline.c.o -c ../lib/pipeline/rte_swx_pipeline.c
../lib/pipeline/rte_swx_pipeline.c:18:10: fatal error: rte_swx_table_selector.h: No such file or directory
 #include <rte_swx_table_selector.h>
          ^~~~~~~~~~~~~~~~~~~~~~~~~~
compilation terminated.
[58/2348] Generating symbol file lib/librte_eal.so.21.3.p/librte_eal.so.21.3.symbols
[59/2348] Generating bpf.sym_chk with a custom command (wrapped by meson to capture output)
[60/2348] Generating flow_classify.sym_chk with a custom command (wrapped by meson to capture output)
[61/2348] Generating node.sym_chk with a custom command (wrapped by meson to capture output)
[62/2348] Generating graph.sym_chk with a custom command (wrapped by meson to capture output)
ninja: build stopped: subcommand failed.

https://lab.dpdk.org/results/dashboard/patchsets/17624/

UNH-IOL DPDK Community Lab


More information about the test-report mailing list