[dpdk-test-report] |FAILURE| pw(95647) sid(17755) net/mvpp2: fix port max speed overflow

sys_stv at intel.com sys_stv at intel.com
Sun Jul 11 21:13:58 CEST 2021


Test-Label: Intel-compilation
Test-Status: FAILURE
http://dpdk.org/patch/95647

_Compilation issues_

Submitter: danat at marvell.com
Date: 2021-07-11 13:11:43
Reply_mail: 20210711131143.11893-1-danat at marvell.com

DPDK git baseline: Repo:dpdk-next-net-mrvl, CommitID: 156527cfb9f876cae19e0dfc210d27737909068c


Meson Build Summary: 22 Builds Done, 20 Successful, 2 Failures, 0 Blocked

+----------------+------------+--------------+------------+------------+-----------+----------+
| os             | gcc-static | clang-static | icc-static | gcc-shared | gcc-debug | document |
+----------------+------------+--------------+------------+------------+-----------+----------+
| UB2004-64      | pass       | pass         | pass       |            |           | pass     |
| RHEL83-64      | pass       | pass         | pass       | pass       | pass      |          |
| FC34-64        | fail       | fail         |            |            |           |          |
| UB2104-64      | pass       |              |            |            |           |          |
| WIN10-64       |            | pass         |            |            |           |          |
| UB2004-32      | pass       |              |            |            |           |          |
| CENTOS83-64    | pass       | pass         |            |            |           |          |
| FreeBSD1201-64 | pass       | pass         |            | pass       | pass      |          |
| SUSE15-64      | pass       | pass         |            |            |           |          |
+----------------+------------+--------------+------------+------------+-----------+----------+
Test environment and configuration as below:


OS: UB2004-64
	Kernel Version: 5.8.0-48-generic
	GCC Version: gcc (Ubuntu 10.2.0-5ubuntu1~20.04) 10.2.0
	Clang Version: 10.0.0-4ubuntu1
	x86_64-native-linuxapp-clang
	x86_64-native-linuxapp-gcc
	x86_64-native-linuxapp-icc
	x86_64-native-linuxapp-doc

OS: RHEL83-64
	Kernel Version: 4.18.0-305.3.1.el8.x86_64
	GCC Version: gcc (GCC) 8.4.1 20200928 (Red Hat 8.4.1-1)
	Clang Version: 11.0.0 (Red Hat 11.0.0-1.module_el8.4.0+587+5187cac0)
	x86_64-native-linuxapp-gcc
	x86_64-native-linuxapp-clang
	x86_64-native-linuxapp-gcc+shared
	x86_64-native-linuxapp-gcc+debug
	x86_64-native-linuxapp-icc

OS: FC34-64
	Kernel Version: 5.11.15-300.fc34.x86_64
	GCC Version: gcc (GCC) 11.0.1 20210324 (Red Hat 11.0.1-0)
	Clang Version: 12.0.0 (Fedora 12.0.0-0.3.rc1.fc34)
	x86_64-native-linuxapp-gcc
	x86_64-native-linuxapp-clang

OS: UB2104-64
	Kernel Version: 5.11.0-16-generic
	GCC Version: gcc (Ubuntu 10.3.0-1ubuntu1) 10.3.0
	Clang Version: 12.0.0-1ubuntu1
	x86_64-native-linuxapp-gcc

OS: WIN10-64
	Kernel Version: N/A
	GCC Version: N/A
	Clang Version: Clang 8.0.0
	x86_64-windows-clang

OS: UB2004-32
	Kernel Version: 5.8.0-48-generic
	GCC Version: gcc (Ubuntu 10.2.0-5ubuntu1~20.04) 10.2.0
	Clang Version: 10.0.0-4ubuntu1
	i686-native-linuxapp-gcc

OS: CENTOS83-64
	Kernel Version: 4.18.0-240.1.1.el8_3.x86_64
	GCC Version: gcc (GCC) 8.3.1 20191121 (Red Hat 8.3.1-5)
	Clang Version: 10.0.1 (Red Hat 10.0.1-1.module_el8.3.0+467+cb298d5b)
	x86_64-native-linuxapp-gcc
	x86_64-native-linuxapp-clang

OS: FreeBSD1201-64
	Kernel Version: 12.1-RELEASE
	GCC Version: gcc (FreeBSD Ports Collection) 9.2.0
	Clang Version: 8.0.1 (tags/RELEASE_801/final 366581) (based on LLVM 8.0.1)
	x86_64-native-bsdapp-gcc
	x86_64-native-bsdapp-clang
	x86_64-native-bsdapp-gcc+shared
	x86_64-native-bsdapp-gcc+debug

OS: SUSE15-64
	Kernel Version: 5.3.18-lp152.57-default
	GCC Version: gcc (SUSE Linux) 7.5.0
	Clang Version: 9.0.1
	x86_64-native-linuxapp-clang
	x86_64-native-linuxapp-gcc



*Build Failed #1:
OS: FC34-64
Target: x86_64-native-linuxapp-gcc
FAILED: drivers/libtmp_rte_net_bnx2x.a.p/net_bnx2x_bnx2x_rxtx.c.o 
gcc -Idrivers/libtmp_rte_net_bnx2x.a.p -Idrivers -I../drivers -Idrivers/net/bnx2x -I../drivers/net/bnx2x -Ilib/librte_ethdev -I../lib/librte_ethdev -I. -I.. -Iconfig -I../config -Ilib/librte_eal/include -I../lib/librte_eal/include -Ilib/librte_eal/linux/include -I../lib/librte_eal/linux/include -Ilib/librte_eal/x86/include -I../lib/librte_eal/x86/include -Ilib/librte_eal/common -I../lib/librte_eal/common -Ilib/librte_eal -I../lib/librte_eal -Ilib/librte_kvargs -I../lib/librte_kvargs -Ilib/librte_metrics -I../lib/librte_metrics -Ilib/librte_telemetry -I../lib/librte_telemetry -Ilib/librte_net -I../lib/librte_net -Ilib/librte_mbuf -I../lib/librte_mbuf -Ilib/librte_mempool -I../lib/librte_mempool -Ilib/librte_ring -I../lib/librte_ring -Ilib/librte_meter -I../lib/librte_meter -Idrivers/bus/pci -I../drivers/bus/pci -I../drivers/bus/pci/linux -Ilib/librte_pci -I../lib/librte_pci -Idrivers/bus/vdev -I../drivers/bus/vdev -fdiagnostics-color=always -pipe -D_FILE_OFFSET_BITS=64 -Wall -Winvalid-pch -Werror -O3 -include rte_config.h -Wextra -Wcast-qual -Wdeprecated -Wformat -Wformat-nonliteral -Wformat-security -Wmissing-declarations -Wmissing-prototypes -Wnested-externs -Wold-style-definition -Wpointer-arith -Wsign-compare -Wstrict-prototypes -Wundef -Wwrite-strings -Wno-address-of-packed-member -Wno-packed-not-aligned -Wno-missing-field-initializers -Wno-zero-length-bounds -D_GNU_SOURCE -fPIC -march=native -DALLOW_EXPERIMENTAL_API -DALLOW_INTERNAL_API -Wno-format-truncation -DZLIB_CONST -MD -MQ drivers/libtmp_rte_net_bnx2x.a.p/net_bnx2x_bnx2x_rxtx.c.o -MF drivers/libtmp_rte_net_bnx2x.a.p/net_bnx2x_bnx2x_rxtx.c.o.d -o drivers/libtmp_rte_net_bnx2x.a.p/net_bnx2x_bnx2x_rxtx.c.o -c ../drivers/net/bnx2x/bnx2x_rxtx.c
In file included from ../drivers/net/bnx2x/bnx2x_rxtx.c:8:
../drivers/net/bnx2x/bnx2x_rxtx.c: In function ‘bnx2x_upd_rx_prod_fast’:
../drivers/net/bnx2x/bnx2x.h:1528:35: error: ‘rx_prods’ is used uninitialized [-Werror=uninitialized]
 1528 | #define REG_WR32(sc, offset, val) bnx2x_reg_write32(sc, (offset), val)
      |                                   ^~~~~~~~~~~~~~~~~~~~~~~~~~~~~~~~~~~~
../drivers/net/bnx2x/bnx2x.h:1531:33: note: in expansion of macro ‘REG_WR32’
 1531 | #define REG_WR(sc, offset, val) REG_WR32(sc, offset, val)
      |                                 ^~~~~~~~
../drivers/net/bnx2x/bnx2x_rxtx.c:331:9: note: in expansion of macro ‘REG_WR’
  331 |         REG_WR(sc, fp->ustorm_rx_prods_offset, val[0]);
      |         ^~~~~~
../drivers/net/bnx2x/bnx2x_rxtx.c:324:40: note: ‘rx_prods’ declared here
  324 |         struct ustorm_eth_rx_producers rx_prods = { 0 };
      |                                        ^~~~~~~~
cc1: all warnings being treated as errors
[974/2849] Compiling C object drivers/libtmp_rte_net_bnx2x.a.p/net_bnx2x_ecore_sp.c.o
[975/2849] Compiling C object drivers/libtmp_rte_net_bnxt.a.p/net_bnxt_bnxt_cpr.c.o
[976/2849] Generating pipeline.sym_chk with a meson_exe.py custom command
[977/2849] Compiling C object drivers/libtmp_rte_net_bond.a.p/net_bonding_rte_eth_bond_8023ad.c.o
[978/2849] Generating rte_common_sfc_efx.sym_chk with a meson_exe.py custom command
[979/2849] Compiling C object drivers/libtmp_rte_net_bnxt.a.p/net_bnxt_bnxt_filter.c.o
[980/2849] Compiling C object drivers/libtmp_rte_net_bond.a.p/net_bonding_rte_eth_bond_pmd.c.o
[981/2849] Compiling C object drivers/libtmp_rte_net_bnx2x.a.p/net_bnx2x_bnx2x_stats.c.o
[982/2849] Compiling C object drivers/libtmp_rte_net_bnxt.a.p/net_bnxt_bnxt_ethdev.c.o
[983/2849] Compiling C object drivers/libtmp_rte_net_bnx2x.a.p/net_bnx2x_bnx2x.c.o
FAILED: drivers/libtmp_rte_net_bnx2x.a.p/net_bnx2x_bnx2x.c.o 
gcc -Idrivers/libtmp_rte_net_bnx2x.a.p -Idrivers -I../drivers -Idrivers/net/bnx2x -I../drivers/net/bnx2x -Ilib/librte_ethdev -I../lib/librte_ethdev -I. -I.. -Iconfig -I../config -Ilib/librte_eal/include -I../lib/librte_eal/include -Ilib/librte_eal/linux/include -I../lib/librte_eal/linux/include -Ilib/librte_eal/x86/include -I../lib/librte_eal/x86/include -Ilib/librte_eal/common -I../lib/librte_eal/common -Ilib/librte_eal -I../lib/librte_eal -Ilib/librte_kvargs -I../lib/librte_kvargs -Ilib/librte_metrics -I../lib/librte_metrics -Ilib/librte_telemetry -I../lib/librte_telemetry -Ilib/librte_net -I../lib/librte_net -Ilib/librte_mbuf -I../lib/librte_mbuf -Ilib/librte_mempool -I../lib/librte_mempool -Ilib/librte_ring -I../lib/librte_ring -Ilib/librte_meter -I../lib/librte_meter -Idrivers/bus/pci -I../drivers/bus/pci -I../drivers/bus/pci/linux -Ilib/librte_pci -I../lib/librte_pci -Idrivers/bus/vdev -I../drivers/bus/vdev -fdiagnostics-color=always -pipe -D_FILE_OFFSET_BITS=64 -Wall -Winvalid-pch -Werror -O3 -include rte_config.h -Wextra -Wcast-qual -Wdeprecated -Wformat -Wformat-nonliteral -Wformat-security -Wmissing-declarations -Wmissing-prototypes -Wnested-externs -Wold-style-definition -Wpointer-arith -Wsign-compare -Wstrict-prototypes -Wundef -Wwrite-strings -Wno-address-of-packed-member -Wno-packed-not-aligned -Wno-missing-field-initializers -Wno-zero-length-bounds -D_GNU_SOURCE -fPIC -march=native -DALLOW_EXPERIMENTAL_API -DALLOW_INTERNAL_API -Wno-format-truncation -DZLIB_CONST -MD -MQ drivers/libtmp_rte_net_bnx2x.a.p/net_bnx2x_bnx2x.c.o -MF drivers/libtmp_rte_net_bnx2x.a.p/net_bnx2x_bnx2x.c.o.d -o drivers/libtmp_rte_net_bnx2x.a.p/net_bnx2x_bnx2x.c.o -c ../drivers/net/bnx2x/bnx2x.c
In file included from ../drivers/net/bnx2x/bnx2x.c:16:
../drivers/net/bnx2x/bnx2x.c: In function ‘bnx2x_hc_ack_sb’:
../drivers/net/bnx2x/bnx2x.h:1528:35: error: ‘igu_ack’ is used uninitialized [-Werror=uninitialized]
 1528 | #define REG_WR32(sc, offset, val) bnx2x_reg_write32(sc, (offset), val)
      |                                   ^~~~~~~~~~~~~~~~~~~~~~~~~~~~~~~~~~~~
../drivers/net/bnx2x/bnx2x.h:1531:33: note: in expansion of macro ‘REG_WR32’
 1531 | #define REG_WR(sc, offset, val) REG_WR32(sc, offset, val)
      |                                 ^~~~~~~~
../drivers/net/bnx2x/bnx2x.h:1916:9: note: in expansion of macro ‘REG_WR’
 1916 |         REG_WR(sc, hc_addr, *val);
      |         ^~~~~~
../drivers/net/bnx2x/bnx2x.h:1905:33: note: ‘igu_ack’ declared here
 1905 |         struct igu_ack_register igu_ack;
      |                                 ^~~~~~~
cc1: all warnings being treated as errors
[984/2849] Compiling C object drivers/libtmp_rte_net_bnx2x.a.p/net_bnx2x_elink.c.o
ninja: build stopped




*Build Failed #2:
OS: FC34-64
Target: x86_64-native-linuxapp-clang
FAILED: app/test/dpdk-test.p/test_cmdline_num.c.o 
clang -Iapp/test/dpdk-test.p -Iapp/test -I../app/test -Ilib/librte_acl -I../lib/librte_acl -I. -I.. -Iconfig -I../config -Ilib/librte_eal/include -I../lib/librte_eal/include -Ilib/librte_eal/linux/include -I../lib/librte_eal/linux/include -Ilib/librte_eal/x86/include -I../lib/librte_eal/x86/include -Ilib/librte_eal/common -I../lib/librte_eal/common -Ilib/librte_eal -I../lib/librte_eal -Ilib/librte_kvargs -I../lib/librte_kvargs -Ilib/librte_metrics -I../lib/librte_metrics -Ilib/librte_telemetry -I../lib/librte_telemetry -Idrivers/bus/pci -I../drivers/bus/pci -I../drivers/bus/pci/linux -Ilib/librte_pci -I../lib/librte_pci -Idrivers/bus/vdev -I../drivers/bus/vdev -Ilib/librte_bitratestats -I../lib/librte_bitratestats -Ilib/librte_ethdev -I../lib/librte_ethdev -Ilib/librte_net -I../lib/librte_net -Ilib/librte_mbuf -I../lib/librte_mbuf -Ilib/librte_mempool -I../lib/librte_mempool -Ilib/librte_ring -I../lib/librte_ring -Ilib/librte_meter -I../lib/librte_meter -Ilib/librte_bpf -I../lib/librte_bpf -Ilib/librte_cfgfile -I../lib/librte_cfgfile -Ilib/librte_cmdline -I../lib/librte_cmdline -Ilib/librte_cryptodev -I../lib/librte_cryptodev -Ilib/librte_rcu -I../lib/librte_rcu -Ilib/librte_distributor -I../lib/librte_distributor -Ilib/librte_efd -I../lib/librte_efd -Ilib/librte_hash -I../lib/librte_hash -Ilib/librte_eventdev -I../lib/librte_eventdev -Ilib/librte_timer -I../lib/librte_timer -Ilib/librte_fib -I../lib/librte_fib -Ilib/librte_rib -I../lib/librte_rib -Ilib/librte_flow_classify -I../lib/librte_flow_classify -Ilib/librte_table -I../lib/librte_table -Ilib/librte_port -I../lib/librte_port -Ilib/librte_sched -I../lib/librte_sched -Ilib/librte_ip_frag -I../lib/librte_ip_frag -Ilib/librte_kni -I../lib/librte_kni -Ilib/librte_lpm -I../lib/librte_lpm -Ilib/librte_graph -I../lib/librte_graph -Ilib/librte_ipsec -I../lib/librte_ipsec -Ilib/librte_security -I../lib/librte_security -Ilib/librte_latencystats -I../lib/librte_latencystats -Ilib/librte_member -I../lib/librte_member -Ilib/librte_node -I../lib/librte_node -Ilib/librte_pipeline -I../lib/librte_pipeline -Ilib/librte_rawdev -I../lib/librte_rawdev -Ilib/librte_reorder -I../lib/librte_reorder -Ilib/librte_stack -I../lib/librte_stack -Idrivers/mempool/ring -I../drivers/mempool/ring -Idrivers/mempool/stack -I../drivers/mempool/stack -Idrivers/event/skeleton -I../drivers/event/skeleton -Idrivers/net/bonding -I../drivers/net/bonding -Idrivers/net/ring -I../drivers/net/ring -Ilib/librte_power -I../lib/librte_power -Ilib/librte_pdump -I../lib/librte_pdump -Ilib/librte_compressdev -I../lib/librte_compressdev -Idrivers/crypto/scheduler -I../drivers/crypto/scheduler -Xclang -fcolor-diagnostics -pipe -D_FILE_OFFSET_BITS=64 -Wall -Winvalid-pch -Werror -O3 -include rte_config.h -Wextra -Wcast-qual -Wdeprecated -Wformat -Wformat-nonliteral -Wformat-security -Wmissing-declarations -Wmissing-prototypes -Wnested-externs -Wold-style-definition -Wpointer-arith -Wsign-compare -Wstrict-prototypes -Wundef -Wwrite-strings -Wno-address-of-packed-member -Wno-missing-field-initializers -D_GNU_SOURCE -march=native -DALLOW_EXPERIMENTAL_API -fno-strict-aliasing -DALLOW_INTERNAL_API -MD -MQ app/test/dpdk-test.p/test_cmdline_num.c.o -MF app/test/dpdk-test.p/test_cmdline_num.c.o.d -o app/test/dpdk-test.p/test_cmdline_num.c.o -c ../app/test/test_cmdline_num.c
../app/test/test_cmdline_num.c:204:5: error: suspicious concatenation of string literals in an array initialization; did you mean to separate the elements with a comma? [-Werror,-Wstring-concatenation]
                  "1111000011110000111100001111000011110000111100001111000011110000",
                  ^
../app/test/test_cmdline_num.c:203:3: note: place parentheses around the string literal to silence warning
                "0b1111000011110000111100001111000011110000111100001111000011110000"
                ^
1 error generated.
[2477/2849] Compiling C object app/test/dpdk-test.p/test_alarm.c.o
[2478/2849] Compiling C object app/dpdk-testpmd.p/test-pmd_parameters.c.o
[2479/2849] Compiling C object app/dpdk-testpmd.p/test-pmd_txonly.c.o
[2480/2849] Compiling C object app/dpdk-testpmd.p/test-pmd_noisy_vnf.c.o
[2481/2849] Compiling C object app/dpdk-testpmd.p/test-pmd_testpmd.c.o
[2482/2849] Compiling C object app/dpdk-test-regex.p/test-regex_main.c.o
[2483/2849] Compiling C object app/dpdk-test-sad.p/test-sad_main.c.o
[2484/2849] Compiling C object drivers/libtmp_rte_event_octeontx2.a.p/event_octeontx2_otx2_worker.c.o
[2485/2849] Compiling C object drivers/libtmp_rte_event_octeontx2.a.p/event_octeontx2_otx2_worker_dual.c.o
ninja: build stopped


DPDK STV team


More information about the test-report mailing list