[dpdk-test-report] |FAILURE| pw(96146) sid(17929) [v3] crypto/snow3g: add support for digest appended ops

sys_stv at intel.com sys_stv at intel.com
Wed Jul 21 15:54:34 CEST 2021


Test-Label: Intel-compilation
Test-Status: FAILURE
http://dpdk.org/patch/96146

_Compilation issues_

Submitter: Kai Ji <kai.ji at intel.com>
Date: 2021-07-21 09:22:15
Reply_mail: 20210721092215.16550-1-kai.ji at intel.com

DPDK git baseline: Repo:dpdk-next-crypto, CommitID: f4a2f3551e4fefe46e73c7bd1695317fe6022f83


Meson Build Summary: 22 Builds Done, 21 Successful, 1 Failures, 0 Blocked

+----------------+------------+--------------+------------+------------+-----------+----------+
| os             | gcc-static | clang-static | icc-static | gcc-shared | gcc-debug | document |
+----------------+------------+--------------+------------+------------+-----------+----------+
| UB2004-64      | pass       | pass         | pass       |            |           | pass     |
| RHEL83-64      | pass       | pass         | pass       | pass       | pass      |          |
| FC34-64        | fail       | pass         |            |            |           |          |
| UB2104-64      | pass       |              |            |            |           |          |
| WIN10-64       |            | pass         |            |            |           |          |
| UB2004-32      | pass       |              |            |            |           |          |
| CENTOS83-64    | pass       | pass         |            |            |           |          |
| FreeBSD1201-64 | pass       | pass         |            | pass       | pass      |          |
| SUSE15-64      | pass       | pass         |            |            |           |          |
+----------------+------------+--------------+------------+------------+-----------+----------+
Test environment and configuration as below:


OS: UB2004-64
	Kernel Version: 5.8.0-48-generic
	GCC Version: gcc (Ubuntu 10.2.0-5ubuntu1~20.04) 10.2.0
	Clang Version: 10.0.0-4ubuntu1
	x86_64-native-linuxapp-clang
	x86_64-native-linuxapp-gcc
	x86_64-native-linuxapp-icc
	x86_64-native-linuxapp-doc

OS: RHEL83-64
	Kernel Version: 4.18.0-305.3.1.el8.x86_64
	GCC Version: gcc (GCC) 8.4.1 20200928 (Red Hat 8.4.1-1)
	Clang Version: 11.0.0 (Red Hat 11.0.0-1.module_el8.4.0+587+5187cac0)
	x86_64-native-linuxapp-gcc
	x86_64-native-linuxapp-clang
	x86_64-native-linuxapp-gcc+shared
	x86_64-native-linuxapp-gcc+debug
	x86_64-native-linuxapp-icc

OS: FC34-64
	Kernel Version: 5.11.15-300.fc34.x86_64
	GCC Version: gcc (GCC) 11.0.1 20210324 (Red Hat 11.0.1-0)
	Clang Version: 12.0.0 (Fedora 12.0.0-0.3.rc1.fc34)
	x86_64-native-linuxapp-gcc
	x86_64-native-linuxapp-clang

OS: UB2104-64
	Kernel Version: 5.11.0-16-generic
	GCC Version: gcc (Ubuntu 10.3.0-1ubuntu1) 10.3.0
	Clang Version: 12.0.0-1ubuntu1
	x86_64-native-linuxapp-gcc

OS: WIN10-64
	Kernel Version: N/A
	GCC Version: N/A
	Clang Version: Clang 8.0.0
	x86_64-windows-clang

OS: UB2004-32
	Kernel Version: 5.8.0-48-generic
	GCC Version: gcc (Ubuntu 10.2.0-5ubuntu1~20.04) 10.2.0
	Clang Version: 10.0.0-4ubuntu1
	i686-native-linuxapp-gcc

OS: CENTOS83-64
	Kernel Version: 4.18.0-240.1.1.el8_3.x86_64
	GCC Version: gcc (GCC) 8.3.1 20191121 (Red Hat 8.3.1-5)
	Clang Version: 10.0.1 (Red Hat 10.0.1-1.module_el8.3.0+467+cb298d5b)
	x86_64-native-linuxapp-gcc
	x86_64-native-linuxapp-clang

OS: FreeBSD1201-64
	Kernel Version: 12.1-RELEASE
	GCC Version: gcc (FreeBSD Ports Collection) 9.2.0
	Clang Version: 8.0.1 (tags/RELEASE_801/final 366581) (based on LLVM 8.0.1)
	x86_64-native-bsdapp-gcc
	x86_64-native-bsdapp-clang
	x86_64-native-bsdapp-gcc+shared
	x86_64-native-bsdapp-gcc+debug

OS: SUSE15-64
	Kernel Version: 5.3.18-lp152.57-default
	GCC Version: gcc (SUSE Linux) 7.5.0
	Clang Version: 9.0.1
	x86_64-native-linuxapp-clang
	x86_64-native-linuxapp-gcc



*Build Failed #1:
OS: FC34-64
Target: x86_64-native-linuxapp-gcc
FAILED: drivers/libtmp_rte_crypto_snow3g.a.p/crypto_snow3g_rte_snow3g_pmd.c.o 
gcc -Idrivers/libtmp_rte_crypto_snow3g.a.p -Idrivers -I../drivers -Idrivers/crypto/snow3g -I../drivers/crypto/snow3g -Ilib/cryptodev -I../lib/cryptodev -I. -I.. -Iconfig -I../config -Ilib/eal/include -I../lib/eal/include -Ilib/eal/linux/include -I../lib/eal/linux/include -Ilib/eal/x86/include -I../lib/eal/x86/include -Ilib/eal/common -I../lib/eal/common -Ilib/eal -I../lib/eal -Ilib/kvargs -I../lib/kvargs -Ilib/metrics -I../lib/metrics -Ilib/telemetry -I../lib/telemetry -Ilib/mbuf -I../lib/mbuf -Ilib/mempool -I../lib/mempool -Ilib/ring -I../lib/ring -Ilib/rcu -I../lib/rcu -Idrivers/bus/vdev -I../drivers/bus/vdev -fdiagnostics-color=always -pipe -D_FILE_OFFSET_BITS=64 -Wall -Winvalid-pch -Werror -O3 -include rte_config.h -Wextra -Wcast-qual -Wdeprecated -Wformat -Wformat-nonliteral -Wformat-security -Wmissing-declarations -Wmissing-prototypes -Wnested-externs -Wold-style-definition -Wpointer-arith -Wsign-compare -Wstrict-prototypes -Wundef -Wwrite-strings -Wno-address-of-packed-member -Wno-packed-not-aligned -Wno-missing-field-initializers -Wno-zero-length-bounds -D_GNU_SOURCE -fPIC -march=native -DALLOW_EXPERIMENTAL_API -DALLOW_INTERNAL_API -Wno-format-truncation -DRTE_LOG_DEFAULT_LOGTYPE=pmd.crypto.snow3g -MD -MQ drivers/libtmp_rte_crypto_snow3g.a.p/crypto_snow3g_rte_snow3g_pmd.c.o -MF drivers/libtmp_rte_crypto_snow3g.a.p/crypto_snow3g_rte_snow3g_pmd.c.o.d -o drivers/libtmp_rte_crypto_snow3g.a.p/crypto_snow3g_rte_snow3g_pmd.c.o -c ../drivers/crypto/snow3g/rte_snow3g_pmd.c
In file included from ../drivers/crypto/snow3g/snow3g_pmd_private.h:8,
                 from ../drivers/crypto/snow3g/rte_snow3g_pmd.c:13:
../drivers/crypto/snow3g/rte_snow3g_pmd.c: In function ‘process_snow3g_cipher_op’:
../drivers/crypto/snow3g/rte_snow3g_pmd.c:258:34: error: ‘iv’ may be used uninitialized [-Werror=maybe-uninitialized]
  258 |         IMB_SNOW3G_F8_N_BUFFER(qp->mgr, &session->pKeySched_cipher, iv,
      |                                  ^
../drivers/crypto/snow3g/rte_snow3g_pmd.c:258:34: note: by argument 2 of type ‘const void * const*’ to ‘void(const snow3g_key_schedule_t *, const void * const*, const void * const*, void **, const uint32_t *, const uint32_t)’ {aka ‘void(const struct snow3g_key_schedule_s *, const void * const*, const void * const*, void **, const unsigned int *, const unsigned int)’}
../drivers/crypto/snow3g/rte_snow3g_pmd.c:211:21: note: ‘iv’ declared here
  211 |         const void *iv[SNOW3G_MAX_BURST];
      |                     ^~
In file included from ../drivers/crypto/snow3g/snow3g_pmd_private.h:8,
                 from ../drivers/crypto/snow3g/rte_snow3g_pmd.c:13:
../drivers/crypto/snow3g/rte_snow3g_pmd.c:258:34: error: ‘src’ may be used uninitialized [-Werror=maybe-uninitialized]
  258 |         IMB_SNOW3G_F8_N_BUFFER(qp->mgr, &session->pKeySched_cipher, iv,
      |                                  ^
../drivers/crypto/snow3g/rte_snow3g_pmd.c:258:34: note: by argument 3 of type ‘const void * const*’ to ‘void(const snow3g_key_schedule_t *, const void * const*, const void * const*, void **, const uint32_t *, const uint32_t)’ {aka ‘void(const struct snow3g_key_schedule_s *, const void * const*, const void * const*, void **, const unsigned int *, const unsigned int)’}
../drivers/crypto/snow3g/rte_snow3g_pmd.c:208:21: note: ‘src’ declared here
  208 |         const void *src[SNOW3G_MAX_BURST];
      |                     ^~~
In file included from ../drivers/crypto/snow3g/snow3g_pmd_private.h:8,
                 from ../drivers/crypto/snow3g/rte_snow3g_pmd.c:13:
../drivers/crypto/snow3g/rte_snow3g_pmd.c:258:34: error: ‘num_bytes’ may be used uninitialized [-Werror=maybe-uninitialized]
  258 |         IMB_SNOW3G_F8_N_BUFFER(qp->mgr, &session->pKeySched_cipher, iv,
      |                                  ^
../drivers/crypto/snow3g/rte_snow3g_pmd.c:258:34: note: by argument 5 of type ‘const uint32_t *’ {aka ‘const unsigned int *’} to ‘void(const snow3g_key_schedule_t *, const void * const*, const void * const*, void **, const uint32_t *, const uint32_t)’ {aka ‘void(const struct snow3g_key_schedule_s *, const void * const*, const void * const*, void **, const unsigned int *, const unsigned int)’}
../drivers/crypto/snow3g/rte_snow3g_pmd.c:212:18: note: ‘num_bytes’ declared here
  212 |         uint32_t num_bytes[SNOW3G_MAX_BURST];
      |                  ^~~~~~~~~
cc1: all warnings being treated as errors
[2174/2891] Generating rte_compress_zlib_mingw with a custom command
[2175/2891] Generating symbol file drivers/librte_crypto_dpaa2_sec.so.21.3.p/librte_crypto_dpaa2_sec.so.21.3.symbols
[2176/2891] Generating rte_crypto_virtio.pmd.c with a custom command
[2177/2891] Compiling C object drivers/libtmp_rte_crypto_scheduler.a.p/crypto_scheduler_scheduler_multicore.c.o
[2178/2891] Compiling C object drivers/libtmp_rte_compress_isal.a.p/compress_isal_isal_compress_pmd_ops.c.o
[2179/2891] Compiling C object drivers/libtmp_rte_compress_octeontx.a.p/compress_octeontx_otx_zip.c.o
[2180/2891] Compiling C object drivers/libtmp_rte_crypto_zuc.a.p/crypto_zuc_rte_zuc_pmd.c.o
[2181/2891] Compiling C object drivers/libtmp_rte_compress_isal.a.p/compress_isal_isal_compress_pmd.c.o
[2182/2891] Compiling C object drivers/libtmp_rte_compress_octeontx.a.p/compress_octeontx_otx_zip_pmd.c.o
[2183/2891] Compiling C object drivers/libtmp_rte_crypto_octeontx2.a.p/crypto_octeontx2_otx2_cryptodev_ops.c.o
[2184/2891] Compiling C object drivers/libtmp_rte_crypto_octeontx.a.p/crypto_octeontx_otx_cryptodev_ops.c.o
ninja: build stopped


DPDK STV team


More information about the test-report mailing list