[dpdk-test-report] |FAILURE| pw(96356) sid(18040) job(PER_PATCH_BUILD6983)drivers: add external clock support for cnxk timer

sys_stv at intel.com sys_stv at intel.com
Wed Jul 28 18:18:55 CEST 2021


Test-Label: Intel-compilation
Test-Status: FAILURE
http://dpdk.org/patch/96356

_Compilation issues_

Submitter: Shijith Thotton <sthotton at marvell.com>
Date: 2021-07-28 15:24:23
Reply_mail: ee6a527b0e824a34cbebbf0865a5bdc172d5207e.1627483481.git.sthotton at marvell.com

DPDK git baseline: Repo:dpdk, CommitID: 02e077f35dbc9821dfcb32714ad1096a3ee58d08


Meson Build Summary: 22 Builds Done, 6 Successful, 16 Failures, 0 Blocked

+----------------+------------+--------------+------------+------------+-----------+----------+
| os             | gcc-static | clang-static | icc-static | gcc-shared | gcc-debug | document |
+----------------+------------+--------------+------------+------------+-----------+----------+
| UB2004-64      | fail       | fail         | fail       |            |           | fail     |
| RHEL83-64      | fail       | fail         | fail       | fail       | fail      |          |
| FC34-64        | fail       | fail         |            |            |           |          |
| UB2104-64      | fail       |              |            |            |           |          |
| WIN10-64       |            | pass         |            |            |           |          |
| UB2004-32      | pass       |              |            |            |           |          |
| CENTOS83-64    | fail       | fail         |            |            |           |          |
| FreeBSD1201-64 | pass       | pass         |            | pass       | pass      |          |
| SUSE15-64      | fail       | fail         |            |            |           |          |
+----------------+------------+--------------+------------+------------+-----------+----------+
Test environment and configuration as below:


OS: UB2004-64
	Kernel Version: 5.8.0-48-generic
	GCC Version: gcc (Ubuntu 10.2.0-5ubuntu1~20.04) 10.2.0
	Clang Version: 10.0.0-4ubuntu1
	x86_64-native-linuxapp-clang
	x86_64-native-linuxapp-gcc
	x86_64-native-linuxapp-icc
	x86_64-native-linuxapp-doc

OS: RHEL83-64
	Kernel Version: 4.18.0-305.3.1.el8.x86_64
	GCC Version: gcc (GCC) 8.4.1 20200928 (Red Hat 8.4.1-1)
	Clang Version: 11.0.0 (Red Hat 11.0.0-1.module_el8.4.0+587+5187cac0)
	x86_64-native-linuxapp-gcc
	x86_64-native-linuxapp-clang
	x86_64-native-linuxapp-gcc+shared
	x86_64-native-linuxapp-gcc+debug
	x86_64-native-linuxapp-icc

OS: FC34-64
	Kernel Version: 5.11.15-300.fc34.x86_64
	GCC Version: gcc (GCC) 11.0.1 20210324 (Red Hat 11.0.1-0)
	Clang Version: 12.0.0 (Fedora 12.0.0-0.3.rc1.fc34)
	x86_64-native-linuxapp-gcc
	x86_64-native-linuxapp-clang

OS: UB2104-64
	Kernel Version: 5.11.0-16-generic
	GCC Version: gcc (Ubuntu 10.3.0-1ubuntu1) 10.3.0
	Clang Version: 12.0.0-1ubuntu1
	x86_64-native-linuxapp-gcc

OS: WIN10-64
	Kernel Version: N/A
	GCC Version: N/A
	Clang Version: Clang 8.0.0
	x86_64-windows-clang

OS: UB2004-32
	Kernel Version: 5.8.0-48-generic
	GCC Version: gcc (Ubuntu 10.2.0-5ubuntu1~20.04) 10.2.0
	Clang Version: 10.0.0-4ubuntu1
	i686-native-linuxapp-gcc

OS: CENTOS83-64
	Kernel Version: 4.18.0-240.1.1.el8_3.x86_64
	GCC Version: gcc (GCC) 8.3.1 20191121 (Red Hat 8.3.1-5)
	Clang Version: 10.0.1 (Red Hat 10.0.1-1.module_el8.3.0+467+cb298d5b)
	x86_64-native-linuxapp-gcc
	x86_64-native-linuxapp-clang

OS: FreeBSD1201-64
	Kernel Version: 12.1-RELEASE
	GCC Version: gcc (FreeBSD Ports Collection) 9.2.0
	Clang Version: 8.0.1 (tags/RELEASE_801/final 366581) (based on LLVM 8.0.1)
	x86_64-native-bsdapp-gcc
	x86_64-native-bsdapp-clang
	x86_64-native-bsdapp-gcc+shared
	x86_64-native-bsdapp-gcc+debug

OS: SUSE15-64
	Kernel Version: 5.3.18-lp152.57-default
	GCC Version: gcc (SUSE Linux) 7.5.0
	Clang Version: 9.0.1
	x86_64-native-linuxapp-clang
	x86_64-native-linuxapp-gcc



*Build Failed #1:
OS: CENTOS83-64
Target: x86_64-native-linuxapp-gcc
FAILED: drivers/libtmp_rte_event_cnxk.a.p/event_cnxk_cnxk_tim_evdev.c.o 
gcc -Idrivers/libtmp_rte_event_cnxk.a.p -Idrivers -I../drivers -Idrivers/event/cnxk -I../drivers/event/cnxk -Ilib/eventdev -I../lib/eventdev -I. -I.. -Iconfig -I../config -Ilib/eal/include -I../lib/eal/include -Ilib/eal/linux/include -I../lib/eal/linux/include -Ilib/eal/x86/include -I../lib/eal/x86/include -Ilib/eal/common -I../lib/eal/common -Ilib/eal -I../lib/eal -Ilib/kvargs -I../lib/kvargs -Ilib/metrics -I../lib/metrics -Ilib/telemetry -I../lib/telemetry -Ilib/ring -I../lib/ring -Ilib/ethdev -I../lib/ethdev -Ilib/net -I../lib/net -Ilib/mbuf -I../lib/mbuf -Ilib/mempool -I../lib/mempool -Ilib/meter -I../lib/meter -Ilib/hash -I../lib/hash -Ilib/rcu -I../lib/rcu -Ilib/timer -I../lib/timer -Ilib/cryptodev -I../lib/cryptodev -Idrivers/bus/pci -I../drivers/bus/pci -I../drivers/bus/pci/linux -Ilib/pci -I../lib/pci -Idrivers/common/cnxk -I../drivers/common/cnxk -Ilib/security -I../lib/security -Idrivers/net/cnxk -I../drivers/net/cnxk -Idrivers/bus/vdev -I../drivers/bus/vdev -Idrivers/mempool/cnxk -I../drivers/mempool/cnxk -fdiagnostics-color=always -pipe -D_FILE_OFFSET_BITS=64 -Wall -Winvalid-pch -Werror -O3 -include rte_config.h -Wextra -Wcast-qual -Wdeprecated -Wformat -Wformat-nonliteral -Wformat-security -Wmissing-declarations -Wmissing-prototypes -Wnested-externs -Wold-style-definition -Wpointer-arith -Wsign-compare -Wstrict-prototypes -Wundef -Wwrite-strings -Wno-packed-not-aligned -Wno-missing-field-initializers -D_GNU_SOURCE -fPIC -march=native -DALLOW_EXPERIMENTAL_API -DALLOW_INTERNAL_API -Wno-format-truncation -flax-vector-conversions -Wno-strict-aliasing -DRTE_LOG_DEFAULT_LOGTYPE=pmd.event.cnxk -MD -MQ drivers/libtmp_rte_event_cnxk.a.p/event_cnxk_cnxk_tim_evdev.c.o -MF drivers/libtmp_rte_event_cnxk.a.p/event_cnxk_cnxk_tim_evdev.c.o.d -o drivers/libtmp_rte_event_cnxk.a.p/event_cnxk_cnxk_tim_evdev.c.o -c ../drivers/event/cnxk/cnxk_tim_evdev.c
In file included from ../drivers/common/cnxk/roc_api.h:25,
                 from ../drivers/event/cnxk/cnxk_eventdev.h:18,
                 from ../drivers/event/cnxk/cnxk_tim_evdev.c:7:
../drivers/event/cnxk/cnxk_tim_evdev.c: In function ‘sort_multi_array’:
../drivers/common/cnxk/roc_platform.h:46:20: error: implicit declaration of function ‘RTE_SWAP’; did you mean ‘RTE_MAX’? [-Werror=implicit-function-declaration]
 #define PLT_SWAP   RTE_SWAP
                    ^~~~~~~~
../drivers/event/cnxk/cnxk_tim_evdev.c:128:4: note: in expansion of macro ‘PLT_SWAP’
    PLT_SWAP(ref_arr[x], ref_arr[x + 1]);
    ^~~~~~~~
../drivers/common/cnxk/roc_platform.h:46:20: error: nested extern declaration of ‘RTE_SWAP’ [-Werror=nested-externs]
 #define PLT_SWAP   RTE_SWAP
                    ^~~~~~~~
../drivers/event/cnxk/cnxk_tim_evdev.c:128:4: note: in expansion of macro ‘PLT_SWAP’
    PLT_SWAP(ref_arr[x], ref_arr[x + 1]);
    ^~~~~~~~
cc1: all warnings being treated as errors
[2237/2860] Compiling C object drivers/libtmp_rte_event_cnxk.a.p/event_cnxk_cn9k_worker_dual_tx_enq_seg.c.o
[2238/2860] Compiling C object drivers/libtmp_rte_event_cnxk.a.p/event_cnxk_cn9k_worker_dual_deq_tmo.c.o
[2239/2860] Compiling C object drivers/libtmp_rte_event_cnxk.a.p/event_cnxk_cnxk_eventdev_adptr.c.o
[2240/2860] Compiling C object drivers/libtmp_rte_event_cnxk.a.p/event_cnxk_cn9k_worker_tx_enq.c.o
[2241/2860] Compiling C object drivers/libtmp_rte_event_cnxk.a.p/event_cnxk_cn9k_worker_dual_tx_enq.c.o
[2242/2860] Compiling C object drivers/libtmp_rte_event_cnxk.a.p/event_cnxk_cn9k_worker_tx_enq_seg.c.o
[2243/2860] Compiling C object drivers/libtmp_rte_crypto_octeontx.a.p/crypto_octeontx_otx_cryptodev_ops.c.o
[2244/2860] Compiling C object drivers/libtmp_rte_event_cnxk.a.p/event_cnxk_cn10k_worker_deq.c.o
[2245/2860] Compiling C object drivers/libtmp_rte_event_cnxk.a.p/event_cnxk_cn10k_worker_deq_tmo.c.o
[2246/2860] Compiling C object drivers/libtmp_rte_event_cnxk.a.p/event_cnxk_cn10k_worker_tx_enq.c.o
[2247/2860] Compiling C object drivers/libtmp_rte_event_cnxk.a.p/event_cnxk_cn10k_worker_tx_enq_seg.c.o
ninja: build stopped




*Build Failed #2:
OS: CENTOS83-64
Target: x86_64-native-linuxapp-clang
FAILED: drivers/libtmp_rte_event_cnxk.a.p/event_cnxk_cnxk_tim_evdev.c.o 
clang -Idrivers/libtmp_rte_event_cnxk.a.p -Idrivers -I../drivers -Idrivers/event/cnxk -I../drivers/event/cnxk -Ilib/eventdev -I../lib/eventdev -I. -I.. -Iconfig -I../config -Ilib/eal/include -I../lib/eal/include -Ilib/eal/linux/include -I../lib/eal/linux/include -Ilib/eal/x86/include -I../lib/eal/x86/include -Ilib/eal/common -I../lib/eal/common -Ilib/eal -I../lib/eal -Ilib/kvargs -I../lib/kvargs -Ilib/metrics -I../lib/metrics -Ilib/telemetry -I../lib/telemetry -Ilib/ring -I../lib/ring -Ilib/ethdev -I../lib/ethdev -Ilib/net -I../lib/net -Ilib/mbuf -I../lib/mbuf -Ilib/mempool -I../lib/mempool -Ilib/meter -I../lib/meter -Ilib/hash -I../lib/hash -Ilib/rcu -I../lib/rcu -Ilib/timer -I../lib/timer -Ilib/cryptodev -I../lib/cryptodev -Idrivers/bus/pci -I../drivers/bus/pci -I../drivers/bus/pci/linux -Ilib/pci -I../lib/pci -Idrivers/common/cnxk -I../drivers/common/cnxk -Ilib/security -I../lib/security -Idrivers/net/cnxk -I../drivers/net/cnxk -Idrivers/bus/vdev -I../drivers/bus/vdev -Idrivers/mempool/cnxk -I../drivers/mempool/cnxk -Xclang -fcolor-diagnostics -pipe -D_FILE_OFFSET_BITS=64 -Wall -Winvalid-pch -Werror -O3 -include rte_config.h -Wextra -Wcast-qual -Wdeprecated -Wformat -Wformat-nonliteral -Wformat-security -Wmissing-declarations -Wmissing-prototypes -Wnested-externs -Wold-style-definition -Wpointer-arith -Wsign-compare -Wstrict-prototypes -Wundef -Wwrite-strings -Wno-address-of-packed-member -Wno-missing-field-initializers -D_GNU_SOURCE -fPIC -march=native -DALLOW_EXPERIMENTAL_API -DALLOW_INTERNAL_API -flax-vector-conversions -Wno-strict-aliasing -DRTE_LOG_DEFAULT_LOGTYPE=pmd.event.cnxk -MD -MQ drivers/libtmp_rte_event_cnxk.a.p/event_cnxk_cnxk_tim_evdev.c.o -MF drivers/libtmp_rte_event_cnxk.a.p/event_cnxk_cnxk_tim_evdev.c.o.d -o drivers/libtmp_rte_event_cnxk.a.p/event_cnxk_cnxk_tim_evdev.c.o -c ../drivers/event/cnxk/cnxk_tim_evdev.c
../drivers/event/cnxk/cnxk_tim_evdev.c:128:4: error: implicit declaration of function 'RTE_SWAP' is invalid in C99 [-Werror,-Wimplicit-function-declaration]
                        PLT_SWAP(ref_arr[x], ref_arr[x + 1]);
                        ^
../drivers/common/cnxk/roc_platform.h:46:20: note: expanded from macro 'PLT_SWAP'
#define PLT_SWAP                 RTE_SWAP
                                 ^
1 error generated.
[2249/2863] Compiling C object drivers/libtmp_rte_event_cnxk.a.p/event_cnxk_cn9k_worker_deq_tmo.c.o
[2250/2863] Compiling C object drivers/libtmp_rte_event_cnxk.a.p/event_cnxk_cnxk_eventdev_adptr.c.o
[2251/2863] Compiling C object drivers/libtmp_rte_event_cnxk.a.p/event_cnxk_cn9k_worker_tx_enq_seg.c.o
[2252/2863] Compiling C object drivers/libtmp_rte_event_cnxk.a.p/event_cnxk_cn9k_worker_dual_tx_enq_seg.c.o
[2253/2863] Compiling C object drivers/libtmp_rte_event_cnxk.a.p/event_cnxk_cn9k_worker_dual_deq_tmo.c.o
[2254/2863] Compiling C object drivers/libtmp_rte_event_cnxk.a.p/event_cnxk_cn10k_worker_deq.c.o
[2255/2863] Compiling C object drivers/libtmp_rte_event_cnxk.a.p/event_cnxk_cn10k_worker_tx_enq.c.o
[2256/2863] Compiling C object drivers/libtmp_rte_event_cnxk.a.p/event_cnxk_cn10k_worker_deq_tmo.c.o
[2257/2863] Compiling C object drivers/libtmp_rte_event_cnxk.a.p/event_cnxk_cn10k_worker_tx_enq_seg.c.o
ninja: build stopped




*Build Failed #3:
OS: RHEL83-64
Target: x86_64-native-linuxapp-gcc
FAILED: drivers/a715181@@tmp_rte_event_cnxk at sta/event_cnxk_cnxk_tim_evdev.c.o 
gcc -Idrivers/a715181@@tmp_rte_event_cnxk at sta -Idrivers -I../drivers -Idrivers/event/cnxk -I../drivers/event/cnxk -Ilib/eventdev -I../lib/eventdev -I. -I../ -Iconfig -I../config -Ilib/eal/include -I../lib/eal/include -Ilib/eal/linux/include -I../lib/eal/linux/include -Ilib/eal/x86/include -I../lib/eal/x86/include -Ilib/eal/common -I../lib/eal/common -Ilib/eal -I../lib/eal -Ilib/kvargs -I../lib/kvargs -Ilib/telemetry/../metrics -I../lib/telemetry/../metrics -Ilib/telemetry -I../lib/telemetry -Ilib/ring -I../lib/ring -Ilib/ethdev -I../lib/ethdev -Ilib/net -I../lib/net -Ilib/mbuf -I../lib/mbuf -Ilib/mempool -I../lib/mempool -Ilib/meter -I../lib/meter -Ilib/hash -I../lib/hash -Ilib/rcu -I../lib/rcu -Ilib/timer -I../lib/timer -Ilib/cryptodev -I../lib/cryptodev -Idrivers/bus/pci -I../drivers/bus/pci -I../drivers/bus/pci/linux -Ilib/pci -I../lib/pci -Idrivers/common/cnxk -I../drivers/common/cnxk -Idrivers/common/cnxk/../../bus/pci -I../drivers/common/cnxk/../../bus/pci -Idrivers/common/cnxk/../../../lib/net -I../drivers/common/cnxk/../../../lib/net -Ilib/security -I../lib/security -Idrivers/net/cnxk -I../drivers/net/cnxk -Idrivers/bus/vdev -I../drivers/bus/vdev -Idrivers/mempool/cnxk -I../drivers/mempool/cnxk -fdiagnostics-color=always -pipe -D_FILE_OFFSET_BITS=64 -Wall -Winvalid-pch -Werror -O3 -include rte_config.h -Wextra -Wcast-qual -Wdeprecated -Wformat -Wformat-nonliteral -Wformat-security -Wmissing-declarations -Wmissing-prototypes -Wnested-externs -Wold-style-definition -Wpointer-arith -Wsign-compare -Wstrict-prototypes -Wundef -Wwrite-strings -Wno-packed-not-aligned -Wno-missing-field-initializers -D_GNU_SOURCE -fPIC -march=native -DALLOW_EXPERIMENTAL_API -DALLOW_INTERNAL_API -Wno-format-truncation -flax-vector-conversions -Wno-strict-aliasing -DRTE_LOG_DEFAULT_LOGTYPE=pmd.event.cnxk -MD -MQ 'drivers/a715181@@tmp_rte_event_cnxk at sta/event_cnxk_cnxk_tim_evdev.c.o' -MF 'drivers/a715181@@tmp_rte_event_cnxk at sta/event_cnxk_cnxk_tim_evdev.c.o.d' -o 'drivers/a715181@@tmp_rte_event_cnxk at sta/event_cnxk_cnxk_tim_evdev.c.o' -c ../drivers/event/cnxk/cnxk_tim_evdev.c
In file included from ../drivers/common/cnxk/roc_api.h:25,
                 from ../drivers/event/cnxk/cnxk_eventdev.h:18,
                 from ../drivers/event/cnxk/cnxk_tim_evdev.c:7:
../drivers/event/cnxk/cnxk_tim_evdev.c: In function ‘sort_multi_array’:
../drivers/common/cnxk/roc_platform.h:46:20: error: implicit declaration of function ‘RTE_SWAP’; did you mean ‘RTE_MAX’? [-Werror=implicit-function-declaration]
 #define PLT_SWAP   RTE_SWAP
                    ^~~~~~~~
../drivers/event/cnxk/cnxk_tim_evdev.c:128:4: note: in expansion of macro ‘PLT_SWAP’
    PLT_SWAP(ref_arr[x], ref_arr[x + 1]);
    ^~~~~~~~
../drivers/common/cnxk/roc_platform.h:46:20: error: nested extern declaration of ‘RTE_SWAP’ [-Werror=nested-externs]
 #define PLT_SWAP   RTE_SWAP
                    ^~~~~~~~
../drivers/event/cnxk/cnxk_tim_evdev.c:128:4: note: in expansion of macro ‘PLT_SWAP’
    PLT_SWAP(ref_arr[x], ref_arr[x + 1]);
    ^~~~~~~~
cc1: all warnings being treated as errors
[2200/2806] Generating symbol file 'drivers/a715181@@rte_crypto_octeontx at sha/librte_crypto_octeontx.so.21.3.symbols'.
[2201/2806] Compiling C object 'drivers/a715181@@tmp_rte_event_cnxk at sta/event_cnxk_cnxk_eventdev_selftest.c.o'.
[2202/2806] Compiling C object 'drivers/a715181@@tmp_rte_event_cnxk at sta/event_cnxk_cnxk_tim_worker.c.o'.
[2203/2806] Compiling C object 'drivers/a715181@@tmp_rte_event_dlb2 at sta/event_dlb2_dlb2_xstats.c.o'.
[2204/2806] Compiling C object 'drivers/a715181@@tmp_rte_event_dlb2 at sta/event_dlb2_dlb2.c.o'.
[2205/2806] Compiling C object 'drivers/a715181@@tmp_rte_event_cnxk at sta/event_cnxk_cn10k_worker_deq.c.o'.
[2206/2806] Compiling C object 'drivers/a715181@@tmp_rte_event_cnxk at sta/event_cnxk_cn10k_worker_deq_tmo.c.o'.
[2207/2806] Compiling C object 'drivers/a715181@@tmp_rte_event_cnxk at sta/event_cnxk_cn10k_worker_tx_enq.c.o'.
[2208/2806] Compiling C object 'drivers/a715181@@tmp_rte_event_cnxk at sta/event_cnxk_cn10k_worker_tx_enq_seg.c.o'.
ninja: build stopped




*Build Failed #4:
OS: SUSE15-64
Target: x86_64-native-linuxapp-clang
FAILED: drivers/libtmp_rte_event_cnxk.a.p/event_cnxk_cnxk_tim_evdev.c.o 
clang -Idrivers/libtmp_rte_event_cnxk.a.p -Idrivers -I../drivers -Idrivers/event/cnxk -I../drivers/event/cnxk -Ilib/eventdev -I../lib/eventdev -I. -I.. -Iconfig -I../config -Ilib/eal/include -I../lib/eal/include -Ilib/eal/linux/include -I../lib/eal/linux/include -Ilib/eal/x86/include -I../lib/eal/x86/include -Ilib/eal/common -I../lib/eal/common -Ilib/eal -I../lib/eal -Ilib/kvargs -I../lib/kvargs -Ilib/metrics -I../lib/metrics -Ilib/telemetry -I../lib/telemetry -Ilib/ring -I../lib/ring -Ilib/ethdev -I../lib/ethdev -Ilib/net -I../lib/net -Ilib/mbuf -I../lib/mbuf -Ilib/mempool -I../lib/mempool -Ilib/meter -I../lib/meter -Ilib/hash -I../lib/hash -Ilib/rcu -I../lib/rcu -Ilib/timer -I../lib/timer -Ilib/cryptodev -I../lib/cryptodev -Idrivers/bus/pci -I../drivers/bus/pci -I../drivers/bus/pci/linux -Ilib/pci -I../lib/pci -Idrivers/common/cnxk -I../drivers/common/cnxk -Ilib/security -I../lib/security -Idrivers/net/cnxk -I../drivers/net/cnxk -Idrivers/bus/vdev -I../drivers/bus/vdev -Idrivers/mempool/cnxk -I../drivers/mempool/cnxk -Xclang -fcolor-diagnostics -pipe -D_FILE_OFFSET_BITS=64 -Wall -Winvalid-pch -Werror -O3 -include rte_config.h -Wextra -Wcast-qual -Wdeprecated -Wformat -Wformat-nonliteral -Wformat-security -Wmissing-declarations -Wmissing-prototypes -Wnested-externs -Wold-style-definition -Wpointer-arith -Wsign-compare -Wstrict-prototypes -Wundef -Wwrite-strings -Wno-address-of-packed-member -Wno-missing-field-initializers -D_GNU_SOURCE -fPIC -march=native -DALLOW_EXPERIMENTAL_API -DALLOW_INTERNAL_API -flax-vector-conversions -Wno-strict-aliasing -DRTE_LOG_DEFAULT_LOGTYPE=pmd.event.cnxk -MD -MQ drivers/libtmp_rte_event_cnxk.a.p/event_cnxk_cnxk_tim_evdev.c.o -MF drivers/libtmp_rte_event_cnxk.a.p/event_cnxk_cnxk_tim_evdev.c.o.d -o drivers/libtmp_rte_event_cnxk.a.p/event_cnxk_cnxk_tim_evdev.c.o -c ../drivers/event/cnxk/cnxk_tim_evdev.c
../drivers/event/cnxk/cnxk_tim_evdev.c:128:4: error: implicit declaration of function 'RTE_SWAP' is invalid in C99 [-Werror,-Wimplicit-function-declaration]
                        PLT_SWAP(ref_arr[x], ref_arr[x + 1]);
                        ^
../drivers/common/cnxk/roc_platform.h:46:20: note: expanded from macro 'PLT_SWAP'
#define PLT_SWAP                 RTE_SWAP
                                 ^
1 error generated.
[2242/2856] Compiling C object drivers/libtmp_rte_event_cnxk.a.p/event_cnxk_cn9k_worker_deq_tmo.c.o
[2243/2856] Compiling C object drivers/libtmp_rte_event_cnxk.a.p/event_cnxk_cn9k_worker_tx_enq_seg.c.o
[2244/2856] Compiling C object drivers/libtmp_rte_event_cnxk.a.p/event_cnxk_cnxk_eventdev_adptr.c.o
[2245/2856] Compiling C object drivers/libtmp_rte_event_cnxk.a.p/event_cnxk_cn9k_worker_dual_tx_enq_seg.c.o
[2246/2856] Compiling C object drivers/libtmp_rte_event_cnxk.a.p/event_cnxk_cn9k_worker_dual_deq_tmo.c.o
[2247/2856] Compiling C object drivers/libtmp_rte_event_cnxk.a.p/event_cnxk_cn10k_worker_deq.c.o
[2248/2856] Compiling C object drivers/libtmp_rte_event_cnxk.a.p/event_cnxk_cn10k_worker_tx_enq.c.o
[2249/2856] Compiling C object drivers/libtmp_rte_event_cnxk.a.p/event_cnxk_cn10k_worker_deq_tmo.c.o
[2250/2856] Compiling C object drivers/libtmp_rte_event_cnxk.a.p/event_cnxk_cn10k_worker_tx_enq_seg.c.o
ninja: build stopped




*Build Failed #5:
OS: SUSE15-64
Target: x86_64-native-linuxapp-gcc
FAILED: drivers/libtmp_rte_event_cnxk.a.p/event_cnxk_cnxk_tim_evdev.c.o 
gcc -Idrivers/libtmp_rte_event_cnxk.a.p -Idrivers -I../drivers -Idrivers/event/cnxk -I../drivers/event/cnxk -Ilib/eventdev -I../lib/eventdev -I. -I.. -Iconfig -I../config -Ilib/eal/include -I../lib/eal/include -Ilib/eal/linux/include -I../lib/eal/linux/include -Ilib/eal/x86/include -I../lib/eal/x86/include -Ilib/eal/common -I../lib/eal/common -Ilib/eal -I../lib/eal -Ilib/kvargs -I../lib/kvargs -Ilib/metrics -I../lib/metrics -Ilib/telemetry -I../lib/telemetry -Ilib/ring -I../lib/ring -Ilib/ethdev -I../lib/ethdev -Ilib/net -I../lib/net -Ilib/mbuf -I../lib/mbuf -Ilib/mempool -I../lib/mempool -Ilib/meter -I../lib/meter -Ilib/hash -I../lib/hash -Ilib/rcu -I../lib/rcu -Ilib/timer -I../lib/timer -Ilib/cryptodev -I../lib/cryptodev -Idrivers/bus/pci -I../drivers/bus/pci -I../drivers/bus/pci/linux -Ilib/pci -I../lib/pci -Idrivers/common/cnxk -I../drivers/common/cnxk -Ilib/security -I../lib/security -Idrivers/net/cnxk -I../drivers/net/cnxk -Idrivers/bus/vdev -I../drivers/bus/vdev -Idrivers/mempool/cnxk -I../drivers/mempool/cnxk -fdiagnostics-color=always -pipe -D_FILE_OFFSET_BITS=64 -Wall -Winvalid-pch -Werror -O3 -include rte_config.h -Wextra -Wcast-qual -Wdeprecated -Wformat -Wformat-nonliteral -Wformat-security -Wmissing-declarations -Wmissing-prototypes -Wnested-externs -Wold-style-definition -Wpointer-arith -Wsign-compare -Wstrict-prototypes -Wundef -Wwrite-strings -Wno-missing-field-initializers -D_GNU_SOURCE -fPIC -march=native -DALLOW_EXPERIMENTAL_API -DALLOW_INTERNAL_API -Wno-format-truncation -flax-vector-conversions -Wno-strict-aliasing -DRTE_LOG_DEFAULT_LOGTYPE=pmd.event.cnxk -MD -MQ drivers/libtmp_rte_event_cnxk.a.p/event_cnxk_cnxk_tim_evdev.c.o -MF drivers/libtmp_rte_event_cnxk.a.p/event_cnxk_cnxk_tim_evdev.c.o.d -o drivers/libtmp_rte_event_cnxk.a.p/event_cnxk_cnxk_tim_evdev.c.o -c ../drivers/event/cnxk/cnxk_tim_evdev.c
In file included from ../drivers/common/cnxk/roc_api.h:25:0,
                 from ../drivers/event/cnxk/cnxk_eventdev.h:18,
                 from ../drivers/event/cnxk/cnxk_tim_evdev.c:7:
../drivers/event/cnxk/cnxk_tim_evdev.c: In function ‘sort_multi_array’:
../drivers/common/cnxk/roc_platform.h:46:20: error: implicit declaration of function ‘RTE_SWAP’; did you mean ‘RTE_STR’? [-Werror=implicit-function-declaration]
 #define PLT_SWAP   RTE_SWAP
                    ^
../drivers/event/cnxk/cnxk_tim_evdev.c:128:4: note: in expansion of macro ‘PLT_SWAP’
    PLT_SWAP(ref_arr[x], ref_arr[x + 1]);
    ^~~~~~~~
../drivers/common/cnxk/roc_platform.h:46:20: error: nested extern declaration of ‘RTE_SWAP’ [-Werror=nested-externs]
 #define PLT_SWAP   RTE_SWAP
                    ^
../drivers/event/cnxk/cnxk_tim_evdev.c:128:4: note: in expansion of macro ‘PLT_SWAP’
    PLT_SWAP(ref_arr[x], ref_arr[x + 1]);
    ^~~~~~~~
cc1: all warnings being treated as errors
[2214/2825] Generating symbol file drivers/librte_crypto_octeontx.so.21.3.p/librte_crypto_octeontx.so.21.3.symbols
[2215/2825] Compiling C object drivers/libtmp_rte_event_cnxk.a.p/event_cnxk_cnxk_eventdev_adptr.c.o
[2216/2825] Compiling C object drivers/libtmp_rte_event_cnxk.a.p/event_cnxk_cnxk_eventdev_selftest.c.o
[2217/2825] Compiling C object drivers/libtmp_rte_event_cnxk.a.p/event_cnxk_cn10k_worker_deq_tmo.c.o
[2218/2825] Compiling C object drivers/libtmp_rte_event_cnxk.a.p/event_cnxk_cn10k_worker_deq.c.o
[2219/2825] Compiling C object drivers/libtmp_rte_event_cnxk.a.p/event_cnxk_cn10k_worker_tx_enq.c.o
[2220/2825] Compiling C object drivers/libtmp_rte_event_cnxk.a.p/event_cnxk_cn10k_worker_tx_enq_seg.c.o
ninja: build stopped




*Build Failed #6:
OS: UB2004-64
Target: x86_64-native-linuxapp-clang
FAILED: drivers/libtmp_rte_event_cnxk.a.p/event_cnxk_cnxk_tim_evdev.c.o 
clang -Idrivers/libtmp_rte_event_cnxk.a.p -Idrivers -I../drivers -Idrivers/event/cnxk -I../drivers/event/cnxk -Ilib/eventdev -I../lib/eventdev -I. -I.. -Iconfig -I../config -Ilib/eal/include -I../lib/eal/include -Ilib/eal/linux/include -I../lib/eal/linux/include -Ilib/eal/x86/include -I../lib/eal/x86/include -Ilib/eal/common -I../lib/eal/common -Ilib/eal -I../lib/eal -Ilib/kvargs -I../lib/kvargs -Ilib/metrics -I../lib/metrics -Ilib/telemetry -I../lib/telemetry -Ilib/ring -I../lib/ring -Ilib/ethdev -I../lib/ethdev -Ilib/net -I../lib/net -Ilib/mbuf -I../lib/mbuf -Ilib/mempool -I../lib/mempool -Ilib/meter -I../lib/meter -Ilib/hash -I../lib/hash -Ilib/rcu -I../lib/rcu -Ilib/timer -I../lib/timer -Ilib/cryptodev -I../lib/cryptodev -Idrivers/bus/pci -I../drivers/bus/pci -I../drivers/bus/pci/linux -Ilib/pci -I../lib/pci -Idrivers/common/cnxk -I../drivers/common/cnxk -Ilib/security -I../lib/security -Idrivers/net/cnxk -I../drivers/net/cnxk -Idrivers/bus/vdev -I../drivers/bus/vdev -Idrivers/mempool/cnxk -I../drivers/mempool/cnxk -Xclang -fcolor-diagnostics -pipe -D_FILE_OFFSET_BITS=64 -Wall -Winvalid-pch -Werror -O3 -include rte_config.h -Wextra -Wcast-qual -Wdeprecated -Wformat -Wformat-nonliteral -Wformat-security -Wmissing-declarations -Wmissing-prototypes -Wnested-externs -Wold-style-definition -Wpointer-arith -Wsign-compare -Wstrict-prototypes -Wundef -Wwrite-strings -Wno-address-of-packed-member -Wno-missing-field-initializers -D_GNU_SOURCE -fPIC -march=native -DALLOW_EXPERIMENTAL_API -DALLOW_INTERNAL_API -flax-vector-conversions -Wno-strict-aliasing -DRTE_LOG_DEFAULT_LOGTYPE=pmd.event.cnxk -MD -MQ drivers/libtmp_rte_event_cnxk.a.p/event_cnxk_cnxk_tim_evdev.c.o -MF drivers/libtmp_rte_event_cnxk.a.p/event_cnxk_cnxk_tim_evdev.c.o.d -o drivers/libtmp_rte_event_cnxk.a.p/event_cnxk_cnxk_tim_evdev.c.o -c ../drivers/event/cnxk/cnxk_tim_evdev.c
../drivers/event/cnxk/cnxk_tim_evdev.c:128:4: error: implicit declaration of function 'RTE_SWAP' is invalid in C99 [-Werror,-Wimplicit-function-declaration]
                        PLT_SWAP(ref_arr[x], ref_arr[x + 1]);
                        ^
../drivers/common/cnxk/roc_platform.h:46:20: note: expanded from macro 'PLT_SWAP'
#define PLT_SWAP                 RTE_SWAP
                                 ^
1 error generated.
[2269/2883] Compiling C object drivers/libtmp_rte_event_cnxk.a.p/event_cnxk_cn9k_worker_deq_tmo.c.o
[2270/2883] Compiling C object drivers/libtmp_rte_event_cnxk.a.p/event_cnxk_cnxk_eventdev_adptr.c.o
[2271/2883] Compiling C object drivers/libtmp_rte_event_cnxk.a.p/event_cnxk_cn9k_worker_tx_enq_seg.c.o
[2272/2883] Compiling C object drivers/libtmp_rte_event_cnxk.a.p/event_cnxk_cn9k_worker_dual_deq_tmo.c.o
[2273/2883] Compiling C object drivers/libtmp_rte_event_cnxk.a.p/event_cnxk_cn9k_worker_dual_tx_enq_seg.c.o
[2274/2883] Compiling C object drivers/libtmp_rte_event_cnxk.a.p/event_cnxk_cn10k_worker_deq.c.o
[2275/2883] Compiling C object drivers/libtmp_rte_event_cnxk.a.p/event_cnxk_cn10k_worker_tx_enq.c.o
[2276/2883] Compiling C object drivers/libtmp_rte_event_cnxk.a.p/event_cnxk_cn10k_worker_deq_tmo.c.o
[2277/2883] Compiling C object drivers/libtmp_rte_event_cnxk.a.p/event_cnxk_cn10k_worker_tx_enq_seg.c.o
ninja: build stopped




*Build Failed #7:
OS: UB2004-64
Target: x86_64-native-linuxapp-gcc
FAILED: drivers/libtmp_rte_event_cnxk.a.p/event_cnxk_cnxk_tim_evdev.c.o 
gcc -Idrivers/libtmp_rte_event_cnxk.a.p -Idrivers -I../drivers -Idrivers/event/cnxk -I../drivers/event/cnxk -Ilib/eventdev -I../lib/eventdev -I. -I.. -Iconfig -I../config -Ilib/eal/include -I../lib/eal/include -Ilib/eal/linux/include -I../lib/eal/linux/include -Ilib/eal/x86/include -I../lib/eal/x86/include -Ilib/eal/common -I../lib/eal/common -Ilib/eal -I../lib/eal -Ilib/kvargs -I../lib/kvargs -Ilib/metrics -I../lib/metrics -Ilib/telemetry -I../lib/telemetry -Ilib/ring -I../lib/ring -Ilib/ethdev -I../lib/ethdev -Ilib/net -I../lib/net -Ilib/mbuf -I../lib/mbuf -Ilib/mempool -I../lib/mempool -Ilib/meter -I../lib/meter -Ilib/hash -I../lib/hash -Ilib/rcu -I../lib/rcu -Ilib/timer -I../lib/timer -Ilib/cryptodev -I../lib/cryptodev -Idrivers/bus/pci -I../drivers/bus/pci -I../drivers/bus/pci/linux -Ilib/pci -I../lib/pci -Idrivers/common/cnxk -I../drivers/common/cnxk -Ilib/security -I../lib/security -Idrivers/net/cnxk -I../drivers/net/cnxk -Idrivers/bus/vdev -I../drivers/bus/vdev -Idrivers/mempool/cnxk -I../drivers/mempool/cnxk -fdiagnostics-color=always -pipe -D_FILE_OFFSET_BITS=64 -Wall -Winvalid-pch -Werror -O3 -include rte_config.h -Wextra -Wcast-qual -Wdeprecated -Wformat -Wformat-nonliteral -Wformat-security -Wmissing-declarations -Wmissing-prototypes -Wnested-externs -Wold-style-definition -Wpointer-arith -Wsign-compare -Wstrict-prototypes -Wundef -Wwrite-strings -Wno-address-of-packed-member -Wno-packed-not-aligned -Wno-missing-field-initializers -Wno-zero-length-bounds -D_GNU_SOURCE -fPIC -march=native -DALLOW_EXPERIMENTAL_API -DALLOW_INTERNAL_API -Wno-format-truncation -flax-vector-conversions -Wno-strict-aliasing -DRTE_LOG_DEFAULT_LOGTYPE=pmd.event.cnxk -MD -MQ drivers/libtmp_rte_event_cnxk.a.p/event_cnxk_cnxk_tim_evdev.c.o -MF drivers/libtmp_rte_event_cnxk.a.p/event_cnxk_cnxk_tim_evdev.c.o.d -o drivers/libtmp_rte_event_cnxk.a.p/event_cnxk_cnxk_tim_evdev.c.o -c ../drivers/event/cnxk/cnxk_tim_evdev.c
In file included from ../drivers/common/cnxk/roc_api.h:25,
                 from ../drivers/event/cnxk/cnxk_eventdev.h:18,
                 from ../drivers/event/cnxk/cnxk_tim_evdev.c:7:
../drivers/event/cnxk/cnxk_tim_evdev.c: In function ‘sort_multi_array’:
../drivers/common/cnxk/roc_platform.h:46:20: error: implicit declaration of function ‘RTE_SWAP’ [-Werror=implicit-function-declaration]
   46 | #define PLT_SWAP   RTE_SWAP
      |                    ^~~~~~~~
../drivers/event/cnxk/cnxk_tim_evdev.c:128:4: note: in expansion of macro ‘PLT_SWAP’
  128 |    PLT_SWAP(ref_arr[x], ref_arr[x + 1]);
      |    ^~~~~~~~
../drivers/common/cnxk/roc_platform.h:46:20: error: nested extern declaration of ‘RTE_SWAP’ [-Werror=nested-externs]
   46 | #define PLT_SWAP   RTE_SWAP
      |                    ^~~~~~~~
../drivers/event/cnxk/cnxk_tim_evdev.c:128:4: note: in expansion of macro ‘PLT_SWAP’
  128 |    PLT_SWAP(ref_arr[x], ref_arr[x + 1]);
      |    ^~~~~~~~
cc1: all warnings being treated as errors
[2262/2883] Compiling C object drivers/libtmp_rte_event_cnxk.a.p/event_cnxk_cn9k_worker_dual_deq_tmo.c.o
[2263/2883] Compiling C object drivers/libtmp_rte_event_cnxk.a.p/event_cnxk_cn9k_worker_tx_enq_seg.c.o
[2264/2883] Compiling C object drivers/libtmp_rte_event_cnxk.a.p/event_cnxk_cnxk_eventdev_adptr.c.o
[2265/2883] Compiling C object drivers/libtmp_rte_event_cnxk.a.p/event_cnxk_cn9k_worker_dual_tx_enq_seg.c.o
[2266/2883] Compiling C object drivers/libtmp_rte_crypto_octeontx.a.p/crypto_octeontx_otx_cryptodev_ops.c.o
[2267/2883] Compiling C object drivers/libtmp_rte_event_cnxk.a.p/event_cnxk_cn10k_worker_deq.c.o
[2268/2883] Compiling C object drivers/libtmp_rte_event_cnxk.a.p/event_cnxk_cn10k_worker_deq_tmo.c.o
[2269/2883] Compiling C object drivers/libtmp_rte_event_cnxk.a.p/event_cnxk_cn10k_worker_tx_enq.c.o
[2270/2883] Compiling C object drivers/libtmp_rte_event_cnxk.a.p/event_cnxk_cn10k_worker_tx_enq_seg.c.o
ninja: build stopped




*Build Failed #8:
OS: UB2004-64
Target: x86_64-native-linuxapp-icc
FAILED: drivers/libtmp_rte_event_cnxk.a.p/event_cnxk_cnxk_tim_evdev.c.o 
icc -Idrivers/libtmp_rte_event_cnxk.a.p -Idrivers -I../drivers -Idrivers/event/cnxk -I../drivers/event/cnxk -Ilib/eventdev -I../lib/eventdev -I. -I.. -Iconfig -I../config -Ilib/eal/include -I../lib/eal/include -Ilib/eal/linux/include -I../lib/eal/linux/include -Ilib/eal/x86/include -I../lib/eal/x86/include -Ilib/eal/common -I../lib/eal/common -Ilib/eal -I../lib/eal -Ilib/kvargs -I../lib/kvargs -Ilib/metrics -I../lib/metrics -Ilib/telemetry -I../lib/telemetry -Ilib/ring -I../lib/ring -Ilib/ethdev -I../lib/ethdev -Ilib/net -I../lib/net -Ilib/mbuf -I../lib/mbuf -Ilib/mempool -I../lib/mempool -Ilib/meter -I../lib/meter -Ilib/hash -I../lib/hash -Ilib/rcu -I../lib/rcu -Ilib/timer -I../lib/timer -Ilib/cryptodev -I../lib/cryptodev -Idrivers/bus/pci -I../drivers/bus/pci -I../drivers/bus/pci/linux -Ilib/pci -I../lib/pci -Idrivers/common/cnxk -I../drivers/common/cnxk -Ilib/security -I../lib/security -Idrivers/net/cnxk -I../drivers/net/cnxk -Idrivers/bus/vdev -I../drivers/bus/vdev -Idrivers/mempool/cnxk -I../drivers/mempool/cnxk -pipe -D_FILE_OFFSET_BITS=64 -Wall -w3 -diag-disable:remark -Werror -O3 -include rte_config.h -Wextra -Wcast-qual -Wdeprecated -Wformat -Wformat-security -Wmissing-declarations -Wmissing-prototypes -Wold-style-definition -Wpointer-arith -Wsign-compare -Wstrict-prototypes -Wundef -Wwrite-strings -Wno-missing-field-initializers -diag-disable=181 -diag-disable=188 -diag-disable=2203 -diag-disable=2279 -diag-disable=2557 -diag-disable=3179 -diag-disable=3656 -D_GNU_SOURCE -fPIC -march=native -DALLOW_EXPERIMENTAL_API -DALLOW_INTERNAL_API -Wno-strict-aliasing -DRTE_LOG_DEFAULT_LOGTYPE=pmd.event.cnxk -MD -MQ drivers/libtmp_rte_event_cnxk.a.p/event_cnxk_cnxk_tim_evdev.c.o -MF drivers/libtmp_rte_event_cnxk.a.p/event_cnxk_cnxk_tim_evdev.c.o.d -o drivers/libtmp_rte_event_cnxk.a.p/event_cnxk_cnxk_tim_evdev.c.o -c ../drivers/event/cnxk/cnxk_tim_evdev.c
../drivers/event/cnxk/cnxk_tim_evdev.c(128): error #266: function "RTE_SWAP" declared implicitly
  			PLT_SWAP(ref_arr[x], ref_arr[x + 1]);
  			^

compilation aborted for ../drivers/event/cnxk/cnxk_tim_evdev.c (code 2)
[2205/2836] Compiling C object drivers/libtmp_rte_event_cnxk.a.p/event_cnxk_cn9k_worker_dual_deq_tmo.c.o
[2206/2836] Compiling C object drivers/libtmp_rte_event_cnxk.a.p/event_cnxk_cn9k_worker_tx_enq.c.o
[2207/2836] Compiling C object drivers/libtmp_rte_event_cnxk.a.p/event_cnxk_cn9k_worker_dual_tx_enq.c.o
[2208/2836] Compiling C object drivers/libtmp_rte_event_cnxk.a.p/event_cnxk_cn10k_worker_deq.c.o
[2209/2836] Compiling C object drivers/libtmp_rte_event_cnxk.a.p/event_cnxk_cn10k_worker_deq_tmo.c.o
[2210/2836] Compiling C object drivers/libtmp_rte_event_cnxk.a.p/event_cnxk_cn9k_worker_tx_enq_seg.c.o
[2211/2836] Compiling C object drivers/libtmp_rte_event_cnxk.a.p/event_cnxk_cn9k_worker_dual_tx_enq_seg.c.o
[2212/2836] Compiling C object drivers/libtmp_rte_crypto_octeontx2.a.p/crypto_octeontx2_otx2_cryptodev_ops.c.o
[2213/2836] Compiling C object drivers/libtmp_rte_event_cnxk.a.p/event_cnxk_cn10k_worker_tx_enq.c.o
[2214/2836] Compiling C object drivers/libtmp_rte_crypto_octeontx.a.p/crypto_octeontx_otx_cryptodev_ops.c.o
[2215/2836] Compiling C object drivers/libtmp_rte_event_cnxk.a.p/event_cnxk_cn10k_worker_tx_enq_seg.c.o
ninja: build stopped




*Build Failed #9:
OS: UB2104-64
Target: x86_64-native-linuxapp-gcc
FAILED: drivers/libtmp_rte_event_cnxk.a.p/event_cnxk_cnxk_tim_evdev.c.o 
gcc -Idrivers/libtmp_rte_event_cnxk.a.p -Idrivers -I../drivers -Idrivers/event/cnxk -I../drivers/event/cnxk -Ilib/eventdev -I../lib/eventdev -I. -I.. -Iconfig -I../config -Ilib/eal/include -I../lib/eal/include -Ilib/eal/linux/include -I../lib/eal/linux/include -Ilib/eal/x86/include -I../lib/eal/x86/include -Ilib/eal/common -I../lib/eal/common -Ilib/eal -I../lib/eal -Ilib/kvargs -I../lib/kvargs -Ilib/metrics -I../lib/metrics -Ilib/telemetry -I../lib/telemetry -Ilib/ring -I../lib/ring -Ilib/ethdev -I../lib/ethdev -Ilib/net -I../lib/net -Ilib/mbuf -I../lib/mbuf -Ilib/mempool -I../lib/mempool -Ilib/meter -I../lib/meter -Ilib/hash -I../lib/hash -Ilib/rcu -I../lib/rcu -Ilib/timer -I../lib/timer -Ilib/cryptodev -I../lib/cryptodev -Idrivers/bus/pci -I../drivers/bus/pci -I../drivers/bus/pci/linux -Ilib/pci -I../lib/pci -Idrivers/common/cnxk -I../drivers/common/cnxk -Ilib/security -I../lib/security -Idrivers/net/cnxk -I../drivers/net/cnxk -Idrivers/bus/vdev -I../drivers/bus/vdev -Idrivers/mempool/cnxk -I../drivers/mempool/cnxk -fdiagnostics-color=always -pipe -D_FILE_OFFSET_BITS=64 -Wall -Winvalid-pch -Werror -O3 -include rte_config.h -Wextra -Wcast-qual -Wdeprecated -Wformat -Wformat-nonliteral -Wformat-security -Wmissing-declarations -Wmissing-prototypes -Wnested-externs -Wold-style-definition -Wpointer-arith -Wsign-compare -Wstrict-prototypes -Wundef -Wwrite-strings -Wno-address-of-packed-member -Wno-packed-not-aligned -Wno-missing-field-initializers -Wno-zero-length-bounds -D_GNU_SOURCE -fPIC -march=native -DALLOW_EXPERIMENTAL_API -DALLOW_INTERNAL_API -Wno-format-truncation -flax-vector-conversions -Wno-strict-aliasing -DRTE_LOG_DEFAULT_LOGTYPE=pmd.event.cnxk -MD -MQ drivers/libtmp_rte_event_cnxk.a.p/event_cnxk_cnxk_tim_evdev.c.o -MF drivers/libtmp_rte_event_cnxk.a.p/event_cnxk_cnxk_tim_evdev.c.o.d -o drivers/libtmp_rte_event_cnxk.a.p/event_cnxk_cnxk_tim_evdev.c.o -c ../drivers/event/cnxk/cnxk_tim_evdev.c
In file included from ../drivers/common/cnxk/roc_api.h:25,
                 from ../drivers/event/cnxk/cnxk_eventdev.h:18,
                 from ../drivers/event/cnxk/cnxk_tim_evdev.c:7:
../drivers/event/cnxk/cnxk_tim_evdev.c: In function ‘sort_multi_array’:
../drivers/common/cnxk/roc_platform.h:46:20: error: implicit declaration of function ‘RTE_SWAP’ [-Werror=implicit-function-declaration]
   46 | #define PLT_SWAP   RTE_SWAP
      |                    ^~~~~~~~
../drivers/event/cnxk/cnxk_tim_evdev.c:128:4: note: in expansion of macro ‘PLT_SWAP’
  128 |    PLT_SWAP(ref_arr[x], ref_arr[x + 1]);
      |    ^~~~~~~~
../drivers/common/cnxk/roc_platform.h:46:20: error: nested extern declaration of ‘RTE_SWAP’ [-Werror=nested-externs]
   46 | #define PLT_SWAP   RTE_SWAP
      |                    ^~~~~~~~
../drivers/event/cnxk/cnxk_tim_evdev.c:128:4: note: in expansion of macro ‘PLT_SWAP’
  128 |    PLT_SWAP(ref_arr[x], ref_arr[x + 1]);
      |    ^~~~~~~~
cc1: all warnings being treated as errors
[2279/2896] Compiling C object drivers/libtmp_rte_event_cnxk.a.p/event_cnxk_cnxk_eventdev_stats.c.o
[2280/2896] Compiling C object drivers/libtmp_rte_crypto_octeontx.a.p/crypto_octeontx_otx_cryptodev_ops.c.o
[2281/2896] Compiling C object drivers/libtmp_rte_event_cnxk.a.p/event_cnxk_cn9k_worker_dual_tx_enq_seg.c.o
[2282/2896] Compiling C object drivers/libtmp_rte_event_cnxk.a.p/event_cnxk_cnxk_tim_worker.c.o
[2283/2896] Compiling C object drivers/libtmp_rte_event_cnxk.a.p/event_cnxk_cnxk_eventdev_selftest.c.o
[2284/2896] Compiling C object drivers/libtmp_rte_event_cnxk.a.p/event_cnxk_cn10k_worker_deq.c.o
[2285/2896] Compiling C object drivers/libtmp_rte_event_cnxk.a.p/event_cnxk_cn10k_worker_deq_tmo.c.o
[2286/2896] Compiling C object drivers/libtmp_rte_event_cnxk.a.p/event_cnxk_cn10k_worker_tx_enq.c.o
[2287/2896] Compiling C object drivers/libtmp_rte_event_cnxk.a.p/event_cnxk_cn10k_worker_tx_enq_seg.c.o
ninja: build stopped




*Build Failed #10:
OS: UB2004-64
Target: x86_64-native-linuxapp-doc
FAILED: drivers/a715181@@tmp_rte_event_cnxk at sta/event_cnxk_cnxk_tim_evdev.c.o 
gcc -Idrivers/a715181@@tmp_rte_event_cnxk at sta -Idrivers -I../drivers -Idrivers/event/cnxk -I../drivers/event/cnxk -Ilib/eventdev -I../lib/eventdev -I. -I../ -Iconfig -I../config -Ilib/eal/include -I../lib/eal/include -Ilib/eal/linux/include -I../lib/eal/linux/include -Ilib/eal/x86/include -I../lib/eal/x86/include -Ilib/eal/common -I../lib/eal/common -Ilib/eal -I../lib/eal -Ilib/kvargs -I../lib/kvargs -Ilib/telemetry/../metrics -I../lib/telemetry/../metrics -Ilib/telemetry -I../lib/telemetry -Ilib/ring -I../lib/ring -Ilib/ethdev -I../lib/ethdev -Ilib/net -I../lib/net -Ilib/mbuf -I../lib/mbuf -Ilib/mempool -I../lib/mempool -Ilib/meter -I../lib/meter -Ilib/hash -I../lib/hash -Ilib/rcu -I../lib/rcu -Ilib/timer -I../lib/timer -Ilib/cryptodev -I../lib/cryptodev -Idrivers/bus/pci -I../drivers/bus/pci -I../drivers/bus/pci/linux -Ilib/pci -I../lib/pci -Idrivers/common/cnxk -I../drivers/common/cnxk -Idrivers/common/cnxk/../../bus/pci -I../drivers/common/cnxk/../../bus/pci -Idrivers/common/cnxk/../../../lib/net -I../drivers/common/cnxk/../../../lib/net -Ilib/security -I../lib/security -Idrivers/net/cnxk -I../drivers/net/cnxk -Idrivers/bus/vdev -I../drivers/bus/vdev -Idrivers/mempool/cnxk -I../drivers/mempool/cnxk -fdiagnostics-color=always -pipe -D_FILE_OFFSET_BITS=64 -Wall -Winvalid-pch -Werror -O3 -include rte_config.h -Wextra -Wcast-qual -Wdeprecated -Wformat -Wformat-nonliteral -Wformat-security -Wmissing-declarations -Wmissing-prototypes -Wnested-externs -Wold-style-definition -Wpointer-arith -Wsign-compare -Wstrict-prototypes -Wundef -Wwrite-strings -Wno-address-of-packed-member -Wno-packed-not-aligned -Wno-missing-field-initializers -Wno-zero-length-bounds -D_GNU_SOURCE -fPIC -march=native -DALLOW_EXPERIMENTAL_API -DALLOW_INTERNAL_API -Wno-format-truncation -flax-vector-conversions -Wno-strict-aliasing -DRTE_LOG_DEFAULT_LOGTYPE=pmd.event.cnxk -MD -MQ 'drivers/a715181@@tmp_rte_event_cnxk at sta/event_cnxk_cnxk_tim_evdev.c.o' -MF 'drivers/a715181@@tmp_rte_event_cnxk at sta/event_cnxk_cnxk_tim_evdev.c.o.d' -o 'drivers/a715181@@tmp_rte_event_cnxk at sta/event_cnxk_cnxk_tim_evdev.c.o' -c ../drivers/event/cnxk/cnxk_tim_evdev.c
In file included from ../drivers/common/cnxk/roc_api.h:25,
                 from ../drivers/event/cnxk/cnxk_eventdev.h:18,
                 from ../drivers/event/cnxk/cnxk_tim_evdev.c:7:
../drivers/event/cnxk/cnxk_tim_evdev.c: In function ‘sort_multi_array’:
../drivers/common/cnxk/roc_platform.h:46:20: error: implicit declaration of function ‘RTE_SWAP’ [-Werror=implicit-function-declaration]
   46 | #define PLT_SWAP   RTE_SWAP
      |                    ^~~~~~~~
../drivers/event/cnxk/cnxk_tim_evdev.c:128:4: note: in expansion of macro ‘PLT_SWAP’
  128 |    PLT_SWAP(ref_arr[x], ref_arr[x + 1]);
      |    ^~~~~~~~
../drivers/common/cnxk/roc_platform.h:46:20: error: nested extern declaration of ‘RTE_SWAP’ [-Werror=nested-externs]
   46 | #define PLT_SWAP   RTE_SWAP
      |                    ^~~~~~~~
../drivers/event/cnxk/cnxk_tim_evdev.c:128:4: note: in expansion of macro ‘PLT_SWAP’
  128 |    PLT_SWAP(ref_arr[x], ref_arr[x + 1]);
      |    ^~~~~~~~
cc1: all warnings being treated as errors
[2221/2645] Compiling C object 'drivers/a715181@@tmp_rte_event_dlb2 at sta/event_dlb2_dlb2_iface.c.o'.
[2222/2645] Compiling C object 'drivers/a715181@@tmp_rte_event_cnxk at sta/event_cnxk_cnxk_eventdev_selftest.c.o'.
[2223/2645] Compiling C object 'drivers/a715181@@tmp_rte_event_cnxk at sta/event_cnxk_cnxk_tim_worker.c.o'.
[2224/2645] Compiling C object 'drivers/a715181@@tmp_rte_crypto_octeontx at sta/crypto_octeontx_otx_cryptodev_ops.c.o'.
[2225/2645] Compiling C object 'drivers/a715181@@tmp_rte_event_dlb2 at sta/event_dlb2_dlb2.c.o'.
[2226/2645] Compiling C object 'drivers/a715181@@tmp_rte_event_cnxk at sta/event_cnxk_cn10k_worker_deq.c.o'.
[2227/2645] Compiling C object 'drivers/a715181@@tmp_rte_event_cnxk at sta/event_cnxk_cn10k_worker_deq_tmo.c.o'.
[2228/2645] Compiling C object 'drivers/a715181@@tmp_rte_event_cnxk at sta/event_cnxk_cn10k_worker_tx_enq.c.o'.
[2229/2645] Compiling C object 'drivers/a715181@@tmp_rte_event_cnxk at sta/event_cnxk_cn10k_worker_tx_enq_seg.c.o'.
ninja: build stopped




*Build Failed #11:
OS: FC34-64
Target: x86_64-native-linuxapp-gcc
FAILED: drivers/libtmp_rte_event_cnxk.a.p/event_cnxk_cnxk_tim_evdev.c.o 
gcc -Idrivers/libtmp_rte_event_cnxk.a.p -Idrivers -I../drivers -Idrivers/event/cnxk -I../drivers/event/cnxk -Ilib/eventdev -I../lib/eventdev -I. -I.. -Iconfig -I../config -Ilib/eal/include -I../lib/eal/include -Ilib/eal/linux/include -I../lib/eal/linux/include -Ilib/eal/x86/include -I../lib/eal/x86/include -Ilib/eal/common -I../lib/eal/common -Ilib/eal -I../lib/eal -Ilib/kvargs -I../lib/kvargs -Ilib/metrics -I../lib/metrics -Ilib/telemetry -I../lib/telemetry -Ilib/ring -I../lib/ring -Ilib/ethdev -I../lib/ethdev -Ilib/net -I../lib/net -Ilib/mbuf -I../lib/mbuf -Ilib/mempool -I../lib/mempool -Ilib/meter -I../lib/meter -Ilib/hash -I../lib/hash -Ilib/rcu -I../lib/rcu -Ilib/timer -I../lib/timer -Ilib/cryptodev -I../lib/cryptodev -Idrivers/bus/pci -I../drivers/bus/pci -I../drivers/bus/pci/linux -Ilib/pci -I../lib/pci -Idrivers/common/cnxk -I../drivers/common/cnxk -Ilib/security -I../lib/security -Idrivers/net/cnxk -I../drivers/net/cnxk -Idrivers/bus/vdev -I../drivers/bus/vdev -Idrivers/mempool/cnxk -I../drivers/mempool/cnxk -fdiagnostics-color=always -pipe -D_FILE_OFFSET_BITS=64 -Wall -Winvalid-pch -Werror -O3 -include rte_config.h -Wextra -Wcast-qual -Wdeprecated -Wformat -Wformat-nonliteral -Wformat-security -Wmissing-declarations -Wmissing-prototypes -Wnested-externs -Wold-style-definition -Wpointer-arith -Wsign-compare -Wstrict-prototypes -Wundef -Wwrite-strings -Wno-address-of-packed-member -Wno-packed-not-aligned -Wno-missing-field-initializers -Wno-zero-length-bounds -D_GNU_SOURCE -fPIC -march=native -DALLOW_EXPERIMENTAL_API -DALLOW_INTERNAL_API -Wno-format-truncation -flax-vector-conversions -Wno-strict-aliasing -DRTE_LOG_DEFAULT_LOGTYPE=pmd.event.cnxk -MD -MQ drivers/libtmp_rte_event_cnxk.a.p/event_cnxk_cnxk_tim_evdev.c.o -MF drivers/libtmp_rte_event_cnxk.a.p/event_cnxk_cnxk_tim_evdev.c.o.d -o drivers/libtmp_rte_event_cnxk.a.p/event_cnxk_cnxk_tim_evdev.c.o -c ../drivers/event/cnxk/cnxk_tim_evdev.c
In file included from ../drivers/common/cnxk/roc_api.h:25,
                 from ../drivers/event/cnxk/cnxk_eventdev.h:18,
                 from ../drivers/event/cnxk/cnxk_tim_evdev.c:7:
../drivers/event/cnxk/cnxk_tim_evdev.c: In function ‘sort_multi_array’:
../drivers/common/cnxk/roc_platform.h:46:34: error: implicit declaration of function ‘RTE_SWAP’ [-Werror=implicit-function-declaration]
   46 | #define PLT_SWAP                 RTE_SWAP
      |                                  ^~~~~~~~
../drivers/event/cnxk/cnxk_tim_evdev.c:128:25: note: in expansion of macro ‘PLT_SWAP’
  128 |                         PLT_SWAP(ref_arr[x], ref_arr[x + 1]);
      |                         ^~~~~~~~
../drivers/common/cnxk/roc_platform.h:46:34: error: nested extern declaration of ‘RTE_SWAP’ [-Werror=nested-externs]
   46 | #define PLT_SWAP                 RTE_SWAP
      |                                  ^~~~~~~~
../drivers/event/cnxk/cnxk_tim_evdev.c:128:25: note: in expansion of macro ‘PLT_SWAP’
  128 |                         PLT_SWAP(ref_arr[x], ref_arr[x + 1]);
      |                         ^~~~~~~~
cc1: all warnings being treated as errors
[2246/2862] Compiling C object drivers/libtmp_rte_event_cnxk.a.p/event_cnxk_cnxk_eventdev_stats.c.o
[2247/2862] Compiling C object drivers/libtmp_rte_event_cnxk.a.p/event_cnxk_cn9k_worker_dual_tx_enq_seg.c.o
[2248/2862] Compiling C object drivers/libtmp_rte_event_dlb2.a.p/event_dlb2_rte_pmd_dlb2.c.o
[2249/2862] Compiling C object drivers/libtmp_rte_crypto_octeontx.a.p/crypto_octeontx_otx_cryptodev_ops.c.o
[2250/2862] Compiling C object drivers/libtmp_rte_event_dlb2.a.p/event_dlb2_dlb2_xstats.c.o
[2251/2862] Compiling C object drivers/libtmp_rte_event_cnxk.a.p/event_cnxk_cnxk_tim_worker.c.o
[2252/2862] Compiling C object drivers/libtmp_rte_event_cnxk.a.p/event_cnxk_cnxk_eventdev_selftest.c.o
[2253/2862] Compiling C object drivers/libtmp_rte_event_cnxk.a.p/event_cnxk_cn10k_worker_deq.c.o
[2254/2862] Compiling C object drivers/libtmp_rte_event_cnxk.a.p/event_cnxk_cn10k_worker_deq_tmo.c.o
[2255/2862] Compiling C object drivers/libtmp_rte_event_cnxk.a.p/event_cnxk_cn10k_worker_tx_enq.c.o
[2256/2862] Compiling C object drivers/libtmp_rte_event_cnxk.a.p/event_cnxk_cn10k_worker_tx_enq_seg.c.o
ninja: build stopped




*Build Failed #12:
OS: FC34-64
Target: x86_64-native-linuxapp-clang
FAILED: drivers/libtmp_rte_event_cnxk.a.p/event_cnxk_cnxk_tim_evdev.c.o 
clang -Idrivers/libtmp_rte_event_cnxk.a.p -Idrivers -I../drivers -Idrivers/event/cnxk -I../drivers/event/cnxk -Ilib/eventdev -I../lib/eventdev -I. -I.. -Iconfig -I../config -Ilib/eal/include -I../lib/eal/include -Ilib/eal/linux/include -I../lib/eal/linux/include -Ilib/eal/x86/include -I../lib/eal/x86/include -Ilib/eal/common -I../lib/eal/common -Ilib/eal -I../lib/eal -Ilib/kvargs -I../lib/kvargs -Ilib/metrics -I../lib/metrics -Ilib/telemetry -I../lib/telemetry -Ilib/ring -I../lib/ring -Ilib/ethdev -I../lib/ethdev -Ilib/net -I../lib/net -Ilib/mbuf -I../lib/mbuf -Ilib/mempool -I../lib/mempool -Ilib/meter -I../lib/meter -Ilib/hash -I../lib/hash -Ilib/rcu -I../lib/rcu -Ilib/timer -I../lib/timer -Ilib/cryptodev -I../lib/cryptodev -Idrivers/bus/pci -I../drivers/bus/pci -I../drivers/bus/pci/linux -Ilib/pci -I../lib/pci -Idrivers/common/cnxk -I../drivers/common/cnxk -Ilib/security -I../lib/security -Idrivers/net/cnxk -I../drivers/net/cnxk -Idrivers/bus/vdev -I../drivers/bus/vdev -Idrivers/mempool/cnxk -I../drivers/mempool/cnxk -Xclang -fcolor-diagnostics -pipe -D_FILE_OFFSET_BITS=64 -Wall -Winvalid-pch -Werror -O3 -include rte_config.h -Wextra -Wcast-qual -Wdeprecated -Wformat -Wformat-nonliteral -Wformat-security -Wmissing-declarations -Wmissing-prototypes -Wnested-externs -Wold-style-definition -Wpointer-arith -Wsign-compare -Wstrict-prototypes -Wundef -Wwrite-strings -Wno-address-of-packed-member -Wno-missing-field-initializers -D_GNU_SOURCE -fPIC -march=native -DALLOW_EXPERIMENTAL_API -DALLOW_INTERNAL_API -flax-vector-conversions -Wno-strict-aliasing -DRTE_LOG_DEFAULT_LOGTYPE=pmd.event.cnxk -MD -MQ drivers/libtmp_rte_event_cnxk.a.p/event_cnxk_cnxk_tim_evdev.c.o -MF drivers/libtmp_rte_event_cnxk.a.p/event_cnxk_cnxk_tim_evdev.c.o.d -o drivers/libtmp_rte_event_cnxk.a.p/event_cnxk_cnxk_tim_evdev.c.o -c ../drivers/event/cnxk/cnxk_tim_evdev.c
../drivers/event/cnxk/cnxk_tim_evdev.c:128:4: error: implicit declaration of function 'RTE_SWAP' is invalid in C99 [-Werror,-Wimplicit-function-declaration]
                        PLT_SWAP(ref_arr[x], ref_arr[x + 1]);
                        ^
../drivers/common/cnxk/roc_platform.h:46:20: note: expanded from macro 'PLT_SWAP'
#define PLT_SWAP                 RTE_SWAP
                                 ^
1 error generated.
[2248/2862] Compiling C object drivers/libtmp_rte_event_cnxk.a.p/event_cnxk_cnxk_eventdev_adptr.c.o
[2249/2862] Compiling C object drivers/libtmp_rte_event_cnxk.a.p/event_cnxk_cn9k_worker_tx_enq_seg.c.o
[2250/2862] Compiling C object drivers/libtmp_rte_event_cnxk.a.p/event_cnxk_cn9k_worker_deq_tmo.c.o
[2251/2862] Compiling C object drivers/libtmp_rte_event_cnxk.a.p/event_cnxk_cn9k_worker_dual_deq_tmo.c.o
[2252/2862] Compiling C object drivers/libtmp_rte_event_cnxk.a.p/event_cnxk_cn9k_worker_dual_tx_enq_seg.c.o
[2253/2862] Compiling C object drivers/libtmp_rte_event_cnxk.a.p/event_cnxk_cn10k_worker_deq.c.o
[2254/2862] Compiling C object drivers/libtmp_rte_event_cnxk.a.p/event_cnxk_cn10k_worker_tx_enq.c.o
[2255/2862] Compiling C object drivers/libtmp_rte_event_cnxk.a.p/event_cnxk_cn10k_worker_deq_tmo.c.o
[2256/2862] Compiling C object drivers/libtmp_rte_event_cnxk.a.p/event_cnxk_cn10k_worker_tx_enq_seg.c.o
ninja: build stopped




*Build Failed #13:
OS: RHEL83-64
Target: x86_64-native-linuxapp-clang
FAILED: drivers/a715181@@tmp_rte_event_cnxk at sta/event_cnxk_cnxk_tim_evdev.c.o 
clang -Idrivers/a715181@@tmp_rte_event_cnxk at sta -Idrivers -I../drivers -Idrivers/event/cnxk -I../drivers/event/cnxk -Ilib/eventdev -I../lib/eventdev -I. -I../ -Iconfig -I../config -Ilib/eal/include -I../lib/eal/include -Ilib/eal/linux/include -I../lib/eal/linux/include -Ilib/eal/x86/include -I../lib/eal/x86/include -Ilib/eal/common -I../lib/eal/common -Ilib/eal -I../lib/eal -Ilib/kvargs -I../lib/kvargs -Ilib/telemetry/../metrics -I../lib/telemetry/../metrics -Ilib/telemetry -I../lib/telemetry -Ilib/ring -I../lib/ring -Ilib/ethdev -I../lib/ethdev -Ilib/net -I../lib/net -Ilib/mbuf -I../lib/mbuf -Ilib/mempool -I../lib/mempool -Ilib/meter -I../lib/meter -Ilib/hash -I../lib/hash -Ilib/rcu -I../lib/rcu -Ilib/timer -I../lib/timer -Ilib/cryptodev -I../lib/cryptodev -Idrivers/bus/pci -I../drivers/bus/pci -I../drivers/bus/pci/linux -Ilib/pci -I../lib/pci -Idrivers/common/cnxk -I../drivers/common/cnxk -Idrivers/common/cnxk/../../bus/pci -I../drivers/common/cnxk/../../bus/pci -Idrivers/common/cnxk/../../../lib/net -I../drivers/common/cnxk/../../../lib/net -Ilib/security -I../lib/security -Idrivers/net/cnxk -I../drivers/net/cnxk -Idrivers/bus/vdev -I../drivers/bus/vdev -Idrivers/mempool/cnxk -I../drivers/mempool/cnxk -Xclang -fcolor-diagnostics -pipe -D_FILE_OFFSET_BITS=64 -Wall -Winvalid-pch -Werror -O3 -include rte_config.h -Wextra -Wcast-qual -Wdeprecated -Wformat -Wformat-nonliteral -Wformat-security -Wmissing-declarations -Wmissing-prototypes -Wnested-externs -Wold-style-definition -Wpointer-arith -Wsign-compare -Wstrict-prototypes -Wundef -Wwrite-strings -Wno-address-of-packed-member -Wno-missing-field-initializers -D_GNU_SOURCE -fPIC -march=native -DALLOW_EXPERIMENTAL_API -DALLOW_INTERNAL_API -flax-vector-conversions -Wno-strict-aliasing -DRTE_LOG_DEFAULT_LOGTYPE=pmd.event.cnxk -MD -MQ 'drivers/a715181@@tmp_rte_event_cnxk at sta/event_cnxk_cnxk_tim_evdev.c.o' -MF 'drivers/a715181@@tmp_rte_event_cnxk at sta/event_cnxk_cnxk_tim_evdev.c.o.d' -o 'drivers/a715181@@tmp_rte_event_cnxk at sta/event_cnxk_cnxk_tim_evdev.c.o' -c ../drivers/event/cnxk/cnxk_tim_evdev.c
../drivers/event/cnxk/cnxk_tim_evdev.c:128:4: error: implicit declaration of function 'RTE_SWAP' is invalid in C99 [-Werror,-Wimplicit-function-declaration]
                        PLT_SWAP(ref_arr[x], ref_arr[x + 1]);
                        ^
../drivers/common/cnxk/roc_platform.h:46:20: note: expanded from macro 'PLT_SWAP'
#define PLT_SWAP                 RTE_SWAP
                                 ^
1 error generated.
[2200/2806] Compiling C object 'drivers/a715181@@tmp_rte_event_cnxk at sta/event_cnxk_cnxk_tim_worker.c.o'.
[2201/2806] Compiling C object 'drivers/a715181@@tmp_rte_event_dlb2 at sta/event_dlb2_dlb2_iface.c.o'.
[2202/2806] Compiling C object 'drivers/a715181@@tmp_rte_event_dlb2 at sta/event_dlb2_dlb2_xstats.c.o'.
[2203/2806] Compiling C object 'drivers/a715181@@tmp_rte_event_cnxk at sta/event_cnxk_cnxk_eventdev_selftest.c.o'.
[2204/2806] Compiling C object 'drivers/a715181@@tmp_rte_event_dlb2 at sta/event_dlb2_dlb2.c.o'.
[2205/2806] Compiling C object 'drivers/a715181@@tmp_rte_event_cnxk at sta/event_cnxk_cn10k_worker_deq.c.o'.
[2206/2806] Compiling C object 'drivers/a715181@@tmp_rte_event_cnxk at sta/event_cnxk_cn10k_worker_tx_enq.c.o'.
[2207/2806] Compiling C object 'drivers/a715181@@tmp_rte_event_cnxk at sta/event_cnxk_cn10k_worker_deq_tmo.c.o'.
[2208/2806] Compiling C object 'drivers/a715181@@tmp_rte_event_cnxk at sta/event_cnxk_cn10k_worker_tx_enq_seg.c.o'.
ninja: build stopped




*Build Failed #14:
OS: RHEL83-64
Target: x86_64-native-linuxapp-gcc+shared
FAILED: drivers/a715181@@tmp_rte_event_cnxk at sta/event_cnxk_cnxk_tim_evdev.c.o 
gcc -Idrivers/a715181@@tmp_rte_event_cnxk at sta -Idrivers -I../drivers -Idrivers/event/cnxk -I../drivers/event/cnxk -Ilib/eventdev -I../lib/eventdev -I. -I../ -Iconfig -I../config -Ilib/eal/include -I../lib/eal/include -Ilib/eal/linux/include -I../lib/eal/linux/include -Ilib/eal/x86/include -I../lib/eal/x86/include -Ilib/eal/common -I../lib/eal/common -Ilib/eal -I../lib/eal -Ilib/kvargs -I../lib/kvargs -Ilib/telemetry/../metrics -I../lib/telemetry/../metrics -Ilib/telemetry -I../lib/telemetry -Ilib/ring -I../lib/ring -Ilib/ethdev -I../lib/ethdev -Ilib/net -I../lib/net -Ilib/mbuf -I../lib/mbuf -Ilib/mempool -I../lib/mempool -Ilib/meter -I../lib/meter -Ilib/hash -I../lib/hash -Ilib/rcu -I../lib/rcu -Ilib/timer -I../lib/timer -Ilib/cryptodev -I../lib/cryptodev -Idrivers/bus/pci -I../drivers/bus/pci -I../drivers/bus/pci/linux -Ilib/pci -I../lib/pci -Idrivers/common/cnxk -I../drivers/common/cnxk -Idrivers/common/cnxk/../../bus/pci -I../drivers/common/cnxk/../../bus/pci -Idrivers/common/cnxk/../../../lib/net -I../drivers/common/cnxk/../../../lib/net -Ilib/security -I../lib/security -Idrivers/net/cnxk -I../drivers/net/cnxk -Idrivers/bus/vdev -I../drivers/bus/vdev -Idrivers/mempool/cnxk -I../drivers/mempool/cnxk -fdiagnostics-color=always -pipe -D_FILE_OFFSET_BITS=64 -Wall -Winvalid-pch -Werror -O3 -include rte_config.h -Wextra -Wcast-qual -Wdeprecated -Wformat -Wformat-nonliteral -Wformat-security -Wmissing-declarations -Wmissing-prototypes -Wnested-externs -Wold-style-definition -Wpointer-arith -Wsign-compare -Wstrict-prototypes -Wundef -Wwrite-strings -Wno-packed-not-aligned -Wno-missing-field-initializers -D_GNU_SOURCE -fPIC -march=native -DALLOW_EXPERIMENTAL_API -DALLOW_INTERNAL_API -Wno-format-truncation -flax-vector-conversions -Wno-strict-aliasing -DRTE_LOG_DEFAULT_LOGTYPE=pmd.event.cnxk -MD -MQ 'drivers/a715181@@tmp_rte_event_cnxk at sta/event_cnxk_cnxk_tim_evdev.c.o' -MF 'drivers/a715181@@tmp_rte_event_cnxk at sta/event_cnxk_cnxk_tim_evdev.c.o.d' -o 'drivers/a715181@@tmp_rte_event_cnxk at sta/event_cnxk_cnxk_tim_evdev.c.o' -c ../drivers/event/cnxk/cnxk_tim_evdev.c
In file included from ../drivers/common/cnxk/roc_api.h:25,
                 from ../drivers/event/cnxk/cnxk_eventdev.h:18,
                 from ../drivers/event/cnxk/cnxk_tim_evdev.c:7:
../drivers/event/cnxk/cnxk_tim_evdev.c: In function ‘sort_multi_array’:
../drivers/common/cnxk/roc_platform.h:46:20: error: implicit declaration of function ‘RTE_SWAP’; did you mean ‘RTE_MAX’? [-Werror=implicit-function-declaration]
 #define PLT_SWAP   RTE_SWAP
                    ^~~~~~~~
../drivers/event/cnxk/cnxk_tim_evdev.c:128:4: note: in expansion of macro ‘PLT_SWAP’
    PLT_SWAP(ref_arr[x], ref_arr[x + 1]);
    ^~~~~~~~
../drivers/common/cnxk/roc_platform.h:46:20: error: nested extern declaration of ‘RTE_SWAP’ [-Werror=nested-externs]
 #define PLT_SWAP   RTE_SWAP
                    ^~~~~~~~
../drivers/event/cnxk/cnxk_tim_evdev.c:128:4: note: in expansion of macro ‘PLT_SWAP’
    PLT_SWAP(ref_arr[x], ref_arr[x + 1]);
    ^~~~~~~~
cc1: all warnings being treated as errors
[2215/2639] Compiling C object 'drivers/a715181@@tmp_rte_event_dlb2 at sta/event_dlb2_dlb2_iface.c.o'.
[2216/2639] Compiling C object 'drivers/a715181@@tmp_rte_event_dlb2 at sta/event_dlb2_dlb2_xstats.c.o'.
[2217/2639] Compiling C object 'drivers/a715181@@tmp_rte_event_cnxk at sta/event_cnxk_cnxk_tim_worker.c.o'.
[2218/2639] Compiling C object 'drivers/a715181@@tmp_rte_event_dlb2 at sta/event_dlb2_pf_dlb2_pf.c.o'.
[2219/2639] Compiling C object 'drivers/a715181@@tmp_rte_event_cnxk at sta/event_cnxk_cnxk_eventdev_selftest.c.o'.
[2220/2639] Compiling C object 'drivers/a715181@@tmp_rte_event_dlb2 at sta/event_dlb2_dlb2.c.o'.
[2221/2639] Compiling C object 'drivers/a715181@@tmp_rte_event_cnxk at sta/event_cnxk_cn10k_worker_deq.c.o'.
[2222/2639] Compiling C object 'drivers/a715181@@tmp_rte_crypto_octeontx at sta/crypto_octeontx_otx_cryptodev_ops.c.o'.
[2223/2639] Compiling C object 'drivers/a715181@@tmp_rte_event_cnxk at sta/event_cnxk_cn10k_worker_deq_tmo.c.o'.
[2224/2639] Compiling C object 'drivers/a715181@@tmp_rte_event_cnxk at sta/event_cnxk_cn10k_worker_tx_enq.c.o'.
[2225/2639] Compiling C object 'drivers/a715181@@tmp_rte_event_cnxk at sta/event_cnxk_cn10k_worker_tx_enq_seg.c.o'.
ninja: build stopped




*Build Failed #15:
OS: RHEL83-64
Target: x86_64-native-linuxapp-gcc+debug
FAILED: drivers/a715181@@tmp_rte_event_cnxk at sta/event_cnxk_cnxk_tim_evdev.c.o 
gcc -Idrivers/a715181@@tmp_rte_event_cnxk at sta -Idrivers -I../drivers -Idrivers/event/cnxk -I../drivers/event/cnxk -Ilib/eventdev -I../lib/eventdev -I. -I../ -Iconfig -I../config -Ilib/eal/include -I../lib/eal/include -Ilib/eal/linux/include -I../lib/eal/linux/include -Ilib/eal/x86/include -I../lib/eal/x86/include -Ilib/eal/common -I../lib/eal/common -Ilib/eal -I../lib/eal -Ilib/kvargs -I../lib/kvargs -Ilib/telemetry/../metrics -I../lib/telemetry/../metrics -Ilib/telemetry -I../lib/telemetry -Ilib/ring -I../lib/ring -Ilib/ethdev -I../lib/ethdev -Ilib/net -I../lib/net -Ilib/mbuf -I../lib/mbuf -Ilib/mempool -I../lib/mempool -Ilib/meter -I../lib/meter -Ilib/hash -I../lib/hash -Ilib/rcu -I../lib/rcu -Ilib/timer -I../lib/timer -Ilib/cryptodev -I../lib/cryptodev -Idrivers/bus/pci -I../drivers/bus/pci -I../drivers/bus/pci/linux -Ilib/pci -I../lib/pci -Idrivers/common/cnxk -I../drivers/common/cnxk -Idrivers/common/cnxk/../../bus/pci -I../drivers/common/cnxk/../../bus/pci -Idrivers/common/cnxk/../../../lib/net -I../drivers/common/cnxk/../../../lib/net -Ilib/security -I../lib/security -Idrivers/net/cnxk -I../drivers/net/cnxk -Idrivers/bus/vdev -I../drivers/bus/vdev -Idrivers/mempool/cnxk -I../drivers/mempool/cnxk -fdiagnostics-color=always -pipe -D_FILE_OFFSET_BITS=64 -Wall -Winvalid-pch -Werror -O2 -g -include rte_config.h -Wextra -Wcast-qual -Wdeprecated -Wformat -Wformat-nonliteral -Wformat-security -Wmissing-declarations -Wmissing-prototypes -Wnested-externs -Wold-style-definition -Wpointer-arith -Wsign-compare -Wstrict-prototypes -Wundef -Wwrite-strings -Wno-packed-not-aligned -Wno-missing-field-initializers -D_GNU_SOURCE -fPIC -march=native -DALLOW_EXPERIMENTAL_API -DALLOW_INTERNAL_API -Wno-format-truncation -flax-vector-conversions -Wno-strict-aliasing -DRTE_LOG_DEFAULT_LOGTYPE=pmd.event.cnxk -MD -MQ 'drivers/a715181@@tmp_rte_event_cnxk at sta/event_cnxk_cnxk_tim_evdev.c.o' -MF 'drivers/a715181@@tmp_rte_event_cnxk at sta/event_cnxk_cnxk_tim_evdev.c.o.d' -o 'drivers/a715181@@tmp_rte_event_cnxk at sta/event_cnxk_cnxk_tim_evdev.c.o' -c ../drivers/event/cnxk/cnxk_tim_evdev.c
In file included from ../drivers/common/cnxk/roc_api.h:25,
                 from ../drivers/event/cnxk/cnxk_eventdev.h:18,
                 from ../drivers/event/cnxk/cnxk_tim_evdev.c:7:
../drivers/event/cnxk/cnxk_tim_evdev.c: In function ‘sort_multi_array’:
../drivers/common/cnxk/roc_platform.h:46:20: error: implicit declaration of function ‘RTE_SWAP’; did you mean ‘RTE_MAX’? [-Werror=implicit-function-declaration]
 #define PLT_SWAP   RTE_SWAP
                    ^~~~~~~~
../drivers/event/cnxk/cnxk_tim_evdev.c:128:4: note: in expansion of macro ‘PLT_SWAP’
    PLT_SWAP(ref_arr[x], ref_arr[x + 1]);
    ^~~~~~~~
../drivers/common/cnxk/roc_platform.h:46:20: error: nested extern declaration of ‘RTE_SWAP’ [-Werror=nested-externs]
 #define PLT_SWAP   RTE_SWAP
                    ^~~~~~~~
../drivers/event/cnxk/cnxk_tim_evdev.c:128:4: note: in expansion of macro ‘PLT_SWAP’
    PLT_SWAP(ref_arr[x], ref_arr[x + 1]);
    ^~~~~~~~
cc1: all warnings being treated as errors
[2198/2806] Compiling C object 'drivers/a715181@@tmp_rte_event_cnxk at sta/event_cnxk_cnxk_eventdev_selftest.c.o'.
[2199/2806] Compiling C object 'drivers/a715181@@tmp_rte_event_cnxk at sta/event_cnxk_cn10k_worker_deq.c.o'.
[2200/2806] Compiling C object 'drivers/a715181@@tmp_rte_event_cnxk at sta/event_cnxk_cn10k_worker_deq_tmo.c.o'.
[2201/2806] Compiling C object 'drivers/a715181@@tmp_rte_event_cnxk at sta/event_cnxk_cn10k_worker_tx_enq.c.o'.
[2202/2806] Compiling C object 'drivers/a715181@@tmp_rte_event_cnxk at sta/event_cnxk_cn10k_worker_tx_enq_seg.c.o'.
ninja: build stopped




*Build Failed #16:
OS: RHEL83-64
Target: x86_64-native-linuxapp-icc
FAILED: drivers/libtmp_rte_event_cnxk.a.p/event_cnxk_cnxk_tim_evdev.c.o 
icc -Idrivers/libtmp_rte_event_cnxk.a.p -Idrivers -I../drivers -Idrivers/event/cnxk -I../drivers/event/cnxk -Ilib/eventdev -I../lib/eventdev -I. -I.. -Iconfig -I../config -Ilib/eal/include -I../lib/eal/include -Ilib/eal/linux/include -I../lib/eal/linux/include -Ilib/eal/x86/include -I../lib/eal/x86/include -Ilib/eal/common -I../lib/eal/common -Ilib/eal -I../lib/eal -Ilib/kvargs -I../lib/kvargs -Ilib/metrics -I../lib/metrics -Ilib/telemetry -I../lib/telemetry -Ilib/ring -I../lib/ring -Ilib/ethdev -I../lib/ethdev -Ilib/net -I../lib/net -Ilib/mbuf -I../lib/mbuf -Ilib/mempool -I../lib/mempool -Ilib/meter -I../lib/meter -Ilib/hash -I../lib/hash -Ilib/rcu -I../lib/rcu -Ilib/timer -I../lib/timer -Ilib/cryptodev -I../lib/cryptodev -Idrivers/bus/pci -I../drivers/bus/pci -I../drivers/bus/pci/linux -Ilib/pci -I../lib/pci -Idrivers/common/cnxk -I../drivers/common/cnxk -Ilib/security -I../lib/security -Idrivers/net/cnxk -I../drivers/net/cnxk -Idrivers/bus/vdev -I../drivers/bus/vdev -Idrivers/mempool/cnxk -I../drivers/mempool/cnxk -pipe -D_FILE_OFFSET_BITS=64 -Wall -w3 -diag-disable:remark -Werror -O3 -include rte_config.h -Wextra -Wcast-qual -Wdeprecated -Wformat -Wformat-security -Wmissing-declarations -Wmissing-prototypes -Wold-style-definition -Wpointer-arith -Wsign-compare -Wstrict-prototypes -Wundef -Wwrite-strings -Wno-missing-field-initializers -diag-disable=181 -diag-disable=188 -diag-disable=2203 -diag-disable=2279 -diag-disable=2557 -diag-disable=3179 -diag-disable=3656 -D_GNU_SOURCE -fPIC -march=native -DALLOW_EXPERIMENTAL_API -DALLOW_INTERNAL_API -Wno-strict-aliasing -DRTE_LOG_DEFAULT_LOGTYPE=pmd.event.cnxk -MD -MQ drivers/libtmp_rte_event_cnxk.a.p/event_cnxk_cnxk_tim_evdev.c.o -MF drivers/libtmp_rte_event_cnxk.a.p/event_cnxk_cnxk_tim_evdev.c.o.d -o drivers/libtmp_rte_event_cnxk.a.p/event_cnxk_cnxk_tim_evdev.c.o -c ../drivers/event/cnxk/cnxk_tim_evdev.c
../drivers/event/cnxk/cnxk_tim_evdev.c(128): error #266: function "RTE_SWAP" declared implicitly
  			PLT_SWAP(ref_arr[x], ref_arr[x + 1]);
  			^

compilation aborted for ../drivers/event/cnxk/cnxk_tim_evdev.c (code 2)
[2258/2886] Compiling C object drivers/libtmp_rte_event_cnxk.a.p/event_cnxk_cnxk_eventdev_adptr.c.o
[2259/2886] Compiling C object drivers/libtmp_rte_event_cnxk.a.p/event_cnxk_cn10k_worker_deq.c.o
[2260/2886] Compiling C object drivers/libtmp_rte_crypto_octeontx2.a.p/crypto_octeontx2_otx2_cryptodev_ops.c.o
[2261/2886] Compiling C object drivers/libtmp_rte_event_cnxk.a.p/event_cnxk_cn10k_worker_deq_tmo.c.o
[2262/2886] Compiling C object drivers/libtmp_rte_event_cnxk.a.p/event_cnxk_cn9k_worker_tx_enq_seg.c.o
[2263/2886] Compiling C object drivers/libtmp_rte_event_cnxk.a.p/event_cnxk_cn9k_worker_dual_tx_enq_seg.c.o
[2264/2886] Compiling C object drivers/libtmp_rte_event_cnxk.a.p/event_cnxk_cn10k_worker_tx_enq.c.o
[2265/2886] Compiling C object drivers/libtmp_rte_crypto_octeontx.a.p/crypto_octeontx_otx_cryptodev_ops.c.o
[2266/2886] Compiling C object drivers/libtmp_rte_event_cnxk.a.p/event_cnxk_cn10k_worker_tx_enq_seg.c.o
ninja: build stopped


DPDK STV team


More information about the test-report mailing list