[dpdk-test-report] |FAILURE| pw94158 [PATCH] [v3, 1/2] devargs: add common key definition

dpdklab at iol.unh.edu dpdklab at iol.unh.edu
Sun Jun 13 11:28:16 CEST 2021


Test-Label: iol-testing
Test-Status: FAILURE
http://dpdk.org/patch/94158

_build patch failure_

Submitter: Xueming Li <xuemingl at nvidia.com>
Date: Sunday, June 13 2021 08:19:16 
Applied on: CommitID:2ca92f54410400af76a1f0bc3bfecc8077e282aa
Apply patch set 94158 failed:

[1/1912] Linking static target lib/librte_pipeline.a
[2/1912] Linking static target lib/librte_vhost.a
[3/1912] Linking static target drivers/common/sfc_efx/base/libsfc_base.a
[4/1912] Linking static target drivers/libtmp_rte_mempool_bucket.a
[5/1912] Linking static target drivers/libtmp_rte_mempool_cnxk.a
[6/1912] Linking target drivers/librte_common_mlx5.so.21.3
[7/1912] Generating rte_mempool_dpaa_mingw with a custom command
[8/1912] Generating rte_mempool_dpaa_def with a custom command
[9/1912] Generating rte_mempool_dpaa2_mingw with a custom command
[10/1912] Linking target lib/librte_flow_classify.so.21.3
[11/1912] Generating rte_mempool_dpaa2_def with a custom command
[12/1912] Generating rte_mempool_octeontx_def with a custom command
[13/1912] Linking target drivers/librte_common_cnxk.so.21.3
[14/1912] Linking target drivers/librte_common_qat.so.21.3
[15/1912] Generating rte_mempool_octeontx_mingw with a custom command
[16/1912] Compiling C object drivers/libtmp_rte_common_sfc_efx.a.p/common_sfc_efx_sfc_efx.c.o
FAILED: drivers/libtmp_rte_common_sfc_efx.a.p/common_sfc_efx_sfc_efx.c.o 
cc -Idrivers/libtmp_rte_common_sfc_efx.a.p -Idrivers -I../drivers -Idrivers/common/sfc_efx -I../drivers/common/sfc_efx -Idrivers/common/sfc_efx/base -I../drivers/common/sfc_efx/base -Idrivers/bus/pci -I../drivers/bus/pci -I../drivers/bus/pci/linux -I. -I.. -Iconfig -I../config -Ilib/eal/include -I../lib/eal/include -Ilib/eal/linux/include -I../lib/eal/linux/include -Ilib/eal/x86/include -I../lib/eal/x86/include -Ilib/eal/common -I../lib/eal/common -Ilib/eal -I../lib/eal -Ilib/kvargs -I../lib/kvargs -Ilib/metrics -I../lib/metrics -Ilib/telemetry -I../lib/telemetry -Ilib/pci -I../lib/pci -fdiagnostics-color=always -D_FILE_OFFSET_BITS=64 -Wall -Winvalid-pch -O3 -include rte_config.h -Wextra -Wcast-qual -Wdeprecated -Wformat -Wformat-nonliteral -Wformat-security -Wmissing-declarations -Wmissing-prototypes -Wnested-externs -Wold-style-definition -Wpointer-arith -Wsign-compare -Wstrict-prototypes -Wundef -Wwrite-strings -Wno-missing-field-initializers -D_GNU_SOURCE -fPIC -march=native -DALLOW_EXPERIMENTAL_API -DALLOW_INTERNAL_API -Wno-format-truncation -Wdisabled-optimization -Waggregate-return -Wbad-function-cast -DRTE_LOG_DEFAULT_LOGTYPE=pmd.common.sfc_efx -MD -MQ drivers/libtmp_rte_common_sfc_efx.a.p/common_sfc_efx_sfc_efx.c.o -MF drivers/libtmp_rte_common_sfc_efx.a.p/common_sfc_efx_sfc_efx.c.o.d -o drivers/libtmp_rte_common_sfc_efx.a.p/common_sfc_efx_sfc_efx.c.o -c ../drivers/common/sfc_efx/sfc_efx.c
../drivers/common/sfc_efx/sfc_efx.c: In function ‘sfc_efx_dev_class_get’:
../drivers/common/sfc_efx/sfc_efx.c:45:20: error: ‘SFC_EFX_KVARG_DEV_CLASS’ undeclared (first use in this function); did you mean ‘SFC_EFX_DEV_NCLASS’?
  const char *key = SFC_EFX_KVARG_DEV_CLASS;
                    ^~~~~~~~~~~~~~~~~~~~~~~
                    SFC_EFX_DEV_NCLASS
../drivers/common/sfc_efx/sfc_efx.c:45:20: note: each undeclared identifier is reported only once for each function it appears in
[17/1912] Generating rte_mempool_bucket.pmd.c with a custom command
[18/1912] Generating rte_mempool_cnxk.pmd.c with a custom command
[19/1912] Compiling C object drivers/libtmp_rte_mempool_octeontx.a.p/mempool_octeontx_rte_mempool_octeontx.c.o
[20/1912] Compiling C object drivers/raw/ifpga/base/libifpga_rawdev_base.a.p/ifpga_fme_dperf.c.o
[21/1912] Compiling C object drivers/libtmp_rte_mempool_dpaa.a.p/mempool_dpaa_dpaa_mempool.c.o
[22/1912] Compiling C object drivers/libtmp_rte_mempool_octeontx2.a.p/mempool_octeontx2_otx2_mempool_debug.c.o
[23/1912] Compiling C object drivers/libtmp_rte_mempool_octeontx.a.p/mempool_octeontx_octeontx_fpavf.c.o
[24/1912] Compiling C object drivers/libtmp_rte_mempool_dpaa2.a.p/mempool_dpaa2_dpaa2_hw_mempool.c.o
[25/1912] Compiling C object drivers/libtmp_rte_mempool_octeontx2.a.p/mempool_octeontx2_otx2_mempool_irq.c.o
[26/1912] Compiling C object drivers/raw/ifpga/base/libifpga_rawdev_base.a.p/ifpga_fme_iperf.c.o
[27/1912] Compiling C object drivers/libtmp_rte_mempool_octeontx2.a.p/mempool_octeontx2_otx2_mempool.c.o
[28/1912] Compiling C object drivers/raw/ifpga/base/libifpga_rawdev_base.a.p/ifpga_fme_error.c.o
[29/1912] Compiling C object drivers/libtmp_rte_mempool_octeontx2.a.p/mempool_octeontx2_otx2_mempool_ops.c.o
[30/1912] Generating symbol file drivers/librte_common_mlx5.so.21.3.p/librte_common_mlx5.so.21.3.symbols
[31/1912] Generating symbol file drivers/librte_common_cnxk.so.21.3.p/librte_common_cnxk.so.21.3.symbols
[32/1912] Generating vhost.sym_chk with a custom command (wrapped by meson to capture output)
[33/1912] Generating pipeline.sym_chk with a custom command (wrapped by meson to capture output)
ninja: build stopped: subcommand failed.

https://lab.dpdk.org/results/dashboard/patchsets/17368/

UNH-IOL DPDK Community Lab


More information about the test-report mailing list