[dpdk-test-report] |FAILURE| pw94683 [dpdk-dev] [PATCH 2/2] drivers: add octeontx crypto adapter data path

0-day Robot robot at bytheb.org
Tue Jun 22 20:02:03 CEST 2021


From: robot at bytheb.org

Test-Label: github-robot
Test-Status: FAILURE
http://patchwork.dpdk.org/patch/94683/

_github build: failed_
Build URL: https://github.com/ovsrobot/dpdk/actions/runs/961470563
Build Logs:
-----------------------Summary of failed steps-----------------------
ubuntu-18.04-gcc-static-i386 failed at step "Build and test"
----------------------End summary of failed steps--------------------

-------------------------------BEGIN LOGS----------------------------
####################################################################################
#### [Begin job log] ubuntu-18.04-gcc-static-i386 at step "Build and test"
####################################################################################
[1709/2461] Compiling C object 'drivers/a715181@@tmp_rte_event_octeontx at sta/event_octeontx_ssovf_worker.c.o'.
FAILED: drivers/a715181@@tmp_rte_event_octeontx at sta/event_octeontx_ssovf_worker.c.o 
ccache gcc -Idrivers/a715181@@tmp_rte_event_octeontx at sta -Idrivers -I../drivers -Idrivers/event/octeontx -I../drivers/event/octeontx -Ilib/eventdev -I../lib/eventdev -I. -I../ -Iconfig -I../config -Ilib/eal/include -I../lib/eal/include -Ilib/eal/linux/include -I../lib/eal/linux/include -Ilib/eal/x86/include -I../lib/eal/x86/include -Ilib/eal/common -I../lib/eal/common -Ilib/eal -I../lib/eal -Ilib/kvargs -I../lib/kvargs -Ilib/telemetry/../metrics -I../lib/telemetry/../metrics -Ilib/telemetry -I../lib/telemetry -Ilib/ring -I../lib/ring -Ilib/ethdev -I../lib/ethdev -Ilib/net -I../lib/net -Ilib/mbuf -I../lib/mbuf -Ilib/mempool -I../lib/mempool -Ilib/meter -I../lib/meter -Ilib/hash -I../lib/hash -Ilib/rcu -I../lib/rcu -Ilib/timer -I../lib/timer -Ilib/cryptodev -I../lib/cryptodev -Idrivers/common/octeontx -I../drivers/common/octeontx -Idrivers/mempool/octeontx -I../drivers/mempool/octeontx -Idrivers/bus/pci -I../drivers/bus/pci -I../drivers/bus/pci/linux -Ilib/pci -I../lib/pci -Idrivers/bus/vdev -I../drivers/bus/vdev -Idrivers/net/octeontx -I../drivers/net/octeontx -Idrivers/net/octeontx/base -I../drivers/net/octeontx/base -Idrivers/crypto/octeontx -I../drivers/crypto/octeontx -Idrivers/crypto/octeontx/../../common/cpt -I../drivers/crypto/octeontx/../../common/cpt -Idrivers/crypto/octeontx/../../common/octeontx -I../drivers/crypto/octeontx/../../common/octeontx -Idrivers/crypto/octeontx/../../event/octeontx -I../drivers/crypto/octeontx/../../event/octeontx -Idrivers/crypto/octeontx/../../mempool/octeontx -I../drivers/crypto/octeontx/../../mempool/octeontx -Idrivers/crypto/octeontx/../../net/octeontx -I../drivers/crypto/octeontx/../../net/octeontx -Idrivers/common/cpt -I../drivers/common/cpt -Idrivers/common/cpt/../../crypto/octeontx -I../drivers/common/cpt/../../crypto/octeontx -fdiagnostics-color=always -pipe -D_FILE_OFFSET_BITS=64 -Wall -Winvalid-pch -Werror -O2 -g -include rte_config.h -Wextra -Wcast-qual -Wdeprecated -Wformat -Wformat-nonliteral -Wformat-security -Wmissing-declarations -Wmissing-prototypes -Wnested-externs -Wold-style-definition -Wpointer-arith -Wsign-compare -Wstrict-prototypes -Wundef -Wwrite-strings -Wno-missing-field-initializers -Wno-pointer-to-int-cast -D_GNU_SOURCE -m32 -fPIC -march=corei7 -DALLOW_EXPERIMENTAL_API -DALLOW_INTERNAL_API -Wno-format-truncation -DRTE_LOG_DEFAULT_LOGTYPE=pmd.event.octeontx  -MD -MQ 'drivers/a715181@@tmp_rte_event_octeontx at sta/event_octeontx_ssovf_worker.c.o' -MF 'drivers/a715181@@tmp_rte_event_octeontx at sta/event_octeontx_ssovf_worker.c.o.d' -o 'drivers/a715181@@tmp_rte_event_octeontx at sta/event_octeontx_ssovf_worker.c.o' -c ../drivers/event/octeontx/ssovf_worker.c
In file included from ../drivers/event/octeontx/ssovf_worker.c:5:0:
../drivers/event/octeontx/ssovf_worker.h: In function ‘ssows_head_wait’:
../drivers/event/octeontx/ssovf_worker.h:268:57: error: left shift count >= width of type [-Werror=shift-count-overflow]
  while (!(ssovf_read64(ws->base + SSOW_VHWS_TAG) & (1UL << 35)))
                                                         ^~
cc1: all warnings being treated as errors
[1710/2461] Compiling C object 'drivers/a715181@@tmp_rte_baseband_fpga_5gnr_fec at sta/baseband_fpga_5gnr_fec_rte_fpga_5gnr_fec.c.o'.
[1711/2461] Compiling C object 'drivers/a715181@@tmp_rte_crypto_octeontx at sta/crypto_octeontx_otx_cryptodev_ops.c.o'.
FAILED: drivers/a715181@@tmp_rte_crypto_octeontx at sta/crypto_octeontx_otx_cryptodev_ops.c.o 
ccache gcc -Idrivers/a715181@@tmp_rte_crypto_octeontx at sta -Idrivers -I../drivers -Idrivers/crypto/octeontx -I../drivers/crypto/octeontx -Idrivers/crypto/octeontx/../../common/cpt -I../drivers/crypto/octeontx/../../common/cpt -Idrivers/crypto/octeontx/../../common/octeontx -I../drivers/crypto/octeontx/../../common/octeontx -Idrivers/crypto/octeontx/../../event/octeontx -I../drivers/crypto/octeontx/../../event/octeontx -Idrivers/crypto/octeontx/../../mempool/octeontx -I../drivers/crypto/octeontx/../../mempool/octeontx -Idrivers/crypto/octeontx/../../net/octeontx -I../drivers/crypto/octeontx/../../net/octeontx -Ilib/cryptodev -I../lib/cryptodev -I. -I../ -Iconfig -I../config -Ilib/eal/include -I../lib/eal/include -Ilib/eal/linux/include -I../lib/eal/linux/include -Ilib/eal/x86/include -I../lib/eal/x86/include -Ilib/eal/common -I../lib/eal/common -Ilib/eal -I../lib/eal -Ilib/kvargs -I../lib/kvargs -Ilib/telemetry/../metrics -I../lib/telemetry/../metrics -Ilib/telemetry -I../lib/telemetry -Ilib/mbuf -I../lib/mbuf -Ilib/mempool -I../lib/mempool -Ilib/ring -I../lib/ring -Ilib/rcu -I../lib/rcu -Idrivers/bus/pci -I../drivers/bus/pci -I../drivers/bus/pci/linux -Ilib/pci -I../lib/pci -Idrivers/bus/vdev -I../drivers/bus/vdev -Idrivers/common/cpt -I../drivers/common/cpt -Idrivers/common/cpt/../../crypto/octeontx -I../drivers/common/cpt/../../crypto/octeontx -Ilib/eventdev -I../lib/eventdev -Ilib/ethdev -I../lib/ethdev -Ilib/net -I../lib/net -Ilib/meter -I../lib/meter -Ilib/hash -I../lib/hash -Ilib/timer -I../lib/timer -fdiagnostics-color=always -pipe -D_FILE_OFFSET_BITS=64 -Wall -Winvalid-pch -Werror -O2 -g -include rte_config.h -Wextra -Wcast-qual -Wdeprecated -Wformat -Wformat-nonliteral -Wformat-security -Wmissing-declarations -Wmissing-prototypes -Wnested-externs -Wold-style-definition -Wpointer-arith -Wsign-compare -Wstrict-prototypes -Wundef -Wwrite-strings -Wno-missing-field-initializers -Wno-pointer-to-int-cast -D_GNU_SOURCE -m32 -fPIC -march=corei7 -DALLOW_EXPERIMENTAL_API -DALLOW_INTERNAL_API -Wno-format-truncation -DRTE_LOG_DEFAULT_LOGTYPE=pmd.crypto.octeontx  -MD -MQ 'drivers/a715181@@tmp_rte_crypto_octeontx at sta/crypto_octeontx_otx_cryptodev_ops.c.o' -MF 'drivers/a715181@@tmp_rte_crypto_octeontx at sta/crypto_octeontx_otx_cryptodev_ops.c.o.d' -o 'drivers/a715181@@tmp_rte_crypto_octeontx at sta/crypto_octeontx_otx_cryptodev_ops.c.o' -c ../drivers/crypto/octeontx/otx_cryptodev_ops.c
In file included from ../drivers/crypto/octeontx/otx_cryptodev_ops.c:26:0:
../drivers/crypto/octeontx/../../event/octeontx/ssovf_worker.h: In function ‘ssows_head_wait’:
../drivers/crypto/octeontx/../../event/octeontx/ssovf_worker.h:268:57: error: left shift count >= width of type [-Werror=shift-count-overflow]
  while (!(ssovf_read64(ws->base + SSOW_VHWS_TAG) & (1UL << 35)))
                                                         ^~
../drivers/crypto/octeontx/otx_cryptodev_ops.c: In function ‘otx_crypto_adapter_dequeue’:
../drivers/crypto/octeontx/otx_cryptodev_ops.c:1031:8: error: cast to pointer from integer of different size [-Werror=int-to-pointer-cast]
  req = (struct cpt_request_info *)(get_work1);
        ^
cc1: all warnings being treated as errors
ninja: build stopped: subcommand failed.
##[error]Process completed with exit code 1.
####################################################################################
#### [End job log] ubuntu-18.04-gcc-static-i386 at step "Build and test"
####################################################################################
--------------------------------END LOGS-----------------------------


More information about the test-report mailing list