[dpdk-test-report] |FAILURE| pw89270 [dpdk-dev] [dpdk-dev v21.11] [PATCH v3 8/8] eventdev: simplify Rx adapter event vector config

0-day Robot robot at bytheb.org
Tue Mar 16 22:57:01 CET 2021


From: robot at bytheb.org

Test-Label: github-robot
Test-Status: FAILURE
http://patchwork.dpdk.org/patch/89270/

_github build: failed_
Build URL: https://github.com/ovsrobot/dpdk/actions/runs/658956923
Build Logs:
-----------------------Summary of failed steps-----------------------
ubuntu-18.04-gcc-static failed at step "Build and test"
ubuntu-18.04-gcc-shared-abi+doc+tests failed at step "Build and test"
ubuntu-18.04-clang-static failed at step "Build and test"
ubuntu-18.04-clang-shared-doc+tests failed at step "Build and test"
ubuntu-18.04-gcc-static-i386 failed at step "Build and test"
ubuntu-18.04-gcc-static-aarch64 failed at step "Build and test"
ubuntu-18.04-gcc-shared-aarch64 failed at step "Build and test"
----------------------End summary of failed steps--------------------

-------------------------------BEGIN LOGS----------------------------
####################################################################################
#### [Begin job log] ubuntu-18.04-gcc-static at step "Build and test"
####################################################################################
[266/3172] Generating symbol file 'lib/lib@@rte_compressdev at sha/librte_compressdev.so.21.2.symbols'.
[267/3172] Generating symbol file 'lib/lib@@rte_cryptodev at sha/librte_cryptodev.so.21.2.symbols'.
[268/3172] Generating efd.sym_chk with a meson_exe.py custom command.
[269/3172] Linking target lib/librte_efd.so.21.2.
[270/3172] Generating rte_eventdev_mingw with a custom command.
[271/3172] Compiling C object 'lib/lib@@rte_eventdev at sta/librte_eventdev_rte_event_ring.c.o'.
[272/3172] Compiling C object 'lib/lib@@rte_eventdev at sta/librte_eventdev_eventdev_trace_points.c.o'.
[273/3172] Compiling C object 'lib/lib@@rte_eventdev at sta/librte_eventdev_rte_event_eth_rx_adapter.c.o'.
FAILED: lib/lib@@rte_eventdev at sta/librte_eventdev_rte_event_eth_rx_adapter.c.o 
ccache gcc -Ilib/lib@@rte_eventdev at sta -Ilib -I../lib -Ilib/librte_eventdev -I../lib/librte_eventdev -I. -I../ -Iconfig -I../config -Ilib/librte_eal/include -I../lib/librte_eal/include -Ilib/librte_eal/linux/include -I../lib/librte_eal/linux/include -Ilib/librte_eal/x86/include -I../lib/librte_eal/x86/include -Ilib/librte_eal/common -I../lib/librte_eal/common -Ilib/librte_eal -I../lib/librte_eal -Ilib/librte_kvargs -I../lib/librte_kvargs -Ilib/librte_telemetry/../librte_metrics -I../lib/librte_telemetry/../librte_metrics -Ilib/librte_telemetry -I../lib/librte_telemetry -Ilib/librte_ring -I../lib/librte_ring -Ilib/librte_ethdev -I../lib/librte_ethdev -Ilib/librte_net -I../lib/librte_net -Ilib/librte_mbuf -I../lib/librte_mbuf -Ilib/librte_mempool -I../lib/librte_mempool -Ilib/librte_meter -I../lib/librte_meter -Ilib/librte_hash -I../lib/librte_hash -Ilib/librte_rcu -I../lib/librte_rcu -Ilib/librte_timer -I../lib/librte_timer -Ilib/librte_cryptodev -I../lib/librte_cryptodev -fdiagnostics-color=always -pipe -D_FILE_OFFSET_BITS=64 -Wall -Winvalid-pch -Werror -O2 -g -include rte_config.h -Wextra -Wcast-qual -Wdeprecated -Wformat -Wformat-nonliteral -Wformat-security -Wmissing-declarations -Wmissing-prototypes -Wnested-externs -Wold-style-definition -Wpointer-arith -Wsign-compare -Wstrict-prototypes -Wundef -Wwrite-strings -Wno-missing-field-initializers -D_GNU_SOURCE -fPIC -march=corei7 -DALLOW_EXPERIMENTAL_API -DALLOW_INTERNAL_API -Wno-format-truncation -DLINUX  -MD -MQ 'lib/lib@@rte_eventdev at sta/librte_eventdev_rte_event_eth_rx_adapter.c.o' -MF 'lib/lib@@rte_eventdev at sta/librte_eventdev_rte_event_eth_rx_adapter.c.o.d' -o 'lib/lib@@rte_eventdev at sta/librte_eventdev_rte_event_eth_rx_adapter.c.o' -c ../lib/librte_eventdev/rte_event_eth_rx_adapter.c
../lib/librte_eventdev/rte_event_eth_rx_adapter.c: In function ‘rxa_create_event_vector’:
../lib/librte_eventdev/rte_event_eth_rx_adapter.c:803:6: error: ‘struct rte_event’ has no member named ‘vec’
    ev->vec = vec->vector_ev;
      ^~
../lib/librte_eventdev/rte_event_eth_rx_adapter.c:832:5: error: ‘struct rte_event’ has no member named ‘vec’
   ev->vec = vec->vector_ev;
     ^~
../lib/librte_eventdev/rte_event_eth_rx_adapter.c: In function ‘rxa_vector_expire’:
../lib/librte_eventdev/rte_event_eth_rx_adapter.c:1246:4: error: ‘struct rte_event’ has no member named ‘vec’
  ev->vec = vec->vector_ev;
    ^~
[274/3172] Compiling C object 'lib/lib@@rte_eventdev at sta/librte_eventdev_rte_eventdev.c.o'.
[275/3172] Compiling C object 'lib/lib@@rte_eventdev at sta/librte_eventdev_rte_event_timer_adapter.c.o'.
ninja: build stopped: subcommand failed.
##[error]Process completed with exit code 1.
####################################################################################
#### [End job log] ubuntu-18.04-gcc-static at step "Build and test"
####################################################################################




####################################################################################
#### [Begin job log] ubuntu-18.04-gcc-shared-abi+doc+tests at step "Build and test"
####################################################################################
[276/3388] Generating efd.sym_chk with a meson_exe.py custom command.
[277/3388] Linking target lib/librte_efd.so.21.2.
[278/3388] Compiling C object 'lib/lib@@rte_eventdev at sta/librte_eventdev_rte_event_ring.c.o'.
[279/3388] Generating rte_eventdev_mingw with a custom command.
[280/3388] Generating symbol file 'lib/lib@@rte_efd at sha/librte_efd.so.21.2.symbols'.
[281/3388] Compiling C object 'lib/lib@@rte_eventdev at sta/librte_eventdev_eventdev_trace_points.c.o'.
[282/3388] Compiling C object 'lib/lib@@rte_eventdev at sta/librte_eventdev_rte_eventdev.c.o'.
[283/3388] Compiling C object 'lib/lib@@rte_eventdev at sta/librte_eventdev_rte_event_eth_rx_adapter.c.o'.
FAILED: lib/lib@@rte_eventdev at sta/librte_eventdev_rte_event_eth_rx_adapter.c.o 
ccache gcc -Ilib/lib@@rte_eventdev at sta -Ilib -I../lib -Ilib/librte_eventdev -I../lib/librte_eventdev -I. -I../ -Iconfig -I../config -Ilib/librte_eal/include -I../lib/librte_eal/include -Ilib/librte_eal/linux/include -I../lib/librte_eal/linux/include -Ilib/librte_eal/x86/include -I../lib/librte_eal/x86/include -Ilib/librte_eal/common -I../lib/librte_eal/common -Ilib/librte_eal -I../lib/librte_eal -Ilib/librte_kvargs -I../lib/librte_kvargs -Ilib/librte_telemetry/../librte_metrics -I../lib/librte_telemetry/../librte_metrics -Ilib/librte_telemetry -I../lib/librte_telemetry -Ilib/librte_ring -I../lib/librte_ring -Ilib/librte_ethdev -I../lib/librte_ethdev -Ilib/librte_net -I../lib/librte_net -Ilib/librte_mbuf -I../lib/librte_mbuf -Ilib/librte_mempool -I../lib/librte_mempool -Ilib/librte_meter -I../lib/librte_meter -Ilib/librte_hash -I../lib/librte_hash -Ilib/librte_rcu -I../lib/librte_rcu -Ilib/librte_timer -I../lib/librte_timer -Ilib/librte_cryptodev -I../lib/librte_cryptodev -fdiagnostics-color=always -pipe -D_FILE_OFFSET_BITS=64 -Wall -Winvalid-pch -Werror -O2 -g -include rte_config.h -Wextra -Wcast-qual -Wdeprecated -Wformat -Wformat-nonliteral -Wformat-security -Wmissing-declarations -Wmissing-prototypes -Wnested-externs -Wold-style-definition -Wpointer-arith -Wsign-compare -Wstrict-prototypes -Wundef -Wwrite-strings -Wno-missing-field-initializers -D_GNU_SOURCE -fPIC -march=corei7 -DALLOW_EXPERIMENTAL_API -DALLOW_INTERNAL_API -Wno-format-truncation -DLINUX  -MD -MQ 'lib/lib@@rte_eventdev at sta/librte_eventdev_rte_event_eth_rx_adapter.c.o' -MF 'lib/lib@@rte_eventdev at sta/librte_eventdev_rte_event_eth_rx_adapter.c.o.d' -o 'lib/lib@@rte_eventdev at sta/librte_eventdev_rte_event_eth_rx_adapter.c.o' -c ../lib/librte_eventdev/rte_event_eth_rx_adapter.c
../lib/librte_eventdev/rte_event_eth_rx_adapter.c: In function ‘rxa_create_event_vector’:
../lib/librte_eventdev/rte_event_eth_rx_adapter.c:803:6: error: ‘struct rte_event’ has no member named ‘vec’
    ev->vec = vec->vector_ev;
      ^~
../lib/librte_eventdev/rte_event_eth_rx_adapter.c:832:5: error: ‘struct rte_event’ has no member named ‘vec’
   ev->vec = vec->vector_ev;
     ^~
../lib/librte_eventdev/rte_event_eth_rx_adapter.c: In function ‘rxa_vector_expire’:
../lib/librte_eventdev/rte_event_eth_rx_adapter.c:1246:4: error: ‘struct rte_event’ has no member named ‘vec’
  ev->vec = vec->vector_ev;
    ^~
[284/3388] Compiling C object 'lib/lib@@rte_eventdev at sta/librte_eventdev_rte_event_crypto_adapter.c.o'.
[285/3388] Compiling C object 'lib/lib@@rte_eventdev at sta/librte_eventdev_rte_event_timer_adapter.c.o'.
ninja: build stopped: subcommand failed.
##[error]Process completed with exit code 1.
####################################################################################
#### [End job log] ubuntu-18.04-gcc-shared-abi+doc+tests at step "Build and test"
####################################################################################




####################################################################################
#### [Begin job log] ubuntu-18.04-clang-static at step "Build and test"
####################################################################################
[270/3174] Generating rte_efd_mingw with a custom command.
[271/3174] Generating symbol file 'lib/lib@@rte_cryptodev at sha/librte_cryptodev.so.21.2.symbols'.
[272/3174] Generating efd.sym_chk with a meson_exe.py custom command.
[273/3174] Linking target lib/librte_efd.so.21.2.
[274/3174] Generating rte_eventdev_mingw with a custom command.
[275/3174] Compiling C object 'lib/lib@@rte_eventdev at sta/librte_eventdev_rte_event_ring.c.o'.
[276/3174] Compiling C object 'lib/lib@@rte_eventdev at sta/librte_eventdev_eventdev_trace_points.c.o'.
[277/3174] Compiling C object 'lib/lib@@rte_eventdev at sta/librte_eventdev_rte_eventdev.c.o'.
[278/3174] Compiling C object 'lib/lib@@rte_eventdev at sta/librte_eventdev_rte_event_eth_rx_adapter.c.o'.
FAILED: lib/lib@@rte_eventdev at sta/librte_eventdev_rte_event_eth_rx_adapter.c.o 
ccache clang -Ilib/lib@@rte_eventdev at sta -Ilib -I../lib -Ilib/librte_eventdev -I../lib/librte_eventdev -I. -I../ -Iconfig -I../config -Ilib/librte_eal/include -I../lib/librte_eal/include -Ilib/librte_eal/linux/include -I../lib/librte_eal/linux/include -Ilib/librte_eal/x86/include -I../lib/librte_eal/x86/include -Ilib/librte_eal/common -I../lib/librte_eal/common -Ilib/librte_eal -I../lib/librte_eal -Ilib/librte_kvargs -I../lib/librte_kvargs -Ilib/librte_telemetry/../librte_metrics -I../lib/librte_telemetry/../librte_metrics -Ilib/librte_telemetry -I../lib/librte_telemetry -Ilib/librte_ring -I../lib/librte_ring -Ilib/librte_ethdev -I../lib/librte_ethdev -Ilib/librte_net -I../lib/librte_net -Ilib/librte_mbuf -I../lib/librte_mbuf -Ilib/librte_mempool -I../lib/librte_mempool -Ilib/librte_meter -I../lib/librte_meter -Ilib/librte_hash -I../lib/librte_hash -Ilib/librte_rcu -I../lib/librte_rcu -Ilib/librte_timer -I../lib/librte_timer -Ilib/librte_cryptodev -I../lib/librte_cryptodev -Xclang -fcolor-diagnostics -pipe -D_FILE_OFFSET_BITS=64 -Wall -Winvalid-pch -Werror -O2 -g -include rte_config.h -Wextra -Wcast-qual -Wdeprecated -Wformat -Wformat-nonliteral -Wformat-security -Wmissing-declarations -Wmissing-prototypes -Wnested-externs -Wold-style-definition -Wpointer-arith -Wsign-compare -Wstrict-prototypes -Wundef -Wwrite-strings -Wno-address-of-packed-member -Wno-missing-field-initializers -D_GNU_SOURCE -fPIC -march=corei7 -DALLOW_EXPERIMENTAL_API -DALLOW_INTERNAL_API -DLINUX  -MD -MQ 'lib/lib@@rte_eventdev at sta/librte_eventdev_rte_event_eth_rx_adapter.c.o' -MF 'lib/lib@@rte_eventdev at sta/librte_eventdev_rte_event_eth_rx_adapter.c.o.d' -o 'lib/lib@@rte_eventdev at sta/librte_eventdev_rte_event_eth_rx_adapter.c.o' -c ../lib/librte_eventdev/rte_event_eth_rx_adapter.c
../lib/librte_eventdev/rte_event_eth_rx_adapter.c:803:8: error: no member named 'vec' in 'struct rte_event'
                        ev->vec = vec->vector_ev;
                        ~~  ^
../lib/librte_eventdev/rte_event_eth_rx_adapter.c:832:7: error: no member named 'vec' in 'struct rte_event'
                ev->vec = vec->vector_ev;
                ~~  ^
../lib/librte_eventdev/rte_event_eth_rx_adapter.c:1246:6: error: no member named 'vec' in 'struct rte_event'
        ev->vec = vec->vector_ev;
        ~~  ^
3 errors generated.
[279/3174] Compiling C object 'lib/lib@@rte_eventdev at sta/librte_eventdev_rte_event_crypto_adapter.c.o'.
[280/3174] Compiling C object 'lib/lib@@rte_eventdev at sta/librte_eventdev_rte_event_timer_adapter.c.o'.
ninja: build stopped: subcommand failed.
##[error]Process completed with exit code 1.
####################################################################################
#### [End job log] ubuntu-18.04-clang-static at step "Build and test"
####################################################################################




####################################################################################
#### [Begin job log] ubuntu-18.04-clang-shared-doc+tests at step "Build and test"
####################################################################################
[274/3390] Generating symbol file 'lib/lib@@rte_cryptodev at sha/librte_cryptodev.so.21.2.symbols'.
[275/3390] Generating efd.sym_chk with a meson_exe.py custom command.
[276/3390] Linking target lib/librte_efd.so.21.2.
[277/3390] Compiling C object 'lib/lib@@rte_eventdev at sta/librte_eventdev_rte_event_ring.c.o'.
[278/3390] Generating rte_eventdev_mingw with a custom command.
[279/3390] Generating symbol file 'lib/lib@@rte_efd at sha/librte_efd.so.21.2.symbols'.
[280/3390] Compiling C object 'lib/lib@@rte_eventdev at sta/librte_eventdev_eventdev_trace_points.c.o'.
[281/3390] Compiling C object 'lib/lib@@rte_eventdev at sta/librte_eventdev_rte_eventdev.c.o'.
[282/3390] Compiling C object 'lib/lib@@rte_eventdev at sta/librte_eventdev_rte_event_eth_rx_adapter.c.o'.
FAILED: lib/lib@@rte_eventdev at sta/librte_eventdev_rte_event_eth_rx_adapter.c.o 
ccache clang -Ilib/lib@@rte_eventdev at sta -Ilib -I../lib -Ilib/librte_eventdev -I../lib/librte_eventdev -I. -I../ -Iconfig -I../config -Ilib/librte_eal/include -I../lib/librte_eal/include -Ilib/librte_eal/linux/include -I../lib/librte_eal/linux/include -Ilib/librte_eal/x86/include -I../lib/librte_eal/x86/include -Ilib/librte_eal/common -I../lib/librte_eal/common -Ilib/librte_eal -I../lib/librte_eal -Ilib/librte_kvargs -I../lib/librte_kvargs -Ilib/librte_telemetry/../librte_metrics -I../lib/librte_telemetry/../librte_metrics -Ilib/librte_telemetry -I../lib/librte_telemetry -Ilib/librte_ring -I../lib/librte_ring -Ilib/librte_ethdev -I../lib/librte_ethdev -Ilib/librte_net -I../lib/librte_net -Ilib/librte_mbuf -I../lib/librte_mbuf -Ilib/librte_mempool -I../lib/librte_mempool -Ilib/librte_meter -I../lib/librte_meter -Ilib/librte_hash -I../lib/librte_hash -Ilib/librte_rcu -I../lib/librte_rcu -Ilib/librte_timer -I../lib/librte_timer -Ilib/librte_cryptodev -I../lib/librte_cryptodev -Xclang -fcolor-diagnostics -pipe -D_FILE_OFFSET_BITS=64 -Wall -Winvalid-pch -Werror -O2 -g -include rte_config.h -Wextra -Wcast-qual -Wdeprecated -Wformat -Wformat-nonliteral -Wformat-security -Wmissing-declarations -Wmissing-prototypes -Wnested-externs -Wold-style-definition -Wpointer-arith -Wsign-compare -Wstrict-prototypes -Wundef -Wwrite-strings -Wno-address-of-packed-member -Wno-missing-field-initializers -D_GNU_SOURCE -fPIC -march=corei7 -DALLOW_EXPERIMENTAL_API -DALLOW_INTERNAL_API -DLINUX  -MD -MQ 'lib/lib@@rte_eventdev at sta/librte_eventdev_rte_event_eth_rx_adapter.c.o' -MF 'lib/lib@@rte_eventdev at sta/librte_eventdev_rte_event_eth_rx_adapter.c.o.d' -o 'lib/lib@@rte_eventdev at sta/librte_eventdev_rte_event_eth_rx_adapter.c.o' -c ../lib/librte_eventdev/rte_event_eth_rx_adapter.c
../lib/librte_eventdev/rte_event_eth_rx_adapter.c:803:8: error: no member named 'vec' in 'struct rte_event'
                        ev->vec = vec->vector_ev;
                        ~~  ^
../lib/librte_eventdev/rte_event_eth_rx_adapter.c:832:7: error: no member named 'vec' in 'struct rte_event'
                ev->vec = vec->vector_ev;
                ~~  ^
../lib/librte_eventdev/rte_event_eth_rx_adapter.c:1246:6: error: no member named 'vec' in 'struct rte_event'
        ev->vec = vec->vector_ev;
        ~~  ^
3 errors generated.
[283/3390] Compiling C object 'lib/lib@@rte_eventdev at sta/librte_eventdev_rte_event_crypto_adapter.c.o'.
[284/3390] Compiling C object 'lib/lib@@rte_eventdev at sta/librte_eventdev_rte_event_timer_adapter.c.o'.
ninja: build stopped: subcommand failed.
##[error]Process completed with exit code 1.
####################################################################################
#### [End job log] ubuntu-18.04-clang-shared-doc+tests at step "Build and test"
####################################################################################




####################################################################################
#### [Begin job log] ubuntu-18.04-gcc-static-i386 at step "Build and test"
####################################################################################
[266/2578] Linking target lib/librte_efd.so.21.2.
[267/2578] Generating rte_eventdev_def with a custom command.
[268/2578] Generating symbol file 'lib/lib@@rte_cryptodev at sha/librte_cryptodev.so.21.2.symbols'.
[269/2578] Generating rte_eventdev_mingw with a custom command.
[270/2578] Compiling C object 'lib/lib@@rte_eventdev at sta/librte_eventdev_rte_event_ring.c.o'.
[271/2578] Compiling C object 'lib/lib@@rte_eventdev at sta/librte_eventdev_eventdev_trace_points.c.o'.
[272/2578] Compiling C object 'lib/lib@@rte_eventdev at sta/librte_eventdev_rte_eventdev.c.o'.
[273/2578] Compiling C object 'lib/lib@@rte_eventdev at sta/librte_eventdev_rte_event_eth_rx_adapter.c.o'.
FAILED: lib/lib@@rte_eventdev at sta/librte_eventdev_rte_event_eth_rx_adapter.c.o 
ccache gcc -Ilib/lib@@rte_eventdev at sta -Ilib -I../lib -Ilib/librte_eventdev -I../lib/librte_eventdev -I. -I../ -Iconfig -I../config -Ilib/librte_eal/include -I../lib/librte_eal/include -Ilib/librte_eal/linux/include -I../lib/librte_eal/linux/include -Ilib/librte_eal/x86/include -I../lib/librte_eal/x86/include -Ilib/librte_eal/common -I../lib/librte_eal/common -Ilib/librte_eal -I../lib/librte_eal -Ilib/librte_kvargs -I../lib/librte_kvargs -Ilib/librte_telemetry/../librte_metrics -I../lib/librte_telemetry/../librte_metrics -Ilib/librte_telemetry -I../lib/librte_telemetry -Ilib/librte_ring -I../lib/librte_ring -Ilib/librte_ethdev -I../lib/librte_ethdev -Ilib/librte_net -I../lib/librte_net -Ilib/librte_mbuf -I../lib/librte_mbuf -Ilib/librte_mempool -I../lib/librte_mempool -Ilib/librte_meter -I../lib/librte_meter -Ilib/librte_hash -I../lib/librte_hash -Ilib/librte_rcu -I../lib/librte_rcu -Ilib/librte_timer -I../lib/librte_timer -Ilib/librte_cryptodev -I../lib/librte_cryptodev -fdiagnostics-color=always -pipe -D_FILE_OFFSET_BITS=64 -Wall -Winvalid-pch -Werror -O2 -g -include rte_config.h -Wextra -Wcast-qual -Wdeprecated -Wformat -Wformat-nonliteral -Wformat-security -Wmissing-declarations -Wmissing-prototypes -Wnested-externs -Wold-style-definition -Wpointer-arith -Wsign-compare -Wstrict-prototypes -Wundef -Wwrite-strings -Wno-missing-field-initializers -Wno-pointer-to-int-cast -D_GNU_SOURCE -m32 -fPIC -march=corei7 -DALLOW_EXPERIMENTAL_API -DALLOW_INTERNAL_API -Wno-format-truncation -DLINUX  -MD -MQ 'lib/lib@@rte_eventdev at sta/librte_eventdev_rte_event_eth_rx_adapter.c.o' -MF 'lib/lib@@rte_eventdev at sta/librte_eventdev_rte_event_eth_rx_adapter.c.o.d' -o 'lib/lib@@rte_eventdev at sta/librte_eventdev_rte_event_eth_rx_adapter.c.o' -c ../lib/librte_eventdev/rte_event_eth_rx_adapter.c
../lib/librte_eventdev/rte_event_eth_rx_adapter.c: In function ‘rxa_create_event_vector’:
../lib/librte_eventdev/rte_event_eth_rx_adapter.c:803:6: error: ‘struct rte_event’ has no member named ‘vec’
    ev->vec = vec->vector_ev;
      ^~
../lib/librte_eventdev/rte_event_eth_rx_adapter.c:832:5: error: ‘struct rte_event’ has no member named ‘vec’
   ev->vec = vec->vector_ev;
     ^~
../lib/librte_eventdev/rte_event_eth_rx_adapter.c: In function ‘rxa_vector_expire’:
../lib/librte_eventdev/rte_event_eth_rx_adapter.c:1246:4: error: ‘struct rte_event’ has no member named ‘vec’
  ev->vec = vec->vector_ev;
    ^~
[274/2578] Compiling C object 'lib/lib@@rte_eventdev at sta/librte_eventdev_rte_event_timer_adapter.c.o'.
[275/2578] Compiling C object 'lib/lib@@rte_eventdev at sta/librte_eventdev_rte_event_crypto_adapter.c.o'.
ninja: build stopped: subcommand failed.
##[error]Process completed with exit code 1.
####################################################################################
#### [End job log] ubuntu-18.04-gcc-static-i386 at step "Build and test"
####################################################################################




####################################################################################
#### [Begin job log] ubuntu-18.04-gcc-static-aarch64 at step "Build and test"
####################################################################################
[269/3172] Generating symbol file 'lib/lib@@rte_cryptodev at sha/librte_cryptodev.so.21.2.symbols'.
[270/3172] Generating efd.sym_chk with a meson_exe.py custom command.
[271/3172] Linking target lib/librte_efd.so.21.2.
[272/3172] Generating rte_eventdev_mingw with a custom command.
[273/3172] Compiling C object 'lib/lib@@rte_eventdev at sta/librte_eventdev_rte_event_ring.c.o'.
[274/3172] Compiling C object 'lib/lib@@rte_eventdev at sta/librte_eventdev_eventdev_trace_points.c.o'.
[275/3172] Compiling C object 'lib/lib@@rte_eventdev at sta/librte_eventdev_rte_eventdev.c.o'.
[276/3172] Compiling C object 'lib/lib@@rte_eventdev at sta/librte_eventdev_rte_event_eth_rx_adapter.c.o'.
FAILED: lib/lib@@rte_eventdev at sta/librte_eventdev_rte_event_eth_rx_adapter.c.o 
ccache gcc -Ilib/lib@@rte_eventdev at sta -Ilib -I../lib -Ilib/librte_eventdev -I../lib/librte_eventdev -I. -I../ -Iconfig -I../config -Ilib/librte_eal/include -I../lib/librte_eal/include -Ilib/librte_eal/linux/include -I../lib/librte_eal/linux/include -Ilib/librte_eal/x86/include -I../lib/librte_eal/x86/include -Ilib/librte_eal/common -I../lib/librte_eal/common -Ilib/librte_eal -I../lib/librte_eal -Ilib/librte_kvargs -I../lib/librte_kvargs -Ilib/librte_telemetry/../librte_metrics -I../lib/librte_telemetry/../librte_metrics -Ilib/librte_telemetry -I../lib/librte_telemetry -Ilib/librte_ring -I../lib/librte_ring -Ilib/librte_ethdev -I../lib/librte_ethdev -Ilib/librte_net -I../lib/librte_net -Ilib/librte_mbuf -I../lib/librte_mbuf -Ilib/librte_mempool -I../lib/librte_mempool -Ilib/librte_meter -I../lib/librte_meter -Ilib/librte_hash -I../lib/librte_hash -Ilib/librte_rcu -I../lib/librte_rcu -Ilib/librte_timer -I../lib/librte_timer -Ilib/librte_cryptodev -I../lib/librte_cryptodev -fdiagnostics-color=always -pipe -D_FILE_OFFSET_BITS=64 -Wall -Winvalid-pch -Werror -O2 -g -include rte_config.h -Wextra -Wcast-qual -Wdeprecated -Wformat -Wformat-nonliteral -Wformat-security -Wmissing-declarations -Wmissing-prototypes -Wnested-externs -Wold-style-definition -Wpointer-arith -Wsign-compare -Wstrict-prototypes -Wundef -Wwrite-strings -Wno-missing-field-initializers -D_GNU_SOURCE -fPIC -march=corei7 -DALLOW_EXPERIMENTAL_API -DALLOW_INTERNAL_API -Wno-format-truncation -DLINUX  -MD -MQ 'lib/lib@@rte_eventdev at sta/librte_eventdev_rte_event_eth_rx_adapter.c.o' -MF 'lib/lib@@rte_eventdev at sta/librte_eventdev_rte_event_eth_rx_adapter.c.o.d' -o 'lib/lib@@rte_eventdev at sta/librte_eventdev_rte_event_eth_rx_adapter.c.o' -c ../lib/librte_eventdev/rte_event_eth_rx_adapter.c
../lib/librte_eventdev/rte_event_eth_rx_adapter.c: In function ‘rxa_create_event_vector’:
../lib/librte_eventdev/rte_event_eth_rx_adapter.c:803:6: error: ‘struct rte_event’ has no member named ‘vec’
    ev->vec = vec->vector_ev;
      ^~
../lib/librte_eventdev/rte_event_eth_rx_adapter.c:832:5: error: ‘struct rte_event’ has no member named ‘vec’
   ev->vec = vec->vector_ev;
     ^~
../lib/librte_eventdev/rte_event_eth_rx_adapter.c: In function ‘rxa_vector_expire’:
../lib/librte_eventdev/rte_event_eth_rx_adapter.c:1246:4: error: ‘struct rte_event’ has no member named ‘vec’
  ev->vec = vec->vector_ev;
    ^~
[277/3172] Compiling C object 'lib/lib@@rte_eventdev at sta/librte_eventdev_rte_event_timer_adapter.c.o'.
[278/3172] Compiling C object 'lib/lib@@rte_eventdev at sta/librte_eventdev_rte_event_crypto_adapter.c.o'.
ninja: build stopped: subcommand failed.
##[error]Process completed with exit code 1.
####################################################################################
#### [End job log] ubuntu-18.04-gcc-static-aarch64 at step "Build and test"
####################################################################################




####################################################################################
#### [Begin job log] ubuntu-18.04-gcc-shared-aarch64 at step "Build and test"
####################################################################################
[272/3385] Generating efd.sym_chk with a meson_exe.py custom command.
[273/3385] Linking target lib/librte_efd.so.21.2.
[274/3385] Compiling C object 'lib/lib@@rte_eventdev at sta/librte_eventdev_rte_event_ring.c.o'.
[275/3385] Generating rte_eventdev_mingw with a custom command.
[276/3385] Generating symbol file 'lib/lib@@rte_efd at sha/librte_efd.so.21.2.symbols'.
[277/3385] Compiling C object 'lib/lib@@rte_eventdev at sta/librte_eventdev_eventdev_trace_points.c.o'.
[278/3385] Compiling C object 'lib/lib@@rte_eventdev at sta/librte_eventdev_rte_eventdev.c.o'.
[279/3385] Compiling C object 'lib/lib@@rte_eventdev at sta/librte_eventdev_rte_event_eth_rx_adapter.c.o'.
FAILED: lib/lib@@rte_eventdev at sta/librte_eventdev_rte_event_eth_rx_adapter.c.o 
ccache gcc -Ilib/lib@@rte_eventdev at sta -Ilib -I../lib -Ilib/librte_eventdev -I../lib/librte_eventdev -I. -I../ -Iconfig -I../config -Ilib/librte_eal/include -I../lib/librte_eal/include -Ilib/librte_eal/linux/include -I../lib/librte_eal/linux/include -Ilib/librte_eal/x86/include -I../lib/librte_eal/x86/include -Ilib/librte_eal/common -I../lib/librte_eal/common -Ilib/librte_eal -I../lib/librte_eal -Ilib/librte_kvargs -I../lib/librte_kvargs -Ilib/librte_telemetry/../librte_metrics -I../lib/librte_telemetry/../librte_metrics -Ilib/librte_telemetry -I../lib/librte_telemetry -Ilib/librte_ring -I../lib/librte_ring -Ilib/librte_ethdev -I../lib/librte_ethdev -Ilib/librte_net -I../lib/librte_net -Ilib/librte_mbuf -I../lib/librte_mbuf -Ilib/librte_mempool -I../lib/librte_mempool -Ilib/librte_meter -I../lib/librte_meter -Ilib/librte_hash -I../lib/librte_hash -Ilib/librte_rcu -I../lib/librte_rcu -Ilib/librte_timer -I../lib/librte_timer -Ilib/librte_cryptodev -I../lib/librte_cryptodev -fdiagnostics-color=always -pipe -D_FILE_OFFSET_BITS=64 -Wall -Winvalid-pch -Werror -O2 -g -include rte_config.h -Wextra -Wcast-qual -Wdeprecated -Wformat -Wformat-nonliteral -Wformat-security -Wmissing-declarations -Wmissing-prototypes -Wnested-externs -Wold-style-definition -Wpointer-arith -Wsign-compare -Wstrict-prototypes -Wundef -Wwrite-strings -Wno-missing-field-initializers -D_GNU_SOURCE -fPIC -march=corei7 -DALLOW_EXPERIMENTAL_API -DALLOW_INTERNAL_API -Wno-format-truncation -DLINUX  -MD -MQ 'lib/lib@@rte_eventdev at sta/librte_eventdev_rte_event_eth_rx_adapter.c.o' -MF 'lib/lib@@rte_eventdev at sta/librte_eventdev_rte_event_eth_rx_adapter.c.o.d' -o 'lib/lib@@rte_eventdev at sta/librte_eventdev_rte_event_eth_rx_adapter.c.o' -c ../lib/librte_eventdev/rte_event_eth_rx_adapter.c
../lib/librte_eventdev/rte_event_eth_rx_adapter.c: In function ‘rxa_create_event_vector’:
../lib/librte_eventdev/rte_event_eth_rx_adapter.c:803:6: error: ‘struct rte_event’ has no member named ‘vec’
    ev->vec = vec->vector_ev;
      ^~
../lib/librte_eventdev/rte_event_eth_rx_adapter.c:832:5: error: ‘struct rte_event’ has no member named ‘vec’
   ev->vec = vec->vector_ev;
     ^~
../lib/librte_eventdev/rte_event_eth_rx_adapter.c: In function ‘rxa_vector_expire’:
../lib/librte_eventdev/rte_event_eth_rx_adapter.c:1246:4: error: ‘struct rte_event’ has no member named ‘vec’
  ev->vec = vec->vector_ev;
    ^~
[280/3385] Compiling C object 'lib/lib@@rte_eventdev at sta/librte_eventdev_rte_event_crypto_adapter.c.o'.
[281/3385] Compiling C object 'lib/lib@@rte_eventdev at sta/librte_eventdev_rte_event_timer_adapter.c.o'.
ninja: build stopped: subcommand failed.
##[error]Process completed with exit code 1.
####################################################################################
#### [End job log] ubuntu-18.04-gcc-shared-aarch64 at step "Build and test"
####################################################################################
--------------------------------END LOGS-----------------------------


More information about the test-report mailing list