[dpdk-test-report] |FAILURE| pw93207 [dpdk-dev] [PATCH v4] app/testpmd: add CLI for action meter color

0-day Robot robot at bytheb.org
Wed May 12 13:59:02 CEST 2021


From: robot at bytheb.org

Test-Label: github-robot
Test-Status: FAILURE
http://patchwork.dpdk.org/patch/93207/

_github build: failed_
Build URL: https://github.com/ovsrobot/dpdk/actions/runs/835216359
Build Logs:
-----------------------Summary of failed steps-----------------------
ubuntu-18.04-gcc-shared-abi+doc+tests failed at step "Build and test"
ubuntu-18.04-clang-shared-doc+tests failed at step "Build and test"
----------------------End summary of failed steps--------------------

-------------------------------BEGIN LOGS----------------------------
####################################################################################
#### [Begin job log] ubuntu-18.04-gcc-shared-abi+doc+tests at step "Build and test"
####################################################################################
[2725/3307] Compiling C object 'examples/c590b3c@@dpdk-ipsec-secgw at exe/ipsec-secgw_rt.c.o'.
[2726/3307] Compiling C object 'examples/c590b3c@@dpdk-ipsec-secgw at exe/ipsec-secgw_parser.c.o'.
[2727/3307] Compiling C object 'examples/c590b3c@@dpdk-ipsec-secgw at exe/ipsec-secgw_sad.c.o'.
[2728/3307] Compiling C object 'examples/c590b3c@@dpdk-ipsec-secgw at exe/ipsec-secgw_sp4.c.o'.
[2729/3307] Compiling C object 'examples/c590b3c@@dpdk-ipsec-secgw at exe/ipsec-secgw_sa.c.o'.
[2730/3307] Compiling C object 'examples/c590b3c@@dpdk-l2fwd at exe/l2fwd_main.c.o'.
[2731/3307] Compiling C object 'examples/c590b3c@@dpdk-l2fwd-event at exe/l2fwd-event_l2fwd_common.c.o'.
[2732/3307] Linking target examples/dpdk-kni.
[2733/3307] Compiling C object 'examples/c590b3c@@dpdk-ipsec-secgw at exe/ipsec-secgw_sp6.c.o'.
[2734/3307] Linking target examples/dpdk-ipsec-secgw.
[2735/3307] Linking target examples/dpdk-l2fwd.
[2736/3307] Compiling C object 'examples/c590b3c@@dpdk-l2fwd-event at exe/l2fwd-event_main.c.o'.
[2737/3307] Compiling C object 'examples/c590b3c@@dpdk-l2fwd-event at exe/l2fwd-event_l2fwd_event.c.o'.
[2738/3307] Compiling C object 'examples/c590b3c@@dpdk-l2fwd-event at exe/l2fwd-event_l2fwd_event_generic.c.o'.
[2739/3307] Compiling C object 'examples/c590b3c@@dpdk-l2fwd-event at exe/l2fwd-event_l2fwd_event_internal_port.c.o'.
[2740/3307] Generating html_guides with a custom command.
FAILED: doc/guides/html 
/usr/bin/python3 ../buildtools/call-sphinx-build.py /usr/bin/sphinx-build 21.05.0-rc2 /home/runner/work/dpdk/dpdk/doc/guides /home/runner/work/dpdk/dpdk/build/doc/guides -W

Warning, treated as error:
/home/runner/work/dpdk/dpdk/doc/guides/testpmd_app_ug/testpmd_funcs.rst:5032:Unexpected indentation.
[2741/3307] Compiling C object 'examples/c590b3c@@dpdk-l2fwd-crypto at exe/l2fwd-crypto_main.c.o'.
[2742/3307] Compiling C object 'examples/c590b3c@@dpdk-l2fwd-event at exe/l2fwd-event_l2fwd_poll.c.o'.
ninja: build stopped: subcommand failed.
##[error]Process completed with exit code 1.
####################################################################################
#### [End job log] ubuntu-18.04-gcc-shared-abi+doc+tests at step "Build and test"
####################################################################################




####################################################################################
#### [Begin job log] ubuntu-18.04-clang-shared-doc+tests at step "Build and test"
####################################################################################
[2735/3309] Compiling C object 'examples/c590b3c@@dpdk-ipsec-secgw at exe/ipsec-secgw_sad.c.o'.
[2736/3309] Compiling C object 'examples/c590b3c@@dpdk-l2fwd-event at exe/l2fwd-event_l2fwd_common.c.o'.
[2737/3309] Linking target examples/dpdk-ipv4_multicast.
[2738/3309] Linking target examples/dpdk-ipsec-secgw.
[2739/3309] Linking target examples/dpdk-l2fwd.
[2740/3309] Compiling C object 'examples/c590b3c@@dpdk-l2fwd-event at exe/l2fwd-event_l2fwd_event.c.o'.
[2741/3309] Compiling C object 'examples/c590b3c@@dpdk-l2fwd-event at exe/l2fwd-event_main.c.o'.
[2742/3309] Compiling C object 'examples/c590b3c@@dpdk-l2fwd-keepalive at exe/l2fwd-keepalive_main.c.o'.
[2743/3309] Compiling C object 'examples/c590b3c@@dpdk-l2fwd-crypto at exe/l2fwd-crypto_main.c.o'.
[2744/3309] Linking target examples/dpdk-l2fwd-crypto.
[2745/3309] Compiling C object 'examples/c590b3c@@dpdk-l2fwd-event at exe/l2fwd-event_l2fwd_event_generic.c.o'.
[2746/3309] Compiling C object 'examples/c590b3c@@dpdk-l2fwd-event at exe/l2fwd-event_l2fwd_event_internal_port.c.o'.
[2747/3309] Compiling C object 'examples/c590b3c@@dpdk-l2fwd-event at exe/l2fwd-event_l2fwd_poll.c.o'.
[2748/3309] Compiling C object 'examples/c590b3c@@dpdk-l2fwd-keepalive at exe/l2fwd-keepalive_shm.c.o'.
[2749/3309] Linking target examples/dpdk-l2fwd-event.
[2750/3309] Generating html_guides with a custom command.
FAILED: doc/guides/html 
/usr/bin/python3 ../buildtools/call-sphinx-build.py /usr/bin/sphinx-build 21.05.0-rc2 /home/runner/work/dpdk/dpdk/doc/guides /home/runner/work/dpdk/dpdk/build/doc/guides -W

Warning, treated as error:
/home/runner/work/dpdk/dpdk/doc/guides/testpmd_app_ug/testpmd_funcs.rst:5032:Unexpected indentation.
[2751/3309] Compiling C object 'examples/c590b3c@@dpdk-l3fwd at exe/l3fwd_l3fwd_event.c.o'.
[2752/3309] Compiling C object 'examples/c590b3c@@dpdk-l2fwd-jobstats at exe/l2fwd-jobstats_main.c.o'.
ninja: build stopped: subcommand failed.
##[error]Process completed with exit code 1.
####################################################################################
#### [End job log] ubuntu-18.04-clang-shared-doc+tests at step "Build and test"
####################################################################################
--------------------------------END LOGS-----------------------------


More information about the test-report mailing list