[dpdk-test-report] [dts-test-report] |FAILURE| pw(98076-98078) sid(18702) job(DTS_AUTO579) [V1, 3/3] conf/test_case_checklist: add and modify not support NIC of test cases

sys_stv at intel.com sys_stv at intel.com
Mon Sep 6 16:03:09 CEST 2021


Test-Label: Intel-dts-test
Test-Status: FAILURE
http://dpdk.org/patch/98078
Subject: [V1,3/3] conf/test_case_checklist: add and modify not support NIC of test cases

_Testing issues_

Diff:
	test_plans/generic_flow_api_test_plan.rst
	conf/test_case_checklist.json
	tests/TestSuite_generic_flow_api.py

DPDK:
	commit b344eb5d941a7522ff27b6b7b5419f68c3fea9a0
	Author: Xueming Li <xuemingl at nvidia.com>
	Date:   Tue Apr 13 03:14:12 2021 +0000
	Comment: devargs: parse global device syntax

DTS:
	commit d0f6a0f435e6a854e7ed45f729f838384ac3b4f4
	Author: Owen Hilyard <ohilyard at iol.unh.edu>
	Date:   Mon Aug 23 15:02:09 2021 -0400
	Comment: framework/flow: Update rteflow for new scapy versions


Test environment and result as below:
+------------------+----------+--------------------------------+---------------------------------+
| suits            | category | UB2004-64+216_fortville_spirit | UB2004-64+216_columbiaville_25g |
+------------------+----------+--------------------------------+---------------------------------+
| generic_flow_api | NIC PF   | run                            | not run                         |
+------------------+----------+--------------------------------+---------------------------------+

Log path: /regression_dts/results/test/77e198517c674d66aeabd6f66c9d5156

#1: UB2004-64+216_fortville_spirit
	OS: Ubuntu 20.04.2 LTS
	Kernel: 5.8.0-51-generic
	CPU: Intel(R) Xeon(R) Platinum 8280M CPU @ 2.70GHz
	GCC: gcc (Ubuntu 9.3.0-17ubuntu1~20.04) 9.3.0
	Clang: 10.0.0-4ubuntu1


	Status: FAILURE
	Catogory: NIC PF
	Target: x86_64-native-linuxapp-gcc
	without_patch Total/Pass/Fail/Blocked/NA: 23/15/0/0/8
	with_patch Total/Pass/Fail/Blocked/NA: 27/16/2/0/9
	
	Detail test results:
	+---------------------------------------------------------------+-----------+---------------+
	| suit/case                                                     | with_path | without_patch |
	+---------------------------------------------------------------+-----------+---------------+
	| generic_flow_api/test_multiple_filters_10GB                   | failed    | n/a           |
	| generic_flow_api/test_jumbo_frame_size                        | failed    | n/a           |
	| generic_flow_api/test_fdir_for_L2_payload                     | passed    | passed        |
	| generic_flow_api/test_flexbytes_filter                        | n/a       | n/a           |
	| generic_flow_api/test_fdir_for_vlan                           | passed    | passed        |
	| generic_flow_api/test_tunnel_filter_nvgre                     | passed    | passed        |
	| generic_flow_api/test_128_queues                              | n/a       | n/a           |
	| generic_flow_api/test_fdir_for_mac_vlan                       | n/a       | n/a           |
	| generic_flow_api/test_tunnel_filter_vxlan                     | passed    | passed        |
	| generic_flow_api/test_fdir_L2_mac_filter_basic_for_ipv4_tcp   | passed    | passed        |
	| generic_flow_api/test_n_tuple_filter                          | n/a       | n/a           |
	| generic_flow_api/test_syn_filter                              | n/a       | n/a           |
	| generic_flow_api/test_fdir_for_ipv6                           | passed    | passed        |
	| generic_flow_api/test_fdir_for_ipv4                           | passed    | passed        |
	| generic_flow_api/test_fdir_L2_mac_filter_complex              | passed    | passed        |
	| generic_flow_api/test_create_same_rule_after_destroy          | passed    | passed        |
	| generic_flow_api/test_fdir_L2_mac_filter_basic_for_ipv4_other | passed    | passed        |
	| generic_flow_api/test_2_tuple_filter                          | n/a       | n/a           |
	| generic_flow_api/test_fdir_for_nvgre                          | n/a       | n/a           |
	| generic_flow_api/test_ethertype_filter                        | passed    | passed        |
	| generic_flow_api/test_fdir_L2_mac_filter_negative             | passed    | passed        |
	| generic_flow_api/test_fdir_for_vxlan                          | n/a       | n/a           |
	| generic_flow_api/test_L2_tunnel_filter                        | n/a       | n/a           |
	| generic_flow_api/test_fdir_L2_mac_filter_basic_for_ipv4_udp   | passed    | passed        |
	| generic_flow_api/test_create_different_rule_after_destroy     | passed    | passed        |
	| generic_flow_api/test_fdir_for_flexbytes                      | passed    | passed        |
	| generic_flow_api/test_dual_vlan                               | passed    | n/a           |
	+---------------------------------------------------------------+-----------+---------------+

DOC test failed information:
reading sources... [ 99%] vxlan_gpe_support_in_i40e_test_plan
reading sources... [100%] vxlan_test_plan

rxtx_offload_test_plan.rst:741: WARNING: Unexpected indentation.
looking for now-outdated files... none found
pickling environment... done
checking consistency... done
DPDK STV team


More information about the test-report mailing list