[dpdk-test-report] |FAILURE| pw(98856) sid(18901) job(PER_PATCH_BUILD7808)[v2] examples/ipsec-secgw: add support for event vector

sys_stv at intel.com sys_stv at intel.com
Wed Sep 15 05:34:35 CEST 2021


Test-Label: Intel-compilation
Test-Status: FAILURE
http://dpdk.org/patch/98856

_Compilation issues_

Submitter: Srujana Challa <schalla at marvell.com>
Date: 2021-09-14 13:14:24
Reply_mail: 20210914131424.1298729-1-schalla at marvell.com

DPDK git baseline: Repo:dpdk, CommitID: 1c91ed5cdde164ca319c2c3b0ba5b4643db8e614


Meson Build Summary: 22 Builds Done, 4 Successful, 18 Failures, 0 Blocked

+----------------+------------+--------------+------------+------------+-----------+----------+
| os             | gcc-static | clang-static | icc-static | gcc-shared | gcc-debug | document |
+----------------+------------+--------------+------------+------------+-----------+----------+
| UB2004-64      | fail       | fail         | fail       |            |           | pass     |
| RHEL83-64      | fail       | fail         | fail       | pass       | fail      |          |
| FC34-64        | fail       | fail         |            |            |           |          |
| UB2104-64      | fail       |              |            |            |           |          |
| WIN10-64       |            | pass         |            |            |           |          |
| UB2004-32      | fail       |              |            |            |           |          |
| CENTOS83-64    | fail       | fail         |            |            |           |          |
| FreeBSD1201-64 | fail       | fail         |            | pass       | fail      |          |
| SUSE15-64      | fail       | fail         |            |            |           |          |
+----------------+------------+--------------+------------+------------+-----------+----------+
Test environment and configuration as below:


OS: UB2004-64
	Kernel Version: 5.8.0-48-generic
	GCC Version: gcc (Ubuntu 10.2.0-5ubuntu1~20.04) 10.2.0
	Clang Version: 10.0.0-4ubuntu1
	x86_64-native-linuxapp-clang
	x86_64-native-linuxapp-gcc
	x86_64-native-linuxapp-icc
	x86_64-native-linuxapp-doc

OS: RHEL83-64
	Kernel Version: 4.18.0-305.3.1.el8.x86_64
	GCC Version: gcc (GCC) 8.4.1 20200928 (Red Hat 8.4.1-1)
	Clang Version: 11.0.0 (Red Hat 11.0.0-1.module_el8.4.0+587+5187cac0)
	x86_64-native-linuxapp-gcc
	x86_64-native-linuxapp-clang
	x86_64-native-linuxapp-gcc+shared
	x86_64-native-linuxapp-gcc+debug
	x86_64-native-linuxapp-icc

OS: FC34-64
	Kernel Version: 5.11.15-300.fc34.x86_64
	GCC Version: gcc (GCC) 11.0.1 20210324 (Red Hat 11.0.1-0)
	Clang Version: 12.0.0 (Fedora 12.0.0-0.3.rc1.fc34)
	x86_64-native-linuxapp-gcc
	x86_64-native-linuxapp-clang

OS: UB2104-64
	Kernel Version: 5.11.0-16-generic
	GCC Version: gcc (Ubuntu 10.3.0-1ubuntu1) 10.3.0
	Clang Version: 12.0.0-1ubuntu1
	x86_64-native-linuxapp-gcc

OS: WIN10-64
	Kernel Version: N/A
	GCC Version: N/A
	Clang Version: Clang 8.0.0
	x86_64-windows-clang

OS: UB2004-32
	Kernel Version: 5.8.0-48-generic
	GCC Version: gcc (Ubuntu 10.2.0-5ubuntu1~20.04) 10.2.0
	Clang Version: 10.0.0-4ubuntu1
	i686-native-linuxapp-gcc

OS: CENTOS83-64
	Kernel Version: 4.18.0-240.1.1.el8_3.x86_64
	GCC Version: gcc (GCC) 8.3.1 20191121 (Red Hat 8.3.1-5)
	Clang Version: 10.0.1 (Red Hat 10.0.1-1.module_el8.3.0+467+cb298d5b)
	x86_64-native-linuxapp-gcc
	x86_64-native-linuxapp-clang

OS: FreeBSD1201-64
	Kernel Version: 12.1-RELEASE
	GCC Version: gcc (FreeBSD Ports Collection) 9.2.0
	Clang Version: 8.0.1 (tags/RELEASE_801/final 366581) (based on LLVM 8.0.1)
	x86_64-native-bsdapp-gcc
	x86_64-native-bsdapp-clang
	x86_64-native-bsdapp-gcc+shared
	x86_64-native-bsdapp-gcc+debug

OS: SUSE15-64
	Kernel Version: 5.3.18-lp152.57-default
	GCC Version: gcc (SUSE Linux) 7.5.0
	Clang Version: 9.0.1
	x86_64-native-linuxapp-clang
	x86_64-native-linuxapp-gcc



*Build Failed #1:
OS: CENTOS83-64
Target: x86_64-native-linuxapp-gcc
FAILED: examples/dpdk-ipsec-secgw.p/ipsec-secgw_event_helper.c.o 
gcc -Iexamples/dpdk-ipsec-secgw.p -Iexamples -I../examples -Iexamples/ipsec-secgw -I../examples/ipsec-secgw -I. -I.. -Iconfig -I../config -Ilib/eal/include -I../lib/eal/include -Ilib/eal/linux/include -I../lib/eal/linux/include -Ilib/eal/x86/include -I../lib/eal/x86/include -Ilib/eal/common -I../lib/eal/common -Ilib/eal -I../lib/eal -Ilib/kvargs -I../lib/kvargs -Ilib/metrics -I../lib/metrics -Ilib/telemetry -I../lib/telemetry -Ilib/mempool -I../lib/mempool -Ilib/ring -I../lib/ring -Ilib/net -I../lib/net -Ilib/mbuf -I../lib/mbuf -Ilib/ethdev -I../lib/ethdev -Ilib/meter -I../lib/meter -Ilib/cmdline -I../lib/cmdline -Ilib/security -I../lib/security -Ilib/cryptodev -I../lib/cryptodev -Ilib/rcu -I../lib/rcu -Ilib/lpm -I../lib/lpm -Ilib/hash -I../lib/hash -Ilib/acl -I../lib/acl -Ilib/ip_frag -I../lib/ip_frag -Ilib/ipsec -I../lib/ipsec -Ilib/eventdev -I../lib/eventdev -Ilib/timer -I../lib/timer -fdiagnostics-color=always -pipe -D_FILE_OFFSET_BITS=64 -Wall -Winvalid-pch -Werror -O3 -include rte_config.h -Wextra -Wcast-qual -Wdeprecated -Wformat -Wformat-nonliteral -Wformat-security -Wmissing-declarations -Wmissing-prototypes -Wnested-externs -Wold-style-definition -Wpointer-arith -Wsign-compare -Wstrict-prototypes -Wundef -Wwrite-strings -Wno-packed-not-aligned -Wno-missing-field-initializers -D_GNU_SOURCE -march=native -Wno-format-truncation -DALLOW_EXPERIMENTAL_API -MD -MQ examples/dpdk-ipsec-secgw.p/ipsec-secgw_event_helper.c.o -MF examples/dpdk-ipsec-secgw.p/ipsec-secgw_event_helper.c.o.d -o examples/dpdk-ipsec-secgw.p/ipsec-secgw_event_helper.c.o -c ../examples/ipsec-secgw/event_helper.c
../examples/ipsec-secgw/event_helper.c: In function ‘eh_rx_adapter_configure’:
../examples/ipsec-secgw/event_helper.c:845:14: error: ‘struct rte_event_eth_rx_adapter_queue_conf’ has no member named ‘vector_sz’
    queue_conf.vector_sz = em_conf->ext_params.vector_size;
              ^
../examples/ipsec-secgw/event_helper.c:846:14: error: ‘struct rte_event_eth_rx_adapter_queue_conf’ has no member named ‘vector_timeout_ns’
    queue_conf.vector_timeout_ns = em_conf->vector_tmo_ns;
              ^
../examples/ipsec-secgw/event_helper.c:847:14: error: ‘struct rte_event_eth_rx_adapter_queue_conf’ has no member named ‘vector_mp’
    queue_conf.vector_mp = vector_pool;
              ^
[2860/3041] Compiling C object examples/dpdk-ip_pipeline.p/ip_pipeline_link.c.o
[2861/3041] Compiling C object examples/dpdk-ip_pipeline.p/ip_pipeline_pipeline.c.o
[2862/3041] Compiling C object examples/dpdk-ipsec-secgw.p/ipsec-secgw_esp.c.o
[2863/3041] Compiling C object examples/dpdk-ip_pipeline.p/ip_pipeline_parser.c.o
[2864/3041] Compiling C object app/test/dpdk-test.p/test_trace_perf.c.o
[2865/3041] Compiling C object examples/dpdk-ip_pipeline.p/ip_pipeline_cli.c.o
[2866/3041] Compiling C object examples/dpdk-ip_reassembly.p/ip_reassembly_main.c.o
[2867/3041] Compiling C object app/test/dpdk-test.p/test_ring_perf.c.o
[2868/3041] Compiling C object app/test/dpdk-test.p/test_ring.c.o
[2869/3041] Compiling C object drivers/libtmp_rte_event_octeontx2.a.p/event_octeontx2_otx2_worker.c.o
[2870/3041] Compiling C object drivers/libtmp_rte_event_octeontx2.a.p/event_octeontx2_otx2_worker_dual.c.o
ninja: build stopped




*Build Failed #2:
OS: CENTOS83-64
Target: x86_64-native-linuxapp-clang
FAILED: examples/dpdk-ipsec-secgw.p/ipsec-secgw_event_helper.c.o 
clang -Iexamples/dpdk-ipsec-secgw.p -Iexamples -I../examples -Iexamples/ipsec-secgw -I../examples/ipsec-secgw -I. -I.. -Iconfig -I../config -Ilib/eal/include -I../lib/eal/include -Ilib/eal/linux/include -I../lib/eal/linux/include -Ilib/eal/x86/include -I../lib/eal/x86/include -Ilib/eal/common -I../lib/eal/common -Ilib/eal -I../lib/eal -Ilib/kvargs -I../lib/kvargs -Ilib/metrics -I../lib/metrics -Ilib/telemetry -I../lib/telemetry -Ilib/mempool -I../lib/mempool -Ilib/ring -I../lib/ring -Ilib/net -I../lib/net -Ilib/mbuf -I../lib/mbuf -Ilib/ethdev -I../lib/ethdev -Ilib/meter -I../lib/meter -Ilib/cmdline -I../lib/cmdline -Ilib/security -I../lib/security -Ilib/cryptodev -I../lib/cryptodev -Ilib/rcu -I../lib/rcu -Ilib/lpm -I../lib/lpm -Ilib/hash -I../lib/hash -Ilib/acl -I../lib/acl -Ilib/ip_frag -I../lib/ip_frag -Ilib/ipsec -I../lib/ipsec -Ilib/eventdev -I../lib/eventdev -Ilib/timer -I../lib/timer -Xclang -fcolor-diagnostics -pipe -D_FILE_OFFSET_BITS=64 -Wall -Winvalid-pch -Werror -O3 -include rte_config.h -Wextra -Wcast-qual -Wdeprecated -Wformat -Wformat-nonliteral -Wformat-security -Wmissing-declarations -Wmissing-prototypes -Wnested-externs -Wold-style-definition -Wpointer-arith -Wsign-compare -Wstrict-prototypes -Wundef -Wwrite-strings -Wno-address-of-packed-member -Wno-missing-field-initializers -D_GNU_SOURCE -march=native -DALLOW_EXPERIMENTAL_API -MD -MQ examples/dpdk-ipsec-secgw.p/ipsec-secgw_event_helper.c.o -MF examples/dpdk-ipsec-secgw.p/ipsec-secgw_event_helper.c.o.d -o examples/dpdk-ipsec-secgw.p/ipsec-secgw_event_helper.c.o -c ../examples/ipsec-secgw/event_helper.c
../examples/ipsec-secgw/event_helper.c:845:15: error: no member named 'vector_sz' in 'struct rte_event_eth_rx_adapter_queue_conf'
                        queue_conf.vector_sz = em_conf->ext_params.vector_size;
                        ~~~~~~~~~~ ^
../examples/ipsec-secgw/event_helper.c:846:15: error: no member named 'vector_timeout_ns' in 'struct rte_event_eth_rx_adapter_queue_conf'
                        queue_conf.vector_timeout_ns = em_conf->vector_tmo_ns;
                        ~~~~~~~~~~ ^
../examples/ipsec-secgw/event_helper.c:847:15: error: no member named 'vector_mp' in 'struct rte_event_eth_rx_adapter_queue_conf'
                        queue_conf.vector_mp = vector_pool;
                        ~~~~~~~~~~ ^
3 errors generated.
[2867/3044] Compiling C object examples/dpdk-ip_reassembly.p/ip_reassembly_main.c.o
[2868/3044] Compiling C object examples/dpdk-ip_pipeline.p/ip_pipeline_cli.c.o
[2869/3044] Compiling C object examples/dpdk-ipsec-secgw.p/ipsec-secgw_ipsec_worker.c.o
FAILED: examples/dpdk-ipsec-secgw.p/ipsec-secgw_ipsec_worker.c.o 
clang -Iexamples/dpdk-ipsec-secgw.p -Iexamples -I../examples -Iexamples/ipsec-secgw -I../examples/ipsec-secgw -I. -I.. -Iconfig -I../config -Ilib/eal/include -I../lib/eal/include -Ilib/eal/linux/include -I../lib/eal/linux/include -Ilib/eal/x86/include -I../lib/eal/x86/include -Ilib/eal/common -I../lib/eal/common -Ilib/eal -I../lib/eal -Ilib/kvargs -I../lib/kvargs -Ilib/metrics -I../lib/metrics -Ilib/telemetry -I../lib/telemetry -Ilib/mempool -I../lib/mempool -Ilib/ring -I../lib/ring -Ilib/net -I../lib/net -Ilib/mbuf -I../lib/mbuf -Ilib/ethdev -I../lib/ethdev -Ilib/meter -I../lib/meter -Ilib/cmdline -I../lib/cmdline -Ilib/security -I../lib/security -Ilib/cryptodev -I../lib/cryptodev -Ilib/rcu -I../lib/rcu -Ilib/lpm -I../lib/lpm -Ilib/hash -I../lib/hash -Ilib/acl -I../lib/acl -Ilib/ip_frag -I../lib/ip_frag -Ilib/ipsec -I../lib/ipsec -Ilib/eventdev -I../lib/eventdev -Ilib/timer -I../lib/timer -Xclang -fcolor-diagnostics -pipe -D_FILE_OFFSET_BITS=64 -Wall -Winvalid-pch -Werror -O3 -include rte_config.h -Wextra -Wcast-qual -Wdeprecated -Wformat -Wformat-nonliteral -Wformat-security -Wmissing-declarations -Wmissing-prototypes -Wnested-externs -Wold-style-definition -Wpointer-arith -Wsign-compare -Wstrict-prototypes -Wundef -Wwrite-strings -Wno-address-of-packed-member -Wno-missing-field-initializers -D_GNU_SOURCE -march=native -DALLOW_EXPERIMENTAL_API -MD -MQ examples/dpdk-ipsec-secgw.p/ipsec-secgw_ipsec_worker.c.o -MF examples/dpdk-ipsec-secgw.p/ipsec-secgw_ipsec_worker.c.o.d -o examples/dpdk-ipsec-secgw.p/ipsec-secgw_ipsec_worker.c.o -c ../examples/ipsec-secgw/ipsec_worker.c
../examples/ipsec-secgw/ipsec_worker.c:632:15: error: declaration of 'struct port_drv_mode_data' will not be visible outside of this function [-Werror,-Wvisibility]
                                          struct port_drv_mode_data *data)
                                                 ^
../examples/ipsec-secgw/ipsec_worker.c:643:21: error: subscript of pointer to incomplete type 'struct port_drv_mode_data'
                if (unlikely(!data[port_id].sess)) {
                              ~~~~^
../lib/eal/include/rte_branch_prediction.h:38:41: note: expanded from macro 'unlikely'
#define unlikely(x)     __builtin_expect(!!(x), 0)
                                            ^
../examples/ipsec-secgw/ipsec_worker.c:632:15: note: forward declaration of 'struct port_drv_mode_data'
                                          struct port_drv_mode_data *data)
                                                 ^
../examples/ipsec-secgw/ipsec_worker.c:649:37: error: subscript of pointer to incomplete type 'struct port_drv_mode_data'
                rte_security_set_pkt_metadata(data[port_id].ctx,
                                              ~~~~^
../examples/ipsec-secgw/ipsec_worker.c:632:15: note: forward declaration of 'struct port_drv_mode_data'
                                          struct port_drv_mode_data *data)
                                                 ^
../examples/ipsec-secgw/ipsec_worker.c:650:16: error: subscript of pointer to incomplete type 'struct port_drv_mode_data'
                                              data[port_id].sess, pkt,
                                              ~~~~^
../examples/ipsec-secgw/ipsec_worker.c:632:15: note: forward declaration of 'struct port_drv_mode_data'
                                          struct port_drv_mode_data *data)
                                                 ^
../examples/ipsec-secgw/ipsec_worker.c:695:13: error: declaration of 'struct port_drv_mode_data' will not be visible outside of this function [-Werror,-Wvisibility]
                                 struct port_drv_mode_data *data)
                                        ^
../examples/ipsec-secgw/ipsec_worker.c:704:11: error: incompatible pointer types passing 'struct port_drv_mode_data *' to parameter of type 'struct port_drv_mode_data *' [-Werror,-Wincompatible-pointer-types]
                                                                         data);
                                                                         ^~~~
../examples/ipsec-secgw/ipsec_worker.c:632:35: note: passing argument to parameter 'data' here
                                          struct port_drv_mode_data *data)
                                                                     ^
../examples/ipsec-secgw/ipsec_worker.c:783:49: error: use of undeclared identifier 'data'
                        ipsec_ev_vector_drv_mode_process(links, &ev, data);
                                                                     ^
7 errors generated.
[2870/3044] Compiling C object examples/dpdk-ipsec-secgw.p/ipsec-secgw_esp.c.o
[2871/3044] Compiling C object examples/dpdk-ipsec-secgw.p/ipsec-secgw_ipsec-secgw.c.o
[2872/3044] Compiling C object app/test/dpdk-test.p/test_ring.c.o
[2873/3044] Compiling C object drivers/libtmp_rte_event_octeontx2.a.p/event_octeontx2_otx2_worker.c.o
[2874/3044] Compiling C object app/test/dpdk-test.p/test_ring_perf.c.o
[2875/3044] Compiling C object drivers/libtmp_rte_event_octeontx2.a.p/event_octeontx2_otx2_worker_dual.c.o
ninja: build stopped




*Build Failed #3:
OS: FreeBSD1201-64
Target: x86_64-native-bsdapp-gcc
FAILED: examples/dpdk-ipsec-secgw.p/ipsec-secgw_event_helper.c.o 
gcc -Iexamples/dpdk-ipsec-secgw.p -Iexamples -I../examples -Iexamples/ipsec-secgw -I../examples/ipsec-secgw -I. -I.. -Iconfig -I../config -Ilib/eal/include -I../lib/eal/include -Ilib/eal/freebsd/include -I../lib/eal/freebsd/include -Ilib/eal/x86/include -I../lib/eal/x86/include -Ilib/eal/common -I../lib/eal/common -Ilib/eal -I../lib/eal -Ilib/kvargs -I../lib/kvargs -Ilib/metrics -I../lib/metrics -Ilib/telemetry -I../lib/telemetry -Ilib/mempool -I../lib/mempool -Ilib/ring -I../lib/ring -Ilib/net -I../lib/net -Ilib/mbuf -I../lib/mbuf -Ilib/ethdev -I../lib/ethdev -Ilib/meter -I../lib/meter -Ilib/cmdline -I../lib/cmdline -Ilib/security -I../lib/security -Ilib/cryptodev -I../lib/cryptodev -Ilib/rcu -I../lib/rcu -Ilib/lpm -I../lib/lpm -Ilib/hash -I../lib/hash -Ilib/acl -I../lib/acl -Ilib/ip_frag -I../lib/ip_frag -Ilib/ipsec -I../lib/ipsec -Ilib/eventdev -I../lib/eventdev -Ilib/timer -I../lib/timer -fdiagnostics-color=always -pipe -D_FILE_OFFSET_BITS=64 -Wall -Winvalid-pch -Werror -O3 -include rte_config.h -Wextra -Wcast-qual -Wdeprecated -Wformat -Wformat-nonliteral -Wformat-security -Wmissing-declarations -Wmissing-prototypes -Wnested-externs -Wold-style-definition -Wpointer-arith -Wsign-compare -Wstrict-prototypes -Wundef -Wwrite-strings -Wno-address-of-packed-member -Wno-packed-not-aligned -Wno-missing-field-initializers -D_GNU_SOURCE -D__BSD_VISIBLE -march=native -mno-avx512f -Wno-format-truncation -DALLOW_EXPERIMENTAL_API -MD -MQ examples/dpdk-ipsec-secgw.p/ipsec-secgw_event_helper.c.o -MF examples/dpdk-ipsec-secgw.p/ipsec-secgw_event_helper.c.o.d -o examples/dpdk-ipsec-secgw.p/ipsec-secgw_event_helper.c.o -c ../examples/ipsec-secgw/event_helper.c
../examples/ipsec-secgw/event_helper.c: In function 'eh_rx_adapter_configure':
../examples/ipsec-secgw/event_helper.c:845:14: error: 'struct rte_event_eth_rx_adapter_queue_conf' has no member named 'vector_sz'
  845 |    queue_conf.vector_sz = em_conf->ext_params.vector_size;
      |              ^
../examples/ipsec-secgw/event_helper.c:846:14: error: 'struct rte_event_eth_rx_adapter_queue_conf' has no member named 'vector_timeout_ns'
  846 |    queue_conf.vector_timeout_ns = em_conf->vector_tmo_ns;
      |              ^
../examples/ipsec-secgw/event_helper.c:847:14: error: 'struct rte_event_eth_rx_adapter_queue_conf' has no member named 'vector_mp'
  847 |    queue_conf.vector_mp = vector_pool;
      |              ^
[2017/2131] Compiling C object examples/dpdk-ip_reassembly.p/ip_reassembly_main.c.o
[2018/2131] Compiling C object examples/dpdk-ipsec-secgw.p/ipsec-secgw_flow.c.o
[2019/2131] Compiling C object examples/dpdk-ipsec-secgw.p/ipsec-secgw_ipsec_process.c.o
[2020/2131] Linking target examples/dpdk-ioat
[2021/2131] Compiling C object examples/dpdk-ipsec-secgw.p/ipsec-secgw_ipsec.c.o
ninja: build stopped




*Build Failed #4:
OS: FreeBSD1201-64
Target: x86_64-native-bsdapp-clang
FAILED: examples/dpdk-ipsec-secgw.p/ipsec-secgw_event_helper.c.o 
clang -Iexamples/dpdk-ipsec-secgw.p -Iexamples -I../examples -Iexamples/ipsec-secgw -I../examples/ipsec-secgw -I. -I.. -Iconfig -I../config -Ilib/eal/include -I../lib/eal/include -Ilib/eal/freebsd/include -I../lib/eal/freebsd/include -Ilib/eal/x86/include -I../lib/eal/x86/include -Ilib/eal/common -I../lib/eal/common -Ilib/eal -I../lib/eal -Ilib/kvargs -I../lib/kvargs -Ilib/metrics -I../lib/metrics -Ilib/telemetry -I../lib/telemetry -Ilib/mempool -I../lib/mempool -Ilib/ring -I../lib/ring -Ilib/net -I../lib/net -Ilib/mbuf -I../lib/mbuf -Ilib/ethdev -I../lib/ethdev -Ilib/meter -I../lib/meter -Ilib/cmdline -I../lib/cmdline -Ilib/security -I../lib/security -Ilib/cryptodev -I../lib/cryptodev -Ilib/rcu -I../lib/rcu -Ilib/lpm -I../lib/lpm -Ilib/hash -I../lib/hash -Ilib/acl -I../lib/acl -Ilib/ip_frag -I../lib/ip_frag -Ilib/ipsec -I../lib/ipsec -Ilib/eventdev -I../lib/eventdev -Ilib/timer -I../lib/timer -Xclang -fcolor-diagnostics -pipe -D_FILE_OFFSET_BITS=64 -Wall -Winvalid-pch -Werror -O3 -include rte_config.h -Wextra -Wcast-qual -Wdeprecated -Wformat -Wformat-nonliteral -Wformat-security -Wmissing-declarations -Wmissing-prototypes -Wnested-externs -Wold-style-definition -Wpointer-arith -Wsign-compare -Wstrict-prototypes -Wundef -Wwrite-strings -Wno-address-of-packed-member -Wno-missing-field-initializers -D_GNU_SOURCE -D__BSD_VISIBLE -march=native -mno-avx512f -DALLOW_EXPERIMENTAL_API -MD -MQ examples/dpdk-ipsec-secgw.p/ipsec-secgw_event_helper.c.o -MF examples/dpdk-ipsec-secgw.p/ipsec-secgw_event_helper.c.o.d -o examples/dpdk-ipsec-secgw.p/ipsec-secgw_event_helper.c.o -c ../examples/ipsec-secgw/event_helper.c
../examples/ipsec-secgw/event_helper.c:845:15: error: no member named 'vector_sz' in 'struct rte_event_eth_rx_adapter_queue_conf'
                        queue_conf.vector_sz = em_conf->ext_params.vector_size;
                        ~~~~~~~~~~ ^
../examples/ipsec-secgw/event_helper.c:846:15: error: no member named 'vector_timeout_ns' in 'struct rte_event_eth_rx_adapter_queue_conf'
                        queue_conf.vector_timeout_ns = em_conf->vector_tmo_ns;
                        ~~~~~~~~~~ ^
../examples/ipsec-secgw/event_helper.c:847:15: error: no member named 'vector_mp' in 'struct rte_event_eth_rx_adapter_queue_conf'
                        queue_conf.vector_mp = vector_pool;
                        ~~~~~~~~~~ ^
3 errors generated.
[1980/2097] Linking target examples/dpdk-ip_reassembly
[1981/2097] Compiling C object examples/dpdk-ipsec-secgw.p/ipsec-secgw_flow.c.o
[1982/2097] Compiling C object examples/dpdk-ipsec-secgw.p/ipsec-secgw_ipsec_process.c.o
[1983/2097] Compiling C object examples/dpdk-ipsec-secgw.p/ipsec-secgw_ipsec.c.o
[1984/2097] Compiling C object examples/dpdk-ipsec-secgw.p/ipsec-secgw_ipsec_worker.c.o
FAILED: examples/dpdk-ipsec-secgw.p/ipsec-secgw_ipsec_worker.c.o 
clang -Iexamples/dpdk-ipsec-secgw.p -Iexamples -I../examples -Iexamples/ipsec-secgw -I../examples/ipsec-secgw -I. -I.. -Iconfig -I../config -Ilib/eal/include -I../lib/eal/include -Ilib/eal/freebsd/include -I../lib/eal/freebsd/include -Ilib/eal/x86/include -I../lib/eal/x86/include -Ilib/eal/common -I../lib/eal/common -Ilib/eal -I../lib/eal -Ilib/kvargs -I../lib/kvargs -Ilib/metrics -I../lib/metrics -Ilib/telemetry -I../lib/telemetry -Ilib/mempool -I../lib/mempool -Ilib/ring -I../lib/ring -Ilib/net -I../lib/net -Ilib/mbuf -I../lib/mbuf -Ilib/ethdev -I../lib/ethdev -Ilib/meter -I../lib/meter -Ilib/cmdline -I../lib/cmdline -Ilib/security -I../lib/security -Ilib/cryptodev -I../lib/cryptodev -Ilib/rcu -I../lib/rcu -Ilib/lpm -I../lib/lpm -Ilib/hash -I../lib/hash -Ilib/acl -I../lib/acl -Ilib/ip_frag -I../lib/ip_frag -Ilib/ipsec -I../lib/ipsec -Ilib/eventdev -I../lib/eventdev -Ilib/timer -I../lib/timer -Xclang -fcolor-diagnostics -pipe -D_FILE_OFFSET_BITS=64 -Wall -Winvalid-pch -Werror -O3 -include rte_config.h -Wextra -Wcast-qual -Wdeprecated -Wformat -Wformat-nonliteral -Wformat-security -Wmissing-declarations -Wmissing-prototypes -Wnested-externs -Wold-style-definition -Wpointer-arith -Wsign-compare -Wstrict-prototypes -Wundef -Wwrite-strings -Wno-address-of-packed-member -Wno-missing-field-initializers -D_GNU_SOURCE -D__BSD_VISIBLE -march=native -mno-avx512f -DALLOW_EXPERIMENTAL_API -MD -MQ examples/dpdk-ipsec-secgw.p/ipsec-secgw_ipsec_worker.c.o -MF examples/dpdk-ipsec-secgw.p/ipsec-secgw_ipsec_worker.c.o.d -o examples/dpdk-ipsec-secgw.p/ipsec-secgw_ipsec_worker.c.o -c ../examples/ipsec-secgw/ipsec_worker.c
../examples/ipsec-secgw/ipsec_worker.c:632:15: error: declaration of 'struct port_drv_mode_data' will not be visible outside of this function [-Werror,-Wvisibility]
                                          struct port_drv_mode_data *data)
                                                 ^
../examples/ipsec-secgw/ipsec_worker.c:643:21: error: subscript of pointer to incomplete type 'struct port_drv_mode_data'
                if (unlikely(!data[port_id].sess)) {
                              ~~~~^
../lib/eal/include/rte_branch_prediction.h:38:41: note: expanded from macro 'unlikely'
#define unlikely(x)     __builtin_expect(!!(x), 0)
                                            ^
../examples/ipsec-secgw/ipsec_worker.c:632:15: note: forward declaration of 'struct port_drv_mode_data'
                                          struct port_drv_mode_data *data)
                                                 ^
../examples/ipsec-secgw/ipsec_worker.c:649:37: error: subscript of pointer to incomplete type 'struct port_drv_mode_data'
                rte_security_set_pkt_metadata(data[port_id].ctx,
                                              ~~~~^
../examples/ipsec-secgw/ipsec_worker.c:632:15: note: forward declaration of 'struct port_drv_mode_data'
                                          struct port_drv_mode_data *data)
                                                 ^
../examples/ipsec-secgw/ipsec_worker.c:650:16: error: subscript of pointer to incomplete type 'struct port_drv_mode_data'
                                              data[port_id].sess, pkt,
                                              ~~~~^
../examples/ipsec-secgw/ipsec_worker.c:632:15: note: forward declaration of 'struct port_drv_mode_data'
                                          struct port_drv_mode_data *data)
                                                 ^
../examples/ipsec-secgw/ipsec_worker.c:695:13: error: declaration of 'struct port_drv_mode_data' will not be visible outside of this function [-Werror,-Wvisibility]
                                 struct port_drv_mode_data *data)
                                        ^
../examples/ipsec-secgw/ipsec_worker.c:704:11: error: incompatible pointer types passing 'struct port_drv_mode_data *' to parameter of type 'struct port_drv_mode_data *' [-Werror,-Wincompatible-pointer-types]
                                                                         data);
                                                                         ^~~~
../examples/ipsec-secgw/ipsec_worker.c:632:35: note: passing argument to parameter 'data' here
                                          struct port_drv_mode_data *data)
                                                                     ^
../examples/ipsec-secgw/ipsec_worker.c:783:49: error: use of undeclared identifier 'data'
                        ipsec_ev_vector_drv_mode_process(links, &ev, data);
                                                                     ^
7 errors generated.
[1985/2097] Compiling C object examples/dpdk-ioat.p/ioat_ioatfwd.c.o
[1986/2097] Compiling C object examples/dpdk-ipsec-secgw.p/ipsec-secgw_ipsec-secgw.c.o
[1987/2097] Compiling C object app/test/dpdk-test.p/test_ring.c.o
[1988/2097] Compiling C object app/test/dpdk-test.p/test_ring_perf.c.o
ninja: build stopped




*Build Failed #5:
OS: FreeBSD1201-64
Target: x86_64-native-bsdapp-gcc+debug
FAILED: examples/dpdk-ipsec-secgw.p/ipsec-secgw_event_helper.c.o 
gcc -Iexamples/dpdk-ipsec-secgw.p -Iexamples -I../examples -Iexamples/ipsec-secgw -I../examples/ipsec-secgw -I. -I.. -Iconfig -I../config -Ilib/eal/include -I../lib/eal/include -Ilib/eal/freebsd/include -I../lib/eal/freebsd/include -Ilib/eal/x86/include -I../lib/eal/x86/include -Ilib/eal/common -I../lib/eal/common -Ilib/eal -I../lib/eal -Ilib/kvargs -I../lib/kvargs -Ilib/metrics -I../lib/metrics -Ilib/telemetry -I../lib/telemetry -Ilib/mempool -I../lib/mempool -Ilib/ring -I../lib/ring -Ilib/net -I../lib/net -Ilib/mbuf -I../lib/mbuf -Ilib/ethdev -I../lib/ethdev -Ilib/meter -I../lib/meter -Ilib/cmdline -I../lib/cmdline -Ilib/security -I../lib/security -Ilib/cryptodev -I../lib/cryptodev -Ilib/rcu -I../lib/rcu -Ilib/lpm -I../lib/lpm -Ilib/hash -I../lib/hash -Ilib/acl -I../lib/acl -Ilib/ip_frag -I../lib/ip_frag -Ilib/ipsec -I../lib/ipsec -Ilib/eventdev -I../lib/eventdev -Ilib/timer -I../lib/timer -fdiagnostics-color=always -pipe -D_FILE_OFFSET_BITS=64 -Wall -Winvalid-pch -Werror -O2 -g -include rte_config.h -Wextra -Wcast-qual -Wdeprecated -Wformat -Wformat-nonliteral -Wformat-security -Wmissing-declarations -Wmissing-prototypes -Wnested-externs -Wold-style-definition -Wpointer-arith -Wsign-compare -Wstrict-prototypes -Wundef -Wwrite-strings -Wno-address-of-packed-member -Wno-packed-not-aligned -Wno-missing-field-initializers -D_GNU_SOURCE -D__BSD_VISIBLE -march=native -mno-avx512f -Wno-format-truncation -DALLOW_EXPERIMENTAL_API -MD -MQ examples/dpdk-ipsec-secgw.p/ipsec-secgw_event_helper.c.o -MF examples/dpdk-ipsec-secgw.p/ipsec-secgw_event_helper.c.o.d -o examples/dpdk-ipsec-secgw.p/ipsec-secgw_event_helper.c.o -c ../examples/ipsec-secgw/event_helper.c
../examples/ipsec-secgw/event_helper.c: In function 'eh_rx_adapter_configure':
../examples/ipsec-secgw/event_helper.c:845:14: error: 'struct rte_event_eth_rx_adapter_queue_conf' has no member named 'vector_sz'
  845 |    queue_conf.vector_sz = em_conf->ext_params.vector_size;
      |              ^
../examples/ipsec-secgw/event_helper.c:846:14: error: 'struct rte_event_eth_rx_adapter_queue_conf' has no member named 'vector_timeout_ns'
  846 |    queue_conf.vector_timeout_ns = em_conf->vector_tmo_ns;
      |              ^
../examples/ipsec-secgw/event_helper.c:847:14: error: 'struct rte_event_eth_rx_adapter_queue_conf' has no member named 'vector_mp'
  847 |    queue_conf.vector_mp = vector_pool;
      |              ^
[2011/2131] Compiling C object examples/dpdk-ioat.p/ioat_ioatfwd.c.o
[2012/2131] Linking target examples/dpdk-helloworld
[2013/2131] Compiling C object examples/dpdk-ipsec-secgw.p/ipsec-secgw_flow.c.o
[2014/2131] Linking target examples/dpdk-flow_filtering
[2015/2131] Linking target examples/dpdk-flow_classify
[2016/2131] Linking target examples/dpdk-fips_validation
[2017/2131] Linking target examples/dpdk-ip_fragmentation
[2018/2131] Linking target app/test/dpdk-test
[2019/2131] Linking target examples/dpdk-ip_reassembly
ninja: build stopped




*Build Failed #6:
OS: RHEL83-64
Target: x86_64-native-linuxapp-gcc
FAILED: examples/c590b3c@@dpdk-ipsec-secgw at exe/ipsec-secgw_ipsec_worker.c.o 
gcc -Iexamples/c590b3c@@dpdk-ipsec-secgw at exe -Iexamples -I../examples -Iexamples/ipsec-secgw -I../examples/ipsec-secgw -I. -I../ -Iconfig -I../config -Ilib/eal/include -I../lib/eal/include -Ilib/eal/linux/include -I../lib/eal/linux/include -Ilib/eal/x86/include -I../lib/eal/x86/include -Ilib/eal/common -I../lib/eal/common -Ilib/eal -I../lib/eal -Ilib/kvargs -I../lib/kvargs -Ilib/telemetry/../metrics -I../lib/telemetry/../metrics -Ilib/telemetry -I../lib/telemetry -Ilib/mempool -I../lib/mempool -Ilib/ring -I../lib/ring -Ilib/net -I../lib/net -Ilib/mbuf -I../lib/mbuf -Ilib/ethdev -I../lib/ethdev -Ilib/meter -I../lib/meter -Ilib/cmdline -I../lib/cmdline -Ilib/security -I../lib/security -Ilib/cryptodev -I../lib/cryptodev -Ilib/rcu -I../lib/rcu -Ilib/lpm -I../lib/lpm -Ilib/hash -I../lib/hash -Ilib/acl -I../lib/acl -Ilib/ip_frag -I../lib/ip_frag -Ilib/ipsec -I../lib/ipsec -Ilib/eventdev -I../lib/eventdev -Ilib/timer -I../lib/timer -fdiagnostics-color=always -pipe -D_FILE_OFFSET_BITS=64 -Wall -Winvalid-pch -Werror -O3 -include rte_config.h -Wextra -Wcast-qual -Wdeprecated -Wformat -Wformat-nonliteral -Wformat-security -Wmissing-declarations -Wmissing-prototypes -Wnested-externs -Wold-style-definition -Wpointer-arith -Wsign-compare -Wstrict-prototypes -Wundef -Wwrite-strings -Wno-packed-not-aligned -Wno-missing-field-initializers -D_GNU_SOURCE -march=native -Wno-format-truncation -DALLOW_EXPERIMENTAL_API -MD -MQ 'examples/c590b3c@@dpdk-ipsec-secgw at exe/ipsec-secgw_ipsec_worker.c.o' -MF 'examples/c590b3c@@dpdk-ipsec-secgw at exe/ipsec-secgw_ipsec_worker.c.o.d' -o 'examples/c590b3c@@dpdk-ipsec-secgw at exe/ipsec-secgw_ipsec_worker.c.o' -c ../examples/ipsec-secgw/ipsec_worker.c
../examples/ipsec-secgw/ipsec_worker.c:632:15: error: ‘struct port_drv_mode_data’ declared inside parameter list will not be visible outside of this definition or declaration [-Werror]
        struct port_drv_mode_data *data)
               ^~~~~~~~~~~~~~~~~~
In file included from ../lib/eal/x86/include/rte_spinlock.h:15,
                 from ../lib/eal/x86/include/rte_rwlock.h:13,
                 from ../lib/eal/include/rte_fbarray.h:40,
                 from ../lib/eal/include/rte_memory.h:25,
                 from ../lib/acl/rte_acl_osdep.h:34,
                 from ../lib/acl/rte_acl.h:14,
                 from ../examples/ipsec-secgw/ipsec_worker.c:5:
../examples/ipsec-secgw/ipsec_worker.c: In function ‘process_ipsec_ev_drv_mode_outbound_vector’:
../examples/ipsec-secgw/ipsec_worker.c:643:21: error: invalid use of undefined type ‘struct port_drv_mode_data’
   if (unlikely(!data[port_id].sess)) {
                     ^
../lib/eal/include/rte_branch_prediction.h:38:41: note: in definition of macro ‘unlikely’
 #define unlikely(x) __builtin_expect(!!(x), 0)
                                         ^
../examples/ipsec-secgw/ipsec_worker.c:643:21: error: dereferencing pointer to incomplete type ‘struct port_drv_mode_data’
   if (unlikely(!data[port_id].sess)) {
                     ^
../lib/eal/include/rte_branch_prediction.h:38:41: note: in definition of macro ‘unlikely’
 #define unlikely(x) __builtin_expect(!!(x), 0)
                                         ^
../examples/ipsec-secgw/ipsec_worker.c:649:37: error: invalid use of undefined type ‘struct port_drv_mode_data’
   rte_security_set_pkt_metadata(data[port_id].ctx,
                                     ^
../examples/ipsec-secgw/ipsec_worker.c:650:16: error: invalid use of undefined type ‘struct port_drv_mode_data’
            data[port_id].sess, pkt,
                ^
../examples/ipsec-secgw/ipsec_worker.c: At top level:
../examples/ipsec-secgw/ipsec_worker.c:695:13: error: ‘struct port_drv_mode_data’ declared inside parameter list will not be visible outside of this definition or declaration [-Werror]
      struct port_drv_mode_data *data)
             ^~~~~~~~~~~~~~~~~~
../examples/ipsec-secgw/ipsec_worker.c: In function ‘ipsec_ev_vector_drv_mode_process’:
../examples/ipsec-secgw/ipsec_worker.c:704:11: error: passing argument 2 of ‘process_ipsec_ev_drv_mode_outbound_vector’ from incompatible pointer type [-Werror=incompatible-pointer-types]
           data);
           ^~~~
../examples/ipsec-secgw/ipsec_worker.c:632:35: note: expected ‘struct port_drv_mode_data *’ but argument is of type ‘struct port_drv_mode_data *’
        struct port_drv_mode_data *data)
        ~~~~~~~~~~~~~~~~~~~~~~~~~~~^~~~
../examples/ipsec-secgw/ipsec_worker.c: In function ‘ipsec_wrkr_non_burst_int_port_drv_mode’:
../examples/ipsec-secgw/ipsec_worker.c:783:49: error: ‘data’ undeclared (first use in this function)
    ipsec_ev_vector_drv_mode_process(links, &ev, data);
                                                 ^~~~
../examples/ipsec-secgw/ipsec_worker.c:783:49: note: each undeclared identifier is reported only once for each function it appears in
cc1: all warnings being treated as errors
[2654/2827] Compiling C object 'examples/c590b3c@@dpdk-ip_pipeline at exe/ip_pipeline_thread.c.o'.
[2655/2827] Compiling C object 'examples/c590b3c@@dpdk-ip_pipeline at exe/ip_pipeline_pipeline.c.o'.
[2656/2827] Compiling C object 'examples/c590b3c@@dpdk-ipsec-secgw at exe/ipsec-secgw_event_helper.c.o'.
FAILED: examples/c590b3c@@dpdk-ipsec-secgw at exe/ipsec-secgw_event_helper.c.o 
gcc -Iexamples/c590b3c@@dpdk-ipsec-secgw at exe -Iexamples -I../examples -Iexamples/ipsec-secgw -I../examples/ipsec-secgw -I. -I../ -Iconfig -I../config -Ilib/eal/include -I../lib/eal/include -Ilib/eal/linux/include -I../lib/eal/linux/include -Ilib/eal/x86/include -I../lib/eal/x86/include -Ilib/eal/common -I../lib/eal/common -Ilib/eal -I../lib/eal -Ilib/kvargs -I../lib/kvargs -Ilib/telemetry/../metrics -I../lib/telemetry/../metrics -Ilib/telemetry -I../lib/telemetry -Ilib/mempool -I../lib/mempool -Ilib/ring -I../lib/ring -Ilib/net -I../lib/net -Ilib/mbuf -I../lib/mbuf -Ilib/ethdev -I../lib/ethdev -Ilib/meter -I../lib/meter -Ilib/cmdline -I../lib/cmdline -Ilib/security -I../lib/security -Ilib/cryptodev -I../lib/cryptodev -Ilib/rcu -I../lib/rcu -Ilib/lpm -I../lib/lpm -Ilib/hash -I../lib/hash -Ilib/acl -I../lib/acl -Ilib/ip_frag -I../lib/ip_frag -Ilib/ipsec -I../lib/ipsec -Ilib/eventdev -I../lib/eventdev -Ilib/timer -I../lib/timer -fdiagnostics-color=always -pipe -D_FILE_OFFSET_BITS=64 -Wall -Winvalid-pch -Werror -O3 -include rte_config.h -Wextra -Wcast-qual -Wdeprecated -Wformat -Wformat-nonliteral -Wformat-security -Wmissing-declarations -Wmissing-prototypes -Wnested-externs -Wold-style-definition -Wpointer-arith -Wsign-compare -Wstrict-prototypes -Wundef -Wwrite-strings -Wno-packed-not-aligned -Wno-missing-field-initializers -D_GNU_SOURCE -march=native -Wno-format-truncation -DALLOW_EXPERIMENTAL_API -MD -MQ 'examples/c590b3c@@dpdk-ipsec-secgw at exe/ipsec-secgw_event_helper.c.o' -MF 'examples/c590b3c@@dpdk-ipsec-secgw at exe/ipsec-secgw_event_helper.c.o.d' -o 'examples/c590b3c@@dpdk-ipsec-secgw at exe/ipsec-secgw_event_helper.c.o' -c ../examples/ipsec-secgw/event_helper.c
../examples/ipsec-secgw/event_helper.c: In function ‘eh_rx_adapter_configure’:
../examples/ipsec-secgw/event_helper.c:845:14: error: ‘struct rte_event_eth_rx_adapter_queue_conf’ has no member named ‘vector_sz’
    queue_conf.vector_sz = em_conf->ext_params.vector_size;
              ^
../examples/ipsec-secgw/event_helper.c:846:14: error: ‘struct rte_event_eth_rx_adapter_queue_conf’ has no member named ‘vector_timeout_ns’
    queue_conf.vector_timeout_ns = em_conf->vector_tmo_ns;
              ^
../examples/ipsec-secgw/event_helper.c:847:14: error: ‘struct rte_event_eth_rx_adapter_queue_conf’ has no member named ‘vector_mp’
    queue_conf.vector_mp = vector_pool;
              ^
[2657/2827] Compiling C object 'examples/c590b3c@@dpdk-ipsec-secgw at exe/ipsec-secgw_rt.c.o'.
[2658/2827] Compiling C object 'examples/c590b3c@@dpdk-ipsec-secgw at exe/ipsec-secgw_sad.c.o'.
[2659/2827] Compiling C object 'examples/c590b3c@@dpdk-ipsec-secgw at exe/ipsec-secgw_sp4.c.o'.
[2660/2827] Compiling C object 'app/test/3062f5d@@dpdk-test at exe/test_ring.c.o'.
[2661/2827] Compiling C object 'drivers/a715181@@tmp_rte_event_octeontx2 at sta/event_octeontx2_otx2_worker.c.o'.
[2662/2827] Compiling C object 'drivers/a715181@@tmp_rte_event_octeontx2 at sta/event_octeontx2_otx2_worker_dual.c.o'.
ninja: build stopped




*Build Failed #7:
OS: SUSE15-64
Target: x86_64-native-linuxapp-clang
FAILED: examples/dpdk-ipsec-secgw.p/ipsec-secgw_ipsec_worker.c.o 
clang -Iexamples/dpdk-ipsec-secgw.p -Iexamples -I../examples -Iexamples/ipsec-secgw -I../examples/ipsec-secgw -I. -I.. -Iconfig -I../config -Ilib/eal/include -I../lib/eal/include -Ilib/eal/linux/include -I../lib/eal/linux/include -Ilib/eal/x86/include -I../lib/eal/x86/include -Ilib/eal/common -I../lib/eal/common -Ilib/eal -I../lib/eal -Ilib/kvargs -I../lib/kvargs -Ilib/metrics -I../lib/metrics -Ilib/telemetry -I../lib/telemetry -Ilib/mempool -I../lib/mempool -Ilib/ring -I../lib/ring -Ilib/net -I../lib/net -Ilib/mbuf -I../lib/mbuf -Ilib/ethdev -I../lib/ethdev -Ilib/meter -I../lib/meter -Ilib/cmdline -I../lib/cmdline -Ilib/security -I../lib/security -Ilib/cryptodev -I../lib/cryptodev -Ilib/rcu -I../lib/rcu -Ilib/lpm -I../lib/lpm -Ilib/hash -I../lib/hash -Ilib/acl -I../lib/acl -Ilib/ip_frag -I../lib/ip_frag -Ilib/ipsec -I../lib/ipsec -Ilib/eventdev -I../lib/eventdev -Ilib/timer -I../lib/timer -Xclang -fcolor-diagnostics -pipe -D_FILE_OFFSET_BITS=64 -Wall -Winvalid-pch -Werror -O3 -include rte_config.h -Wextra -Wcast-qual -Wdeprecated -Wformat -Wformat-nonliteral -Wformat-security -Wmissing-declarations -Wmissing-prototypes -Wnested-externs -Wold-style-definition -Wpointer-arith -Wsign-compare -Wstrict-prototypes -Wundef -Wwrite-strings -Wno-address-of-packed-member -Wno-missing-field-initializers -D_GNU_SOURCE -march=native -DALLOW_EXPERIMENTAL_API -MD -MQ examples/dpdk-ipsec-secgw.p/ipsec-secgw_ipsec_worker.c.o -MF examples/dpdk-ipsec-secgw.p/ipsec-secgw_ipsec_worker.c.o.d -o examples/dpdk-ipsec-secgw.p/ipsec-secgw_ipsec_worker.c.o -c ../examples/ipsec-secgw/ipsec_worker.c
../examples/ipsec-secgw/ipsec_worker.c:632:15: error: declaration of 'struct port_drv_mode_data' will not be visible outside of this function [-Werror,-Wvisibility]
                                          struct port_drv_mode_data *data)
                                                 ^
../examples/ipsec-secgw/ipsec_worker.c:643:21: error: subscript of pointer to incomplete type 'struct port_drv_mode_data'
                if (unlikely(!data[port_id].sess)) {
                              ~~~~^
../lib/eal/include/rte_branch_prediction.h:38:41: note: expanded from macro 'unlikely'
#define unlikely(x)     __builtin_expect(!!(x), 0)
                                            ^
../examples/ipsec-secgw/ipsec_worker.c:632:15: note: forward declaration of 'struct port_drv_mode_data'
                                          struct port_drv_mode_data *data)
                                                 ^
../examples/ipsec-secgw/ipsec_worker.c:649:37: error: subscript of pointer to incomplete type 'struct port_drv_mode_data'
                rte_security_set_pkt_metadata(data[port_id].ctx,
                                              ~~~~^
../examples/ipsec-secgw/ipsec_worker.c:632:15: note: forward declaration of 'struct port_drv_mode_data'
                                          struct port_drv_mode_data *data)
                                                 ^
../examples/ipsec-secgw/ipsec_worker.c:650:16: error: subscript of pointer to incomplete type 'struct port_drv_mode_data'
                                              data[port_id].sess, pkt,
                                              ~~~~^
../examples/ipsec-secgw/ipsec_worker.c:632:15: note: forward declaration of 'struct port_drv_mode_data'
                                          struct port_drv_mode_data *data)
                                                 ^
../examples/ipsec-secgw/ipsec_worker.c:695:13: error: declaration of 'struct port_drv_mode_data' will not be visible outside of this function [-Werror,-Wvisibility]
                                 struct port_drv_mode_data *data)
                                        ^
../examples/ipsec-secgw/ipsec_worker.c:704:11: error: incompatible pointer types passing 'struct port_drv_mode_data *' to parameter of type 'struct port_drv_mode_data *' [-Werror,-Wincompatible-pointer-types]
                                                                         data);
                                                                         ^~~~
../examples/ipsec-secgw/ipsec_worker.c:632:35: note: passing argument to parameter 'data' here
                                          struct port_drv_mode_data *data)
                                                                     ^
../examples/ipsec-secgw/ipsec_worker.c:783:49: error: use of undeclared identifier 'data'
                        ipsec_ev_vector_drv_mode_process(links, &ev, data);
                                                                     ^
7 errors generated.
[2868/3045] Compiling C object examples/dpdk-ioat.p/ioat_ioatfwd.c.o
[2869/3045] Compiling C object examples/dpdk-ipsec-secgw.p/ipsec-secgw_event_helper.c.o
FAILED: examples/dpdk-ipsec-secgw.p/ipsec-secgw_event_helper.c.o 
clang -Iexamples/dpdk-ipsec-secgw.p -Iexamples -I../examples -Iexamples/ipsec-secgw -I../examples/ipsec-secgw -I. -I.. -Iconfig -I../config -Ilib/eal/include -I../lib/eal/include -Ilib/eal/linux/include -I../lib/eal/linux/include -Ilib/eal/x86/include -I../lib/eal/x86/include -Ilib/eal/common -I../lib/eal/common -Ilib/eal -I../lib/eal -Ilib/kvargs -I../lib/kvargs -Ilib/metrics -I../lib/metrics -Ilib/telemetry -I../lib/telemetry -Ilib/mempool -I../lib/mempool -Ilib/ring -I../lib/ring -Ilib/net -I../lib/net -Ilib/mbuf -I../lib/mbuf -Ilib/ethdev -I../lib/ethdev -Ilib/meter -I../lib/meter -Ilib/cmdline -I../lib/cmdline -Ilib/security -I../lib/security -Ilib/cryptodev -I../lib/cryptodev -Ilib/rcu -I../lib/rcu -Ilib/lpm -I../lib/lpm -Ilib/hash -I../lib/hash -Ilib/acl -I../lib/acl -Ilib/ip_frag -I../lib/ip_frag -Ilib/ipsec -I../lib/ipsec -Ilib/eventdev -I../lib/eventdev -Ilib/timer -I../lib/timer -Xclang -fcolor-diagnostics -pipe -D_FILE_OFFSET_BITS=64 -Wall -Winvalid-pch -Werror -O3 -include rte_config.h -Wextra -Wcast-qual -Wdeprecated -Wformat -Wformat-nonliteral -Wformat-security -Wmissing-declarations -Wmissing-prototypes -Wnested-externs -Wold-style-definition -Wpointer-arith -Wsign-compare -Wstrict-prototypes -Wundef -Wwrite-strings -Wno-address-of-packed-member -Wno-missing-field-initializers -D_GNU_SOURCE -march=native -DALLOW_EXPERIMENTAL_API -MD -MQ examples/dpdk-ipsec-secgw.p/ipsec-secgw_event_helper.c.o -MF examples/dpdk-ipsec-secgw.p/ipsec-secgw_event_helper.c.o.d -o examples/dpdk-ipsec-secgw.p/ipsec-secgw_event_helper.c.o -c ../examples/ipsec-secgw/event_helper.c
../examples/ipsec-secgw/event_helper.c:845:15: error: no member named 'vector_sz' in 'struct rte_event_eth_rx_adapter_queue_conf'
                        queue_conf.vector_sz = em_conf->ext_params.vector_size;
                        ~~~~~~~~~~ ^
../examples/ipsec-secgw/event_helper.c:846:15: error: no member named 'vector_timeout_ns' in 'struct rte_event_eth_rx_adapter_queue_conf'
                        queue_conf.vector_timeout_ns = em_conf->vector_tmo_ns;
                        ~~~~~~~~~~ ^
../examples/ipsec-secgw/event_helper.c:847:15: error: no member named 'vector_mp' in 'struct rte_event_eth_rx_adapter_queue_conf'
                        queue_conf.vector_mp = vector_pool;
                        ~~~~~~~~~~ ^
3 errors generated.
[2870/3045] Compiling C object examples/dpdk-ipsec-secgw.p/ipsec-secgw_flow.c.o
[2871/3045] Compiling C object examples/dpdk-ip_reassembly.p/ip_reassembly_main.c.o
[2872/3045] Compiling C object examples/dpdk-ipsec-secgw.p/ipsec-secgw_ipsec-secgw.c.o
[2873/3045] Compiling C object app/test/dpdk-test.p/test_ring.c.o
[2874/3045] Compiling C object drivers/libtmp_rte_event_octeontx2.a.p/event_octeontx2_otx2_worker.c.o
[2875/3045] Compiling C object drivers/libtmp_rte_event_octeontx2.a.p/event_octeontx2_otx2_worker_dual.c.o
[2876/3045] Compiling C object app/test/dpdk-test.p/test_ring_perf.c.o
ninja: build stopped




*Build Failed #8:
OS: SUSE15-64
Target: x86_64-native-linuxapp-gcc
FAILED: examples/dpdk-ipsec-secgw.p/ipsec-secgw_event_helper.c.o 
gcc -Iexamples/dpdk-ipsec-secgw.p -Iexamples -I../examples -Iexamples/ipsec-secgw -I../examples/ipsec-secgw -I. -I.. -Iconfig -I../config -Ilib/eal/include -I../lib/eal/include -Ilib/eal/linux/include -I../lib/eal/linux/include -Ilib/eal/x86/include -I../lib/eal/x86/include -Ilib/eal/common -I../lib/eal/common -Ilib/eal -I../lib/eal -Ilib/kvargs -I../lib/kvargs -Ilib/metrics -I../lib/metrics -Ilib/telemetry -I../lib/telemetry -Ilib/mempool -I../lib/mempool -Ilib/ring -I../lib/ring -Ilib/net -I../lib/net -Ilib/mbuf -I../lib/mbuf -Ilib/ethdev -I../lib/ethdev -Ilib/meter -I../lib/meter -Ilib/cmdline -I../lib/cmdline -Ilib/security -I../lib/security -Ilib/cryptodev -I../lib/cryptodev -Ilib/rcu -I../lib/rcu -Ilib/lpm -I../lib/lpm -Ilib/hash -I../lib/hash -Ilib/acl -I../lib/acl -Ilib/ip_frag -I../lib/ip_frag -Ilib/ipsec -I../lib/ipsec -Ilib/eventdev -I../lib/eventdev -Ilib/timer -I../lib/timer -fdiagnostics-color=always -pipe -D_FILE_OFFSET_BITS=64 -Wall -Winvalid-pch -Werror -O3 -include rte_config.h -Wextra -Wcast-qual -Wdeprecated -Wformat -Wformat-nonliteral -Wformat-security -Wmissing-declarations -Wmissing-prototypes -Wnested-externs -Wold-style-definition -Wpointer-arith -Wsign-compare -Wstrict-prototypes -Wundef -Wwrite-strings -Wno-missing-field-initializers -D_GNU_SOURCE -march=native -Wno-format-truncation -DALLOW_EXPERIMENTAL_API -MD -MQ examples/dpdk-ipsec-secgw.p/ipsec-secgw_event_helper.c.o -MF examples/dpdk-ipsec-secgw.p/ipsec-secgw_event_helper.c.o.d -o examples/dpdk-ipsec-secgw.p/ipsec-secgw_event_helper.c.o -c ../examples/ipsec-secgw/event_helper.c
../examples/ipsec-secgw/event_helper.c: In function ‘eh_rx_adapter_configure’:
../examples/ipsec-secgw/event_helper.c:845:14: error: ‘struct rte_event_eth_rx_adapter_queue_conf’ has no member named ‘vector_sz’
    queue_conf.vector_sz = em_conf->ext_params.vector_size;
              ^
../examples/ipsec-secgw/event_helper.c:846:14: error: ‘struct rte_event_eth_rx_adapter_queue_conf’ has no member named ‘vector_timeout_ns’
    queue_conf.vector_timeout_ns = em_conf->vector_tmo_ns;
              ^
../examples/ipsec-secgw/event_helper.c:847:14: error: ‘struct rte_event_eth_rx_adapter_queue_conf’ has no member named ‘vector_mp’
    queue_conf.vector_mp = vector_pool;
              ^
[2870/3043] Compiling C object examples/dpdk-ipsec-secgw.p/ipsec-secgw_ipsec_worker.c.o
FAILED: examples/dpdk-ipsec-secgw.p/ipsec-secgw_ipsec_worker.c.o 
gcc -Iexamples/dpdk-ipsec-secgw.p -Iexamples -I../examples -Iexamples/ipsec-secgw -I../examples/ipsec-secgw -I. -I.. -Iconfig -I../config -Ilib/eal/include -I../lib/eal/include -Ilib/eal/linux/include -I../lib/eal/linux/include -Ilib/eal/x86/include -I../lib/eal/x86/include -Ilib/eal/common -I../lib/eal/common -Ilib/eal -I../lib/eal -Ilib/kvargs -I../lib/kvargs -Ilib/metrics -I../lib/metrics -Ilib/telemetry -I../lib/telemetry -Ilib/mempool -I../lib/mempool -Ilib/ring -I../lib/ring -Ilib/net -I../lib/net -Ilib/mbuf -I../lib/mbuf -Ilib/ethdev -I../lib/ethdev -Ilib/meter -I../lib/meter -Ilib/cmdline -I../lib/cmdline -Ilib/security -I../lib/security -Ilib/cryptodev -I../lib/cryptodev -Ilib/rcu -I../lib/rcu -Ilib/lpm -I../lib/lpm -Ilib/hash -I../lib/hash -Ilib/acl -I../lib/acl -Ilib/ip_frag -I../lib/ip_frag -Ilib/ipsec -I../lib/ipsec -Ilib/eventdev -I../lib/eventdev -Ilib/timer -I../lib/timer -fdiagnostics-color=always -pipe -D_FILE_OFFSET_BITS=64 -Wall -Winvalid-pch -Werror -O3 -include rte_config.h -Wextra -Wcast-qual -Wdeprecated -Wformat -Wformat-nonliteral -Wformat-security -Wmissing-declarations -Wmissing-prototypes -Wnested-externs -Wold-style-definition -Wpointer-arith -Wsign-compare -Wstrict-prototypes -Wundef -Wwrite-strings -Wno-missing-field-initializers -D_GNU_SOURCE -march=native -Wno-format-truncation -DALLOW_EXPERIMENTAL_API -MD -MQ examples/dpdk-ipsec-secgw.p/ipsec-secgw_ipsec_worker.c.o -MF examples/dpdk-ipsec-secgw.p/ipsec-secgw_ipsec_worker.c.o.d -o examples/dpdk-ipsec-secgw.p/ipsec-secgw_ipsec_worker.c.o -c ../examples/ipsec-secgw/ipsec_worker.c
../examples/ipsec-secgw/ipsec_worker.c:632:15: error: ‘struct port_drv_mode_data’ declared inside parameter list will not be visible outside of this definition or declaration [-Werror]
        struct port_drv_mode_data *data)
               ^~~~~~~~~~~~~~~~~~
In file included from ../lib/eal/x86/include/rte_spinlock.h:15:0,
                 from ../lib/eal/x86/include/rte_rwlock.h:13,
                 from ../lib/eal/include/rte_fbarray.h:40,
                 from ../lib/eal/include/rte_memory.h:25,
                 from ../lib/acl/rte_acl_osdep.h:34,
                 from ../lib/acl/rte_acl.h:14,
                 from ../examples/ipsec-secgw/ipsec_worker.c:5:
../examples/ipsec-secgw/ipsec_worker.c: In function ‘process_ipsec_ev_drv_mode_outbound_vector’:
../examples/ipsec-secgw/ipsec_worker.c:643:21: error: invalid use of undefined type ‘struct port_drv_mode_data’
   if (unlikely(!data[port_id].sess)) {
                     ^
../lib/eal/include/rte_branch_prediction.h:38:41: note: in definition of macro ‘unlikely’
 #define unlikely(x) __builtin_expect(!!(x), 0)
                                         ^
../examples/ipsec-secgw/ipsec_worker.c:643:21: error: dereferencing pointer to incomplete type ‘struct port_drv_mode_data’
   if (unlikely(!data[port_id].sess)) {
                     ^
../lib/eal/include/rte_branch_prediction.h:38:41: note: in definition of macro ‘unlikely’
 #define unlikely(x) __builtin_expect(!!(x), 0)
                                         ^
../examples/ipsec-secgw/ipsec_worker.c:649:37: error: invalid use of undefined type ‘struct port_drv_mode_data’
   rte_security_set_pkt_metadata(data[port_id].ctx,
                                     ^
../examples/ipsec-secgw/ipsec_worker.c:650:16: error: invalid use of undefined type ‘struct port_drv_mode_data’
            data[port_id].sess, pkt,
                ^
../examples/ipsec-secgw/ipsec_worker.c: At top level:
../examples/ipsec-secgw/ipsec_worker.c:695:13: error: ‘struct port_drv_mode_data’ declared inside parameter list will not be visible outside of this definition or declaration [-Werror]
      struct port_drv_mode_data *data)
             ^~~~~~~~~~~~~~~~~~
../examples/ipsec-secgw/ipsec_worker.c: In function ‘ipsec_ev_vector_drv_mode_process’:
../examples/ipsec-secgw/ipsec_worker.c:704:11: error: passing argument 2 of ‘process_ipsec_ev_drv_mode_outbound_vector’ from incompatible pointer type [-Werror=incompatible-pointer-types]
           data);
           ^~~~
../examples/ipsec-secgw/ipsec_worker.c:631:1: note: expected ‘struct port_drv_mode_data *’ but argument is of type ‘struct port_drv_mode_data *’
 process_ipsec_ev_drv_mode_outbound_vector(struct rte_event_vector *vec,
 ^~~~~~~~~~~~~~~~~~~~~~~~~~~~~~~~~~~~~~~~~
../examples/ipsec-secgw/ipsec_worker.c: In function ‘ipsec_wrkr_non_burst_int_port_drv_mode’:
../examples/ipsec-secgw/ipsec_worker.c:783:49: error: ‘data’ undeclared (first use in this function)
    ipsec_ev_vector_drv_mode_process(links, &ev, data);
                                                 ^~~~
../examples/ipsec-secgw/ipsec_worker.c:783:49: note: each undeclared identifier is reported only once for each function it appears in
cc1: all warnings being treated as errors
[2871/3043] Compiling C object examples/dpdk-ip_pipeline.p/ip_pipeline_cli.c.o
[2872/3043] Compiling C object examples/dpdk-ipsec-secgw.p/ipsec-secgw_ipsec.c.o
[2873/3043] Compiling C object examples/dpdk-ipsec-secgw.p/ipsec-secgw_ipsec_process.c.o
[2874/3043] Compiling C object app/test/dpdk-test.p/test_ring.c.o
[2875/3043] Compiling C object drivers/libtmp_rte_event_octeontx2.a.p/event_octeontx2_otx2_worker_dual.c.o
[2876/3043] Compiling C object drivers/libtmp_rte_event_octeontx2.a.p/event_octeontx2_otx2_worker.c.o
ninja: build stopped




*Build Failed #9:
OS: UB2004-32
Target: i686-native-linuxapp-gcc
FAILED: examples/dpdk-ipsec-secgw.p/ipsec-secgw_event_helper.c.o 
gcc -Iexamples/dpdk-ipsec-secgw.p -Iexamples -I../examples -Iexamples/ipsec-secgw -I../examples/ipsec-secgw -I. -I.. -Iconfig -I../config -Ilib/eal/include -I../lib/eal/include -Ilib/eal/linux/include -I../lib/eal/linux/include -Ilib/eal/x86/include -I../lib/eal/x86/include -Ilib/eal/common -I../lib/eal/common -Ilib/eal -I../lib/eal -Ilib/kvargs -I../lib/kvargs -Ilib/metrics -I../lib/metrics -Ilib/telemetry -I../lib/telemetry -Ilib/mempool -I../lib/mempool -Ilib/ring -I../lib/ring -Ilib/net -I../lib/net -Ilib/mbuf -I../lib/mbuf -Ilib/ethdev -I../lib/ethdev -Ilib/meter -I../lib/meter -Ilib/cmdline -I../lib/cmdline -Ilib/security -I../lib/security -Ilib/cryptodev -I../lib/cryptodev -Ilib/rcu -I../lib/rcu -Ilib/lpm -I../lib/lpm -Ilib/hash -I../lib/hash -Ilib/acl -I../lib/acl -Ilib/ip_frag -I../lib/ip_frag -Ilib/ipsec -I../lib/ipsec -Ilib/eventdev -I../lib/eventdev -Ilib/timer -I../lib/timer -fdiagnostics-color=always -pipe -D_FILE_OFFSET_BITS=64 -Wall -Winvalid-pch -Werror -O3 -include rte_config.h -Wextra -Wcast-qual -Wdeprecated -Wformat -Wformat-nonliteral -Wformat-security -Wmissing-declarations -Wmissing-prototypes -Wnested-externs -Wold-style-definition -Wpointer-arith -Wsign-compare -Wstrict-prototypes -Wundef -Wwrite-strings -Wno-address-of-packed-member -Wno-packed-not-aligned -Wno-missing-field-initializers -Wno-zero-length-bounds -Wno-pointer-to-int-cast -D_GNU_SOURCE -m32 -march=native -Wno-format-truncation -DALLOW_EXPERIMENTAL_API -MD -MQ examples/dpdk-ipsec-secgw.p/ipsec-secgw_event_helper.c.o -MF examples/dpdk-ipsec-secgw.p/ipsec-secgw_event_helper.c.o.d -o examples/dpdk-ipsec-secgw.p/ipsec-secgw_event_helper.c.o -c ../examples/ipsec-secgw/event_helper.c
../examples/ipsec-secgw/event_helper.c: In function ‘eh_rx_adapter_configure’:
../examples/ipsec-secgw/event_helper.c:845:14: error: ‘struct rte_event_eth_rx_adapter_queue_conf’ has no member named ‘vector_sz’
  845 |    queue_conf.vector_sz = em_conf->ext_params.vector_size;
      |              ^
../examples/ipsec-secgw/event_helper.c:846:14: error: ‘struct rte_event_eth_rx_adapter_queue_conf’ has no member named ‘vector_timeout_ns’
  846 |    queue_conf.vector_timeout_ns = em_conf->vector_tmo_ns;
      |              ^
../examples/ipsec-secgw/event_helper.c:847:14: error: ‘struct rte_event_eth_rx_adapter_queue_conf’ has no member named ‘vector_mp’
  847 |    queue_conf.vector_mp = vector_pool;
      |              ^
[2315/2438] Compiling C object examples/dpdk-ip_reassembly.p/ip_reassembly_main.c.o
[2316/2438] Compiling C object examples/dpdk-ipsec-secgw.p/ipsec-secgw_esp.c.o
[2317/2438] Compiling C object examples/dpdk-ipsec-secgw.p/ipsec-secgw_flow.c.o
[2318/2438] Compiling C object examples/dpdk-ip_pipeline.p/ip_pipeline_thread.c.o
[2319/2438] Compiling C object examples/dpdk-ipsec-secgw.p/ipsec-secgw_ipsec.c.o
[2320/2438] Compiling C object examples/dpdk-ip_pipeline.p/ip_pipeline_cli.c.o
[2321/2438] Compiling C object app/test/dpdk-test.p/test_ring_perf.c.o
[2322/2438] Compiling C object examples/dpdk-ipsec-secgw.p/ipsec-secgw_ipsec-secgw.c.o
[2323/2438] Compiling C object app/test/dpdk-test.p/test_ring.c.o
ninja: build stopped




*Build Failed #10:
OS: UB2004-64
Target: x86_64-native-linuxapp-clang
FAILED: examples/dpdk-ipsec-secgw.p/ipsec-secgw_event_helper.c.o 
clang -Iexamples/dpdk-ipsec-secgw.p -Iexamples -I../examples -Iexamples/ipsec-secgw -I../examples/ipsec-secgw -I. -I.. -Iconfig -I../config -Ilib/eal/include -I../lib/eal/include -Ilib/eal/linux/include -I../lib/eal/linux/include -Ilib/eal/x86/include -I../lib/eal/x86/include -Ilib/eal/common -I../lib/eal/common -Ilib/eal -I../lib/eal -Ilib/kvargs -I../lib/kvargs -Ilib/metrics -I../lib/metrics -Ilib/telemetry -I../lib/telemetry -Ilib/mempool -I../lib/mempool -Ilib/ring -I../lib/ring -Ilib/net -I../lib/net -Ilib/mbuf -I../lib/mbuf -Ilib/ethdev -I../lib/ethdev -Ilib/meter -I../lib/meter -Ilib/cmdline -I../lib/cmdline -Ilib/security -I../lib/security -Ilib/cryptodev -I../lib/cryptodev -Ilib/rcu -I../lib/rcu -Ilib/lpm -I../lib/lpm -Ilib/hash -I../lib/hash -Ilib/acl -I../lib/acl -Ilib/ip_frag -I../lib/ip_frag -Ilib/ipsec -I../lib/ipsec -Ilib/eventdev -I../lib/eventdev -Ilib/timer -I../lib/timer -Xclang -fcolor-diagnostics -pipe -D_FILE_OFFSET_BITS=64 -Wall -Winvalid-pch -Werror -O3 -include rte_config.h -Wextra -Wcast-qual -Wdeprecated -Wformat -Wformat-nonliteral -Wformat-security -Wmissing-declarations -Wmissing-prototypes -Wnested-externs -Wold-style-definition -Wpointer-arith -Wsign-compare -Wstrict-prototypes -Wundef -Wwrite-strings -Wno-address-of-packed-member -Wno-missing-field-initializers -D_GNU_SOURCE -march=native -DALLOW_EXPERIMENTAL_API -MD -MQ examples/dpdk-ipsec-secgw.p/ipsec-secgw_event_helper.c.o -MF examples/dpdk-ipsec-secgw.p/ipsec-secgw_event_helper.c.o.d -o examples/dpdk-ipsec-secgw.p/ipsec-secgw_event_helper.c.o -c ../examples/ipsec-secgw/event_helper.c
../examples/ipsec-secgw/event_helper.c:845:15: error: no member named 'vector_sz' in 'struct rte_event_eth_rx_adapter_queue_conf'
                        queue_conf.vector_sz = em_conf->ext_params.vector_size;
                        ~~~~~~~~~~ ^
../examples/ipsec-secgw/event_helper.c:846:15: error: no member named 'vector_timeout_ns' in 'struct rte_event_eth_rx_adapter_queue_conf'
                        queue_conf.vector_timeout_ns = em_conf->vector_tmo_ns;
                        ~~~~~~~~~~ ^
../examples/ipsec-secgw/event_helper.c:847:15: error: no member named 'vector_mp' in 'struct rte_event_eth_rx_adapter_queue_conf'
                        queue_conf.vector_mp = vector_pool;
                        ~~~~~~~~~~ ^
3 errors generated.
[2887/3064] Compiling C object examples/dpdk-ip_reassembly.p/ip_reassembly_main.c.o
[2888/3064] Compiling C object examples/dpdk-ipsec-secgw.p/ipsec-secgw_flow.c.o
[2889/3064] Compiling C object examples/dpdk-ip_pipeline.p/ip_pipeline_cli.c.o
[2890/3064] Compiling C object examples/dpdk-ipsec-secgw.p/ipsec-secgw_esp.c.o
[2891/3064] Compiling C object examples/dpdk-ipsec-secgw.p/ipsec-secgw_sa.c.o
[2892/3064] Compiling C object app/test/dpdk-test.p/test_ring.c.o
[2893/3064] Compiling C object drivers/libtmp_rte_event_octeontx2.a.p/event_octeontx2_otx2_worker.c.o
[2894/3064] Compiling C object drivers/libtmp_rte_event_octeontx2.a.p/event_octeontx2_otx2_worker_dual.c.o
[2895/3064] Compiling C object app/test/dpdk-test.p/test_ring_perf.c.o
ninja: build stopped




*Build Failed #11:
OS: UB2004-64
Target: x86_64-native-linuxapp-gcc
FAILED: examples/dpdk-ipsec-secgw.p/ipsec-secgw_event_helper.c.o 
gcc -Iexamples/dpdk-ipsec-secgw.p -Iexamples -I../examples -Iexamples/ipsec-secgw -I../examples/ipsec-secgw -I. -I.. -Iconfig -I../config -Ilib/eal/include -I../lib/eal/include -Ilib/eal/linux/include -I../lib/eal/linux/include -Ilib/eal/x86/include -I../lib/eal/x86/include -Ilib/eal/common -I../lib/eal/common -Ilib/eal -I../lib/eal -Ilib/kvargs -I../lib/kvargs -Ilib/metrics -I../lib/metrics -Ilib/telemetry -I../lib/telemetry -Ilib/mempool -I../lib/mempool -Ilib/ring -I../lib/ring -Ilib/net -I../lib/net -Ilib/mbuf -I../lib/mbuf -Ilib/ethdev -I../lib/ethdev -Ilib/meter -I../lib/meter -Ilib/cmdline -I../lib/cmdline -Ilib/security -I../lib/security -Ilib/cryptodev -I../lib/cryptodev -Ilib/rcu -I../lib/rcu -Ilib/lpm -I../lib/lpm -Ilib/hash -I../lib/hash -Ilib/acl -I../lib/acl -Ilib/ip_frag -I../lib/ip_frag -Ilib/ipsec -I../lib/ipsec -Ilib/eventdev -I../lib/eventdev -Ilib/timer -I../lib/timer -fdiagnostics-color=always -pipe -D_FILE_OFFSET_BITS=64 -Wall -Winvalid-pch -Werror -O3 -include rte_config.h -Wextra -Wcast-qual -Wdeprecated -Wformat -Wformat-nonliteral -Wformat-security -Wmissing-declarations -Wmissing-prototypes -Wnested-externs -Wold-style-definition -Wpointer-arith -Wsign-compare -Wstrict-prototypes -Wundef -Wwrite-strings -Wno-address-of-packed-member -Wno-packed-not-aligned -Wno-missing-field-initializers -Wno-zero-length-bounds -D_GNU_SOURCE -march=native -Wno-format-truncation -DALLOW_EXPERIMENTAL_API -MD -MQ examples/dpdk-ipsec-secgw.p/ipsec-secgw_event_helper.c.o -MF examples/dpdk-ipsec-secgw.p/ipsec-secgw_event_helper.c.o.d -o examples/dpdk-ipsec-secgw.p/ipsec-secgw_event_helper.c.o -c ../examples/ipsec-secgw/event_helper.c
../examples/ipsec-secgw/event_helper.c: In function ‘eh_rx_adapter_configure’:
../examples/ipsec-secgw/event_helper.c:845:14: error: ‘struct rte_event_eth_rx_adapter_queue_conf’ has no member named ‘vector_sz’
  845 |    queue_conf.vector_sz = em_conf->ext_params.vector_size;
      |              ^
../examples/ipsec-secgw/event_helper.c:846:14: error: ‘struct rte_event_eth_rx_adapter_queue_conf’ has no member named ‘vector_timeout_ns’
  846 |    queue_conf.vector_timeout_ns = em_conf->vector_tmo_ns;
      |              ^
../examples/ipsec-secgw/event_helper.c:847:14: error: ‘struct rte_event_eth_rx_adapter_queue_conf’ has no member named ‘vector_mp’
  847 |    queue_conf.vector_mp = vector_pool;
      |              ^
[2887/3064] Compiling C object examples/dpdk-ip_reassembly.p/ip_reassembly_main.c.o
[2888/3064] Compiling C object examples/dpdk-ipsec-secgw.p/ipsec-secgw_parser.c.o
[2889/3064] Compiling C object examples/dpdk-ipsec-secgw.p/ipsec-secgw_ipsec.c.o
[2890/3064] Compiling C object examples/dpdk-ip_pipeline.p/ip_pipeline_thread.c.o
[2891/3064] Compiling C object examples/dpdk-ipsec-secgw.p/ipsec-secgw_rt.c.o
[2892/3064] Compiling C object examples/dpdk-ipsec-secgw.p/ipsec-secgw_esp.c.o
[2893/3064] Compiling C object app/test/dpdk-test.p/test_ring.c.o
[2894/3064] Compiling C object drivers/libtmp_rte_event_octeontx2.a.p/event_octeontx2_otx2_worker.c.o
[2895/3064] Compiling C object drivers/libtmp_rte_event_octeontx2.a.p/event_octeontx2_otx2_worker_dual.c.o
ninja: build stopped




*Build Failed #12:
OS: UB2004-64
Target: x86_64-native-linuxapp-icc
FAILED: examples/dpdk-ipsec-secgw.p/ipsec-secgw_event_helper.c.o 
icc -Iexamples/dpdk-ipsec-secgw.p -Iexamples -I../examples -Iexamples/ipsec-secgw -I../examples/ipsec-secgw -I. -I.. -Iconfig -I../config -Ilib/eal/include -I../lib/eal/include -Ilib/eal/linux/include -I../lib/eal/linux/include -Ilib/eal/x86/include -I../lib/eal/x86/include -Ilib/eal/common -I../lib/eal/common -Ilib/eal -I../lib/eal -Ilib/kvargs -I../lib/kvargs -Ilib/metrics -I../lib/metrics -Ilib/telemetry -I../lib/telemetry -Ilib/mempool -I../lib/mempool -Ilib/ring -I../lib/ring -Ilib/net -I../lib/net -Ilib/mbuf -I../lib/mbuf -Ilib/ethdev -I../lib/ethdev -Ilib/meter -I../lib/meter -Ilib/cmdline -I../lib/cmdline -Ilib/security -I../lib/security -Ilib/cryptodev -I../lib/cryptodev -Ilib/rcu -I../lib/rcu -Ilib/lpm -I../lib/lpm -Ilib/hash -I../lib/hash -Ilib/acl -I../lib/acl -Ilib/ip_frag -I../lib/ip_frag -Ilib/ipsec -I../lib/ipsec -Ilib/eventdev -I../lib/eventdev -Ilib/timer -I../lib/timer -pipe -D_FILE_OFFSET_BITS=64 -Wall -w3 -diag-disable:remark -Werror -O3 -include rte_config.h -Wextra -Wcast-qual -Wdeprecated -Wformat -Wformat-security -Wmissing-declarations -Wmissing-prototypes -Wold-style-definition -Wpointer-arith -Wsign-compare -Wstrict-prototypes -Wundef -Wwrite-strings -Wno-missing-field-initializers -diag-disable=181 -diag-disable=188 -diag-disable=2203 -diag-disable=2279 -diag-disable=2557 -diag-disable=3179 -diag-disable=3656 -D_GNU_SOURCE -march=native -DALLOW_EXPERIMENTAL_API -MD -MQ examples/dpdk-ipsec-secgw.p/ipsec-secgw_event_helper.c.o -MF examples/dpdk-ipsec-secgw.p/ipsec-secgw_event_helper.c.o.d -o examples/dpdk-ipsec-secgw.p/ipsec-secgw_event_helper.c.o -c ../examples/ipsec-secgw/event_helper.c
../examples/ipsec-secgw/event_helper.c(845): error: struct "rte_event_eth_rx_adapter_queue_conf" has no field "vector_sz"
  			queue_conf.vector_sz = em_conf->ext_params.vector_size;
  			           ^

../examples/ipsec-secgw/event_helper.c(846): error: struct "rte_event_eth_rx_adapter_queue_conf" has no field "vector_timeout_ns"
  			queue_conf.vector_timeout_ns = em_conf->vector_tmo_ns;
  			           ^

../examples/ipsec-secgw/event_helper.c(847): error: struct "rte_event_eth_rx_adapter_queue_conf" has no field "vector_mp"
  			queue_conf.vector_mp = vector_pool;
  			           ^

compilation aborted for ../examples/ipsec-secgw/event_helper.c (code 2)
[2836/3015] Compiling C object examples/dpdk-ip_pipeline.p/ip_pipeline_cli.c.o
[2837/3015] Compiling C object examples/dpdk-ipsec-secgw.p/ipsec-secgw_parser.c.o
[2838/3015] Compiling C object examples/dpdk-ip_pipeline.p/ip_pipeline_thread.c.o
[2839/3015] Compiling C object examples/dpdk-ipsec-secgw.p/ipsec-secgw_ipsec_process.c.o
[2840/3015] Compiling C object examples/dpdk-ipsec-secgw.p/ipsec-secgw_ipsec.c.o
[2841/3015] Compiling C object app/test/dpdk-test.p/test_cryptodev.c.o
[2842/3015] Compiling C object app/test/dpdk-test.p/test_ring.c.o
[2843/3015] Compiling C object app/test/dpdk-test.p/test_ring_perf.c.o
[2844/3015] Compiling C object app/test/dpdk-test.p/test_memcpy_perf.c.o
[2845/3015] Compiling C object drivers/libtmp_rte_event_octeontx2.a.p/event_octeontx2_otx2_worker.c.o
[2846/3015] Compiling C object drivers/libtmp_rte_event_octeontx2.a.p/event_octeontx2_otx2_worker_dual.c.o
ninja: build stopped




*Build Failed #13:
OS: UB2104-64
Target: x86_64-native-linuxapp-gcc
FAILED: examples/dpdk-ipsec-secgw.p/ipsec-secgw_ipsec_worker.c.o 
gcc -Iexamples/dpdk-ipsec-secgw.p -Iexamples -I../examples -Iexamples/ipsec-secgw -I../examples/ipsec-secgw -I. -I.. -Iconfig -I../config -Ilib/eal/include -I../lib/eal/include -Ilib/eal/linux/include -I../lib/eal/linux/include -Ilib/eal/x86/include -I../lib/eal/x86/include -Ilib/eal/common -I../lib/eal/common -Ilib/eal -I../lib/eal -Ilib/kvargs -I../lib/kvargs -Ilib/metrics -I../lib/metrics -Ilib/telemetry -I../lib/telemetry -Ilib/mempool -I../lib/mempool -Ilib/ring -I../lib/ring -Ilib/net -I../lib/net -Ilib/mbuf -I../lib/mbuf -Ilib/ethdev -I../lib/ethdev -Ilib/meter -I../lib/meter -Ilib/cmdline -I../lib/cmdline -Ilib/security -I../lib/security -Ilib/cryptodev -I../lib/cryptodev -Ilib/rcu -I../lib/rcu -Ilib/lpm -I../lib/lpm -Ilib/hash -I../lib/hash -Ilib/acl -I../lib/acl -Ilib/ip_frag -I../lib/ip_frag -Ilib/ipsec -I../lib/ipsec -Ilib/eventdev -I../lib/eventdev -Ilib/timer -I../lib/timer -fdiagnostics-color=always -pipe -D_FILE_OFFSET_BITS=64 -Wall -Winvalid-pch -Werror -O3 -include rte_config.h -Wextra -Wcast-qual -Wdeprecated -Wformat -Wformat-nonliteral -Wformat-security -Wmissing-declarations -Wmissing-prototypes -Wnested-externs -Wold-style-definition -Wpointer-arith -Wsign-compare -Wstrict-prototypes -Wundef -Wwrite-strings -Wno-address-of-packed-member -Wno-packed-not-aligned -Wno-missing-field-initializers -Wno-zero-length-bounds -D_GNU_SOURCE -march=native -Wno-format-truncation -DALLOW_EXPERIMENTAL_API -MD -MQ examples/dpdk-ipsec-secgw.p/ipsec-secgw_ipsec_worker.c.o -MF examples/dpdk-ipsec-secgw.p/ipsec-secgw_ipsec_worker.c.o.d -o examples/dpdk-ipsec-secgw.p/ipsec-secgw_ipsec_worker.c.o -c ../examples/ipsec-secgw/ipsec_worker.c
../examples/ipsec-secgw/ipsec_worker.c:632:15: error: ‘struct port_drv_mode_data’ declared inside parameter list will not be visible outside of this definition or declaration [-Werror]
  632 |        struct port_drv_mode_data *data)
      |               ^~~~~~~~~~~~~~~~~~
In file included from ../lib/eal/x86/include/rte_spinlock.h:15,
                 from ../lib/eal/x86/include/rte_rwlock.h:13,
                 from ../lib/eal/include/rte_fbarray.h:40,
                 from ../lib/eal/include/rte_memory.h:25,
                 from ../lib/acl/rte_acl_osdep.h:34,
                 from ../lib/acl/rte_acl.h:14,
                 from ../examples/ipsec-secgw/ipsec_worker.c:5:
../examples/ipsec-secgw/ipsec_worker.c: In function ‘process_ipsec_ev_drv_mode_outbound_vector’:
../examples/ipsec-secgw/ipsec_worker.c:643:21: error: invalid use of undefined type ‘struct port_drv_mode_data’
  643 |   if (unlikely(!data[port_id].sess)) {
      |                     ^
../lib/eal/include/rte_branch_prediction.h:38:41: note: in definition of macro ‘unlikely’
   38 | #define unlikely(x) __builtin_expect(!!(x), 0)
      |                                         ^
../examples/ipsec-secgw/ipsec_worker.c:643:30: error: invalid use of undefined type ‘struct port_drv_mode_data’
  643 |   if (unlikely(!data[port_id].sess)) {
      |                              ^
../lib/eal/include/rte_branch_prediction.h:38:41: note: in definition of macro ‘unlikely’
   38 | #define unlikely(x) __builtin_expect(!!(x), 0)
      |                                         ^
../examples/ipsec-secgw/ipsec_worker.c:649:37: error: invalid use of undefined type ‘struct port_drv_mode_data’
  649 |   rte_security_set_pkt_metadata(data[port_id].ctx,
      |                                     ^
../examples/ipsec-secgw/ipsec_worker.c:649:46: error: invalid use of undefined type ‘struct port_drv_mode_data’
  649 |   rte_security_set_pkt_metadata(data[port_id].ctx,
      |                                              ^
../examples/ipsec-secgw/ipsec_worker.c:650:16: error: invalid use of undefined type ‘struct port_drv_mode_data’
  650 |            data[port_id].sess, pkt,
      |                ^
../examples/ipsec-secgw/ipsec_worker.c:650:25: error: invalid use of undefined type ‘struct port_drv_mode_data’
  650 |            data[port_id].sess, pkt,
      |                         ^
../examples/ipsec-secgw/ipsec_worker.c: At top level:
../examples/ipsec-secgw/ipsec_worker.c:695:13: error: ‘struct port_drv_mode_data’ declared inside parameter list will not be visible outside of this definition or declaration [-Werror]
  695 |      struct port_drv_mode_data *data)
      |             ^~~~~~~~~~~~~~~~~~
../examples/ipsec-secgw/ipsec_worker.c: In function ‘ipsec_ev_vector_drv_mode_process’:
../examples/ipsec-secgw/ipsec_worker.c:704:11: error: passing argument 2 of ‘process_ipsec_ev_drv_mode_outbound_vector’ from incompatible pointer type [-Werror=incompatible-pointer-types]
  704 |           data);
      |           ^~~~
      |           |
      |           struct port_drv_mode_data *
../examples/ipsec-secgw/ipsec_worker.c:632:35: note: expected ‘struct port_drv_mode_data *’ but argument is of type ‘struct port_drv_mode_data *’
  632 |        struct port_drv_mode_data *data)
      |        ~~~~~~~~~~~~~~~~~~~~~~~~~~~^~~~
../examples/ipsec-secgw/ipsec_worker.c: In function ‘ipsec_wrkr_non_burst_int_port_drv_mode’:
../examples/ipsec-secgw/ipsec_worker.c:783:49: error: ‘data’ undeclared (first use in this function)
  783 |    ipsec_ev_vector_drv_mode_process(links, &ev, data);
      |                                                 ^~~~
../examples/ipsec-secgw/ipsec_worker.c:783:49: note: each undeclared identifier is reported only once for each function it appears in
cc1: all warnings being treated as errors
[2903/3078] Compiling C object examples/dpdk-ip_pipeline.p/ip_pipeline_thread.c.o
[2904/3078] Compiling C object examples/dpdk-ipsec-secgw.p/ipsec-secgw_sad.c.o
[2905/3078] Compiling C object examples/dpdk-ipsec-secgw.p/ipsec-secgw_esp.c.o
[2906/3078] Compiling C object examples/dpdk-ipsec-secgw.p/ipsec-secgw_sa.c.o
[2907/3078] Compiling C object examples/dpdk-ip_pipeline.p/ip_pipeline_cli.c.o
[2908/3078] Compiling C object examples/dpdk-ipsec-secgw.p/ipsec-secgw_ipsec-secgw.c.o
[2909/3078] Compiling C object app/test/dpdk-test.p/test_ring.c.o
[2910/3078] Compiling C object drivers/libtmp_rte_event_octeontx2.a.p/event_octeontx2_otx2_worker.c.o
[2911/3078] Compiling C object drivers/libtmp_rte_event_octeontx2.a.p/event_octeontx2_otx2_worker_dual.c.o
ninja: build stopped




*Build Failed #14:
OS: FC34-64
Target: x86_64-native-linuxapp-gcc
FAILED: examples/dpdk-ipsec-secgw.p/ipsec-secgw_event_helper.c.o 
gcc -Iexamples/dpdk-ipsec-secgw.p -Iexamples -I../examples -Iexamples/ipsec-secgw -I../examples/ipsec-secgw -I. -I.. -Iconfig -I../config -Ilib/eal/include -I../lib/eal/include -Ilib/eal/linux/include -I../lib/eal/linux/include -Ilib/eal/x86/include -I../lib/eal/x86/include -Ilib/eal/common -I../lib/eal/common -Ilib/eal -I../lib/eal -Ilib/kvargs -I../lib/kvargs -Ilib/metrics -I../lib/metrics -Ilib/telemetry -I../lib/telemetry -Ilib/mempool -I../lib/mempool -Ilib/ring -I../lib/ring -Ilib/net -I../lib/net -Ilib/mbuf -I../lib/mbuf -Ilib/ethdev -I../lib/ethdev -Ilib/meter -I../lib/meter -Ilib/cmdline -I../lib/cmdline -Ilib/security -I../lib/security -Ilib/cryptodev -I../lib/cryptodev -Ilib/rcu -I../lib/rcu -Ilib/lpm -I../lib/lpm -Ilib/hash -I../lib/hash -Ilib/acl -I../lib/acl -Ilib/ip_frag -I../lib/ip_frag -Ilib/ipsec -I../lib/ipsec -Ilib/eventdev -I../lib/eventdev -Ilib/timer -I../lib/timer -fdiagnostics-color=always -pipe -D_FILE_OFFSET_BITS=64 -Wall -Winvalid-pch -Werror -O3 -include rte_config.h -Wextra -Wcast-qual -Wdeprecated -Wformat -Wformat-nonliteral -Wformat-security -Wmissing-declarations -Wmissing-prototypes -Wnested-externs -Wold-style-definition -Wpointer-arith -Wsign-compare -Wstrict-prototypes -Wundef -Wwrite-strings -Wno-address-of-packed-member -Wno-packed-not-aligned -Wno-missing-field-initializers -Wno-zero-length-bounds -D_GNU_SOURCE -march=native -Wno-format-truncation -DALLOW_EXPERIMENTAL_API -MD -MQ examples/dpdk-ipsec-secgw.p/ipsec-secgw_event_helper.c.o -MF examples/dpdk-ipsec-secgw.p/ipsec-secgw_event_helper.c.o.d -o examples/dpdk-ipsec-secgw.p/ipsec-secgw_event_helper.c.o -c ../examples/ipsec-secgw/event_helper.c
../examples/ipsec-secgw/event_helper.c: In function ‘eh_rx_adapter_configure’:
../examples/ipsec-secgw/event_helper.c:845:35: error: ‘struct rte_event_eth_rx_adapter_queue_conf’ has no member named ‘vector_sz’
  845 |                         queue_conf.vector_sz = em_conf->ext_params.vector_size;
      |                                   ^
../examples/ipsec-secgw/event_helper.c:846:35: error: ‘struct rte_event_eth_rx_adapter_queue_conf’ has no member named ‘vector_timeout_ns’
  846 |                         queue_conf.vector_timeout_ns = em_conf->vector_tmo_ns;
      |                                   ^
../examples/ipsec-secgw/event_helper.c:847:35: error: ‘struct rte_event_eth_rx_adapter_queue_conf’ has no member named ‘vector_mp’
  847 |                         queue_conf.vector_mp = vector_pool;
      |                                   ^
[2872/3043] Compiling C object examples/dpdk-ipsec-secgw.p/ipsec-secgw_ipsec_process.c.o
[2873/3043] Compiling C object examples/dpdk-ipsec-secgw.p/ipsec-secgw_flow.c.o
[2874/3043] Compiling C object examples/dpdk-ipsec-secgw.p/ipsec-secgw_ipsec_worker.c.o
FAILED: examples/dpdk-ipsec-secgw.p/ipsec-secgw_ipsec_worker.c.o 
gcc -Iexamples/dpdk-ipsec-secgw.p -Iexamples -I../examples -Iexamples/ipsec-secgw -I../examples/ipsec-secgw -I. -I.. -Iconfig -I../config -Ilib/eal/include -I../lib/eal/include -Ilib/eal/linux/include -I../lib/eal/linux/include -Ilib/eal/x86/include -I../lib/eal/x86/include -Ilib/eal/common -I../lib/eal/common -Ilib/eal -I../lib/eal -Ilib/kvargs -I../lib/kvargs -Ilib/metrics -I../lib/metrics -Ilib/telemetry -I../lib/telemetry -Ilib/mempool -I../lib/mempool -Ilib/ring -I../lib/ring -Ilib/net -I../lib/net -Ilib/mbuf -I../lib/mbuf -Ilib/ethdev -I../lib/ethdev -Ilib/meter -I../lib/meter -Ilib/cmdline -I../lib/cmdline -Ilib/security -I../lib/security -Ilib/cryptodev -I../lib/cryptodev -Ilib/rcu -I../lib/rcu -Ilib/lpm -I../lib/lpm -Ilib/hash -I../lib/hash -Ilib/acl -I../lib/acl -Ilib/ip_frag -I../lib/ip_frag -Ilib/ipsec -I../lib/ipsec -Ilib/eventdev -I../lib/eventdev -Ilib/timer -I../lib/timer -fdiagnostics-color=always -pipe -D_FILE_OFFSET_BITS=64 -Wall -Winvalid-pch -Werror -O3 -include rte_config.h -Wextra -Wcast-qual -Wdeprecated -Wformat -Wformat-nonliteral -Wformat-security -Wmissing-declarations -Wmissing-prototypes -Wnested-externs -Wold-style-definition -Wpointer-arith -Wsign-compare -Wstrict-prototypes -Wundef -Wwrite-strings -Wno-address-of-packed-member -Wno-packed-not-aligned -Wno-missing-field-initializers -Wno-zero-length-bounds -D_GNU_SOURCE -march=native -Wno-format-truncation -DALLOW_EXPERIMENTAL_API -MD -MQ examples/dpdk-ipsec-secgw.p/ipsec-secgw_ipsec_worker.c.o -MF examples/dpdk-ipsec-secgw.p/ipsec-secgw_ipsec_worker.c.o.d -o examples/dpdk-ipsec-secgw.p/ipsec-secgw_ipsec_worker.c.o -c ../examples/ipsec-secgw/ipsec_worker.c
../examples/ipsec-secgw/ipsec_worker.c:632:50: error: ‘struct port_drv_mode_data’ declared inside parameter list will not be visible outside of this definition or declaration [-Werror]
  632 |                                           struct port_drv_mode_data *data)
      |                                                  ^~~~~~~~~~~~~~~~~~
In file included from ../lib/eal/x86/include/rte_spinlock.h:15,
                 from ../lib/eal/x86/include/rte_rwlock.h:13,
                 from ../lib/eal/include/rte_fbarray.h:40,
                 from ../lib/eal/include/rte_memory.h:25,
                 from ../lib/acl/rte_acl_osdep.h:34,
                 from ../lib/acl/rte_acl.h:14,
                 from ../examples/ipsec-secgw/ipsec_worker.c:5:
../examples/ipsec-secgw/ipsec_worker.c: In function ‘process_ipsec_ev_drv_mode_outbound_vector’:
../examples/ipsec-secgw/ipsec_worker.c:643:35: error: invalid use of undefined type ‘struct port_drv_mode_data’
  643 |                 if (unlikely(!data[port_id].sess)) {
      |                                   ^
../lib/eal/include/rte_branch_prediction.h:38:45: note: in definition of macro ‘unlikely’
   38 | #define unlikely(x)     __builtin_expect(!!(x), 0)
      |                                             ^
../examples/ipsec-secgw/ipsec_worker.c:643:44: error: invalid use of undefined type ‘struct port_drv_mode_data’
  643 |                 if (unlikely(!data[port_id].sess)) {
      |                                            ^
../lib/eal/include/rte_branch_prediction.h:38:45: note: in definition of macro ‘unlikely’
   38 | #define unlikely(x)     __builtin_expect(!!(x), 0)
      |                                             ^
../examples/ipsec-secgw/ipsec_worker.c:649:51: error: invalid use of undefined type ‘struct port_drv_mode_data’
  649 |                 rte_security_set_pkt_metadata(data[port_id].ctx,
      |                                                   ^
../examples/ipsec-secgw/ipsec_worker.c:649:60: error: invalid use of undefined type ‘struct port_drv_mode_data’
  649 |                 rte_security_set_pkt_metadata(data[port_id].ctx,
      |                                                            ^
../examples/ipsec-secgw/ipsec_worker.c:650:51: error: invalid use of undefined type ‘struct port_drv_mode_data’
  650 |                                               data[port_id].sess, pkt,
      |                                                   ^
../examples/ipsec-secgw/ipsec_worker.c:650:60: error: invalid use of undefined type ‘struct port_drv_mode_data’
  650 |                                               data[port_id].sess, pkt,
      |                                                            ^
../examples/ipsec-secgw/ipsec_worker.c: At top level:
../examples/ipsec-secgw/ipsec_worker.c:695:41: error: ‘struct port_drv_mode_data’ declared inside parameter list will not be visible outside of this definition or declaration [-Werror]
  695 |                                  struct port_drv_mode_data *data)
      |                                         ^~~~~~~~~~~~~~~~~~
../examples/ipsec-secgw/ipsec_worker.c: In function ‘ipsec_ev_vector_drv_mode_process’:
../examples/ipsec-secgw/ipsec_worker.c:704:74: error: passing argument 2 of ‘process_ipsec_ev_drv_mode_outbound_vector’ from incompatible pointer type [-Werror=incompatible-pointer-types]
  704 |                                                                          data);
      |                                                                          ^~~~
      |                                                                          |
      |                                                                          struct port_drv_mode_data *
../examples/ipsec-secgw/ipsec_worker.c:632:70: note: expected ‘struct port_drv_mode_data *’ but argument is of type ‘struct port_drv_mode_data *’
  632 |                                           struct port_drv_mode_data *data)
      |                                           ~~~~~~~~~~~~~~~~~~~~~~~~~~~^~~~
../examples/ipsec-secgw/ipsec_worker.c: In function ‘ipsec_wrkr_non_burst_int_port_drv_mode’:
../examples/ipsec-secgw/ipsec_worker.c:783:70: error: ‘data’ undeclared (first use in this function)
  783 |                         ipsec_ev_vector_drv_mode_process(links, &ev, data);
      |                                                                      ^~~~
../examples/ipsec-secgw/ipsec_worker.c:783:70: note: each undeclared identifier is reported only once for each function it appears in
cc1: all warnings being treated as errors
[2875/3043] Compiling C object examples/dpdk-ipsec-secgw.p/ipsec-secgw_sa.c.o
[2876/3043] Compiling C object examples/dpdk-ip_pipeline.p/ip_pipeline_cli.c.o
[2877/3043] Compiling C object examples/dpdk-ipsec-secgw.p/ipsec-secgw_ipsec.c.o
[2878/3043] Compiling C object examples/dpdk-ipsec-secgw.p/ipsec-secgw_esp.c.o
[2879/3043] Compiling C object examples/dpdk-ipsec-secgw.p/ipsec-secgw_ipsec-secgw.c.o
[2880/3043] Compiling C object app/test/dpdk-test.p/test_ring.c.o
[2881/3043] Compiling C object drivers/libtmp_rte_event_octeontx2.a.p/event_octeontx2_otx2_worker.c.o
[2882/3043] Compiling C object drivers/libtmp_rte_event_octeontx2.a.p/event_octeontx2_otx2_worker_dual.c.o
ninja: build stopped




*Build Failed #15:
OS: FC34-64
Target: x86_64-native-linuxapp-clang
FAILED: examples/dpdk-ipsec-secgw.p/ipsec-secgw_event_helper.c.o 
clang -Iexamples/dpdk-ipsec-secgw.p -Iexamples -I../examples -Iexamples/ipsec-secgw -I../examples/ipsec-secgw -I. -I.. -Iconfig -I../config -Ilib/eal/include -I../lib/eal/include -Ilib/eal/linux/include -I../lib/eal/linux/include -Ilib/eal/x86/include -I../lib/eal/x86/include -Ilib/eal/common -I../lib/eal/common -Ilib/eal -I../lib/eal -Ilib/kvargs -I../lib/kvargs -Ilib/metrics -I../lib/metrics -Ilib/telemetry -I../lib/telemetry -Ilib/mempool -I../lib/mempool -Ilib/ring -I../lib/ring -Ilib/net -I../lib/net -Ilib/mbuf -I../lib/mbuf -Ilib/ethdev -I../lib/ethdev -Ilib/meter -I../lib/meter -Ilib/cmdline -I../lib/cmdline -Ilib/security -I../lib/security -Ilib/cryptodev -I../lib/cryptodev -Ilib/rcu -I../lib/rcu -Ilib/lpm -I../lib/lpm -Ilib/hash -I../lib/hash -Ilib/acl -I../lib/acl -Ilib/ip_frag -I../lib/ip_frag -Ilib/ipsec -I../lib/ipsec -Ilib/eventdev -I../lib/eventdev -Ilib/timer -I../lib/timer -Xclang -fcolor-diagnostics -pipe -D_FILE_OFFSET_BITS=64 -Wall -Winvalid-pch -Werror -O3 -include rte_config.h -Wextra -Wcast-qual -Wdeprecated -Wformat -Wformat-nonliteral -Wformat-security -Wmissing-declarations -Wmissing-prototypes -Wnested-externs -Wold-style-definition -Wpointer-arith -Wsign-compare -Wstrict-prototypes -Wundef -Wwrite-strings -Wno-address-of-packed-member -Wno-missing-field-initializers -D_GNU_SOURCE -march=native -DALLOW_EXPERIMENTAL_API -MD -MQ examples/dpdk-ipsec-secgw.p/ipsec-secgw_event_helper.c.o -MF examples/dpdk-ipsec-secgw.p/ipsec-secgw_event_helper.c.o.d -o examples/dpdk-ipsec-secgw.p/ipsec-secgw_event_helper.c.o -c ../examples/ipsec-secgw/event_helper.c
../examples/ipsec-secgw/event_helper.c:845:15: error: no member named 'vector_sz' in 'struct rte_event_eth_rx_adapter_queue_conf'
                        queue_conf.vector_sz = em_conf->ext_params.vector_size;
                        ~~~~~~~~~~ ^
../examples/ipsec-secgw/event_helper.c:846:15: error: no member named 'vector_timeout_ns' in 'struct rte_event_eth_rx_adapter_queue_conf'
                        queue_conf.vector_timeout_ns = em_conf->vector_tmo_ns;
                        ~~~~~~~~~~ ^
../examples/ipsec-secgw/event_helper.c:847:15: error: no member named 'vector_mp' in 'struct rte_event_eth_rx_adapter_queue_conf'
                        queue_conf.vector_mp = vector_pool;
                        ~~~~~~~~~~ ^
3 errors generated.
[2867/3043] Compiling C object examples/dpdk-ipsec-secgw.p/ipsec-secgw_sad.c.o
[2868/3043] Compiling C object examples/dpdk-ip_reassembly.p/ip_reassembly_main.c.o
[2869/3043] Compiling C object examples/dpdk-ipsec-secgw.p/ipsec-secgw_esp.c.o
[2870/3043] Compiling C object examples/dpdk-ip_pipeline.p/ip_pipeline_thread.c.o
[2871/3043] Compiling C object examples/dpdk-ipsec-secgw.p/ipsec-secgw_sa.c.o
[2872/3043] Compiling C object app/test/dpdk-test.p/test_ring.c.o
[2873/3043] Compiling C object app/test/dpdk-test.p/test_ring_perf.c.o
[2874/3043] Compiling C object drivers/libtmp_rte_event_octeontx2.a.p/event_octeontx2_otx2_worker.c.o
[2875/3043] Compiling C object drivers/libtmp_rte_event_octeontx2.a.p/event_octeontx2_otx2_worker_dual.c.o
ninja: build stopped




*Build Failed #16:
OS: RHEL83-64
Target: x86_64-native-linuxapp-clang
FAILED: examples/c590b3c@@dpdk-ipsec-secgw at exe/ipsec-secgw_event_helper.c.o 
clang -Iexamples/c590b3c@@dpdk-ipsec-secgw at exe -Iexamples -I../examples -Iexamples/ipsec-secgw -I../examples/ipsec-secgw -I. -I../ -Iconfig -I../config -Ilib/eal/include -I../lib/eal/include -Ilib/eal/linux/include -I../lib/eal/linux/include -Ilib/eal/x86/include -I../lib/eal/x86/include -Ilib/eal/common -I../lib/eal/common -Ilib/eal -I../lib/eal -Ilib/kvargs -I../lib/kvargs -Ilib/telemetry/../metrics -I../lib/telemetry/../metrics -Ilib/telemetry -I../lib/telemetry -Ilib/mempool -I../lib/mempool -Ilib/ring -I../lib/ring -Ilib/net -I../lib/net -Ilib/mbuf -I../lib/mbuf -Ilib/ethdev -I../lib/ethdev -Ilib/meter -I../lib/meter -Ilib/cmdline -I../lib/cmdline -Ilib/security -I../lib/security -Ilib/cryptodev -I../lib/cryptodev -Ilib/rcu -I../lib/rcu -Ilib/lpm -I../lib/lpm -Ilib/hash -I../lib/hash -Ilib/acl -I../lib/acl -Ilib/ip_frag -I../lib/ip_frag -Ilib/ipsec -I../lib/ipsec -Ilib/eventdev -I../lib/eventdev -Ilib/timer -I../lib/timer -Xclang -fcolor-diagnostics -pipe -D_FILE_OFFSET_BITS=64 -Wall -Winvalid-pch -Werror -O3 -include rte_config.h -Wextra -Wcast-qual -Wdeprecated -Wformat -Wformat-nonliteral -Wformat-security -Wmissing-declarations -Wmissing-prototypes -Wnested-externs -Wold-style-definition -Wpointer-arith -Wsign-compare -Wstrict-prototypes -Wundef -Wwrite-strings -Wno-address-of-packed-member -Wno-missing-field-initializers -D_GNU_SOURCE -march=native -DALLOW_EXPERIMENTAL_API -MD -MQ 'examples/c590b3c@@dpdk-ipsec-secgw at exe/ipsec-secgw_event_helper.c.o' -MF 'examples/c590b3c@@dpdk-ipsec-secgw at exe/ipsec-secgw_event_helper.c.o.d' -o 'examples/c590b3c@@dpdk-ipsec-secgw at exe/ipsec-secgw_event_helper.c.o' -c ../examples/ipsec-secgw/event_helper.c
../examples/ipsec-secgw/event_helper.c:845:15: error: no member named 'vector_sz' in 'struct rte_event_eth_rx_adapter_queue_conf'
                        queue_conf.vector_sz = em_conf->ext_params.vector_size;
                        ~~~~~~~~~~ ^
../examples/ipsec-secgw/event_helper.c:846:15: error: no member named 'vector_timeout_ns' in 'struct rte_event_eth_rx_adapter_queue_conf'
                        queue_conf.vector_timeout_ns = em_conf->vector_tmo_ns;
                        ~~~~~~~~~~ ^
../examples/ipsec-secgw/event_helper.c:847:15: error: no member named 'vector_mp' in 'struct rte_event_eth_rx_adapter_queue_conf'
                        queue_conf.vector_mp = vector_pool;
                        ~~~~~~~~~~ ^
3 errors generated.
[2658/2827] Compiling C object 'examples/c590b3c@@dpdk-ipsec-secgw at exe/ipsec-secgw_parser.c.o'.
[2659/2827] Compiling C object 'examples/c590b3c@@dpdk-ipsec-secgw at exe/ipsec-secgw_ipsec_worker.c.o'.
FAILED: examples/c590b3c@@dpdk-ipsec-secgw at exe/ipsec-secgw_ipsec_worker.c.o 
clang -Iexamples/c590b3c@@dpdk-ipsec-secgw at exe -Iexamples -I../examples -Iexamples/ipsec-secgw -I../examples/ipsec-secgw -I. -I../ -Iconfig -I../config -Ilib/eal/include -I../lib/eal/include -Ilib/eal/linux/include -I../lib/eal/linux/include -Ilib/eal/x86/include -I../lib/eal/x86/include -Ilib/eal/common -I../lib/eal/common -Ilib/eal -I../lib/eal -Ilib/kvargs -I../lib/kvargs -Ilib/telemetry/../metrics -I../lib/telemetry/../metrics -Ilib/telemetry -I../lib/telemetry -Ilib/mempool -I../lib/mempool -Ilib/ring -I../lib/ring -Ilib/net -I../lib/net -Ilib/mbuf -I../lib/mbuf -Ilib/ethdev -I../lib/ethdev -Ilib/meter -I../lib/meter -Ilib/cmdline -I../lib/cmdline -Ilib/security -I../lib/security -Ilib/cryptodev -I../lib/cryptodev -Ilib/rcu -I../lib/rcu -Ilib/lpm -I../lib/lpm -Ilib/hash -I../lib/hash -Ilib/acl -I../lib/acl -Ilib/ip_frag -I../lib/ip_frag -Ilib/ipsec -I../lib/ipsec -Ilib/eventdev -I../lib/eventdev -Ilib/timer -I../lib/timer -Xclang -fcolor-diagnostics -pipe -D_FILE_OFFSET_BITS=64 -Wall -Winvalid-pch -Werror -O3 -include rte_config.h -Wextra -Wcast-qual -Wdeprecated -Wformat -Wformat-nonliteral -Wformat-security -Wmissing-declarations -Wmissing-prototypes -Wnested-externs -Wold-style-definition -Wpointer-arith -Wsign-compare -Wstrict-prototypes -Wundef -Wwrite-strings -Wno-address-of-packed-member -Wno-missing-field-initializers -D_GNU_SOURCE -march=native -DALLOW_EXPERIMENTAL_API -MD -MQ 'examples/c590b3c@@dpdk-ipsec-secgw at exe/ipsec-secgw_ipsec_worker.c.o' -MF 'examples/c590b3c@@dpdk-ipsec-secgw at exe/ipsec-secgw_ipsec_worker.c.o.d' -o 'examples/c590b3c@@dpdk-ipsec-secgw at exe/ipsec-secgw_ipsec_worker.c.o' -c ../examples/ipsec-secgw/ipsec_worker.c
../examples/ipsec-secgw/ipsec_worker.c:632:15: error: declaration of 'struct port_drv_mode_data' will not be visible outside of this function [-Werror,-Wvisibility]
                                          struct port_drv_mode_data *data)
                                                 ^
../examples/ipsec-secgw/ipsec_worker.c:643:21: error: subscript of pointer to incomplete type 'struct port_drv_mode_data'
                if (unlikely(!data[port_id].sess)) {
                              ~~~~^
../lib/eal/include/rte_branch_prediction.h:38:41: note: expanded from macro 'unlikely'
#define unlikely(x)     __builtin_expect(!!(x), 0)
                                            ^
../examples/ipsec-secgw/ipsec_worker.c:632:15: note: forward declaration of 'struct port_drv_mode_data'
                                          struct port_drv_mode_data *data)
                                                 ^
../examples/ipsec-secgw/ipsec_worker.c:649:37: error: subscript of pointer to incomplete type 'struct port_drv_mode_data'
                rte_security_set_pkt_metadata(data[port_id].ctx,
                                              ~~~~^
../examples/ipsec-secgw/ipsec_worker.c:632:15: note: forward declaration of 'struct port_drv_mode_data'
                                          struct port_drv_mode_data *data)
                                                 ^
../examples/ipsec-secgw/ipsec_worker.c:650:16: error: subscript of pointer to incomplete type 'struct port_drv_mode_data'
                                              data[port_id].sess, pkt,
                                              ~~~~^
../examples/ipsec-secgw/ipsec_worker.c:632:15: note: forward declaration of 'struct port_drv_mode_data'
                                          struct port_drv_mode_data *data)
                                                 ^
../examples/ipsec-secgw/ipsec_worker.c:695:13: error: declaration of 'struct port_drv_mode_data' will not be visible outside of this function [-Werror,-Wvisibility]
                                 struct port_drv_mode_data *data)
                                        ^
../examples/ipsec-secgw/ipsec_worker.c:704:11: error: incompatible pointer types passing 'struct port_drv_mode_data *' to parameter of type 'struct port_drv_mode_data *' [-Werror,-Wincompatible-pointer-types]
                                                                         data);
                                                                         ^~~~
../examples/ipsec-secgw/ipsec_worker.c:632:35: note: passing argument to parameter 'data' here
                                          struct port_drv_mode_data *data)
                                                                     ^
../examples/ipsec-secgw/ipsec_worker.c:783:49: error: use of undeclared identifier 'data'
                        ipsec_ev_vector_drv_mode_process(links, &ev, data);
                                                                     ^
7 errors generated.
[2660/2827] Compiling C object 'examples/c590b3c@@dpdk-ipsec-secgw at exe/ipsec-secgw_sad.c.o'.
[2661/2827] Compiling C object 'examples/c590b3c@@dpdk-ipsec-secgw at exe/ipsec-secgw_sp4.c.o'.
[2662/2827] Compiling C object 'examples/c590b3c@@dpdk-ipsec-secgw at exe/ipsec-secgw_sp6.c.o'.
[2663/2827] Compiling C object 'app/test/3062f5d@@dpdk-test at exe/test_ring.c.o'.
[2664/2827] Compiling C object 'drivers/a715181@@tmp_rte_event_octeontx2 at sta/event_octeontx2_otx2_worker.c.o'.
[2665/2827] Compiling C object 'drivers/a715181@@tmp_rte_event_octeontx2 at sta/event_octeontx2_otx2_worker_dual.c.o'.
[2666/2827] Compiling C object 'app/test/3062f5d@@dpdk-test at exe/test_ring_perf.c.o'.
ninja: build stopped




*Build Failed #17:
OS: RHEL83-64
Target: x86_64-native-linuxapp-gcc+debug
FAILED: examples/c590b3c@@dpdk-ipsec-secgw at exe/ipsec-secgw_event_helper.c.o 
gcc -Iexamples/c590b3c@@dpdk-ipsec-secgw at exe -Iexamples -I../examples -Iexamples/ipsec-secgw -I../examples/ipsec-secgw -I. -I../ -Iconfig -I../config -Ilib/eal/include -I../lib/eal/include -Ilib/eal/linux/include -I../lib/eal/linux/include -Ilib/eal/x86/include -I../lib/eal/x86/include -Ilib/eal/common -I../lib/eal/common -Ilib/eal -I../lib/eal -Ilib/kvargs -I../lib/kvargs -Ilib/telemetry/../metrics -I../lib/telemetry/../metrics -Ilib/telemetry -I../lib/telemetry -Ilib/mempool -I../lib/mempool -Ilib/ring -I../lib/ring -Ilib/net -I../lib/net -Ilib/mbuf -I../lib/mbuf -Ilib/ethdev -I../lib/ethdev -Ilib/meter -I../lib/meter -Ilib/cmdline -I../lib/cmdline -Ilib/security -I../lib/security -Ilib/cryptodev -I../lib/cryptodev -Ilib/rcu -I../lib/rcu -Ilib/lpm -I../lib/lpm -Ilib/hash -I../lib/hash -Ilib/acl -I../lib/acl -Ilib/ip_frag -I../lib/ip_frag -Ilib/ipsec -I../lib/ipsec -Ilib/eventdev -I../lib/eventdev -Ilib/timer -I../lib/timer -fdiagnostics-color=always -pipe -D_FILE_OFFSET_BITS=64 -Wall -Winvalid-pch -Werror -O2 -g -include rte_config.h -Wextra -Wcast-qual -Wdeprecated -Wformat -Wformat-nonliteral -Wformat-security -Wmissing-declarations -Wmissing-prototypes -Wnested-externs -Wold-style-definition -Wpointer-arith -Wsign-compare -Wstrict-prototypes -Wundef -Wwrite-strings -Wno-packed-not-aligned -Wno-missing-field-initializers -D_GNU_SOURCE -march=native -Wno-format-truncation -DALLOW_EXPERIMENTAL_API -MD -MQ 'examples/c590b3c@@dpdk-ipsec-secgw at exe/ipsec-secgw_event_helper.c.o' -MF 'examples/c590b3c@@dpdk-ipsec-secgw at exe/ipsec-secgw_event_helper.c.o.d' -o 'examples/c590b3c@@dpdk-ipsec-secgw at exe/ipsec-secgw_event_helper.c.o' -c ../examples/ipsec-secgw/event_helper.c
../examples/ipsec-secgw/event_helper.c: In function ‘eh_rx_adapter_configure’:
../examples/ipsec-secgw/event_helper.c:845:14: error: ‘struct rte_event_eth_rx_adapter_queue_conf’ has no member named ‘vector_sz’
    queue_conf.vector_sz = em_conf->ext_params.vector_size;
              ^
../examples/ipsec-secgw/event_helper.c:846:14: error: ‘struct rte_event_eth_rx_adapter_queue_conf’ has no member named ‘vector_timeout_ns’
    queue_conf.vector_timeout_ns = em_conf->vector_tmo_ns;
              ^
../examples/ipsec-secgw/event_helper.c:847:14: error: ‘struct rte_event_eth_rx_adapter_queue_conf’ has no member named ‘vector_mp’
    queue_conf.vector_mp = vector_pool;
              ^
[2657/2827] Compiling C object 'examples/c590b3c@@dpdk-ipsec-secgw at exe/ipsec-secgw_ipsec_worker.c.o'.
FAILED: examples/c590b3c@@dpdk-ipsec-secgw at exe/ipsec-secgw_ipsec_worker.c.o 
gcc -Iexamples/c590b3c@@dpdk-ipsec-secgw at exe -Iexamples -I../examples -Iexamples/ipsec-secgw -I../examples/ipsec-secgw -I. -I../ -Iconfig -I../config -Ilib/eal/include -I../lib/eal/include -Ilib/eal/linux/include -I../lib/eal/linux/include -Ilib/eal/x86/include -I../lib/eal/x86/include -Ilib/eal/common -I../lib/eal/common -Ilib/eal -I../lib/eal -Ilib/kvargs -I../lib/kvargs -Ilib/telemetry/../metrics -I../lib/telemetry/../metrics -Ilib/telemetry -I../lib/telemetry -Ilib/mempool -I../lib/mempool -Ilib/ring -I../lib/ring -Ilib/net -I../lib/net -Ilib/mbuf -I../lib/mbuf -Ilib/ethdev -I../lib/ethdev -Ilib/meter -I../lib/meter -Ilib/cmdline -I../lib/cmdline -Ilib/security -I../lib/security -Ilib/cryptodev -I../lib/cryptodev -Ilib/rcu -I../lib/rcu -Ilib/lpm -I../lib/lpm -Ilib/hash -I../lib/hash -Ilib/acl -I../lib/acl -Ilib/ip_frag -I../lib/ip_frag -Ilib/ipsec -I../lib/ipsec -Ilib/eventdev -I../lib/eventdev -Ilib/timer -I../lib/timer -fdiagnostics-color=always -pipe -D_FILE_OFFSET_BITS=64 -Wall -Winvalid-pch -Werror -O2 -g -include rte_config.h -Wextra -Wcast-qual -Wdeprecated -Wformat -Wformat-nonliteral -Wformat-security -Wmissing-declarations -Wmissing-prototypes -Wnested-externs -Wold-style-definition -Wpointer-arith -Wsign-compare -Wstrict-prototypes -Wundef -Wwrite-strings -Wno-packed-not-aligned -Wno-missing-field-initializers -D_GNU_SOURCE -march=native -Wno-format-truncation -DALLOW_EXPERIMENTAL_API -MD -MQ 'examples/c590b3c@@dpdk-ipsec-secgw at exe/ipsec-secgw_ipsec_worker.c.o' -MF 'examples/c590b3c@@dpdk-ipsec-secgw at exe/ipsec-secgw_ipsec_worker.c.o.d' -o 'examples/c590b3c@@dpdk-ipsec-secgw at exe/ipsec-secgw_ipsec_worker.c.o' -c ../examples/ipsec-secgw/ipsec_worker.c
../examples/ipsec-secgw/ipsec_worker.c:632:15: error: ‘struct port_drv_mode_data’ declared inside parameter list will not be visible outside of this definition or declaration [-Werror]
        struct port_drv_mode_data *data)
               ^~~~~~~~~~~~~~~~~~
In file included from ../lib/eal/x86/include/rte_spinlock.h:15,
                 from ../lib/eal/x86/include/rte_rwlock.h:13,
                 from ../lib/eal/include/rte_fbarray.h:40,
                 from ../lib/eal/include/rte_memory.h:25,
                 from ../lib/acl/rte_acl_osdep.h:34,
                 from ../lib/acl/rte_acl.h:14,
                 from ../examples/ipsec-secgw/ipsec_worker.c:5:
../examples/ipsec-secgw/ipsec_worker.c: In function ‘process_ipsec_ev_drv_mode_outbound_vector’:
../examples/ipsec-secgw/ipsec_worker.c:643:21: error: invalid use of undefined type ‘struct port_drv_mode_data’
   if (unlikely(!data[port_id].sess)) {
                     ^
../lib/eal/include/rte_branch_prediction.h:38:41: note: in definition of macro ‘unlikely’
 #define unlikely(x) __builtin_expect(!!(x), 0)
                                         ^
../examples/ipsec-secgw/ipsec_worker.c:643:21: error: dereferencing pointer to incomplete type ‘struct port_drv_mode_data’
   if (unlikely(!data[port_id].sess)) {
                     ^
../lib/eal/include/rte_branch_prediction.h:38:41: note: in definition of macro ‘unlikely’
 #define unlikely(x) __builtin_expect(!!(x), 0)
                                         ^
../examples/ipsec-secgw/ipsec_worker.c:649:37: error: invalid use of undefined type ‘struct port_drv_mode_data’
   rte_security_set_pkt_metadata(data[port_id].ctx,
                                     ^
../examples/ipsec-secgw/ipsec_worker.c:650:16: error: invalid use of undefined type ‘struct port_drv_mode_data’
            data[port_id].sess, pkt,
                ^
../examples/ipsec-secgw/ipsec_worker.c: At top level:
../examples/ipsec-secgw/ipsec_worker.c:695:13: error: ‘struct port_drv_mode_data’ declared inside parameter list will not be visible outside of this definition or declaration [-Werror]
      struct port_drv_mode_data *data)
             ^~~~~~~~~~~~~~~~~~
../examples/ipsec-secgw/ipsec_worker.c: In function ‘ipsec_ev_vector_drv_mode_process’:
../examples/ipsec-secgw/ipsec_worker.c:704:11: error: passing argument 2 of ‘process_ipsec_ev_drv_mode_outbound_vector’ from incompatible pointer type [-Werror=incompatible-pointer-types]
           data);
           ^~~~
../examples/ipsec-secgw/ipsec_worker.c:632:35: note: expected ‘struct port_drv_mode_data *’ but argument is of type ‘struct port_drv_mode_data *’
        struct port_drv_mode_data *data)
        ~~~~~~~~~~~~~~~~~~~~~~~~~~~^~~~
../examples/ipsec-secgw/ipsec_worker.c: In function ‘ipsec_wrkr_non_burst_int_port_drv_mode’:
../examples/ipsec-secgw/ipsec_worker.c:783:49: error: ‘data’ undeclared (first use in this function)
    ipsec_ev_vector_drv_mode_process(links, &ev, data);
                                                 ^~~~
../examples/ipsec-secgw/ipsec_worker.c:783:49: note: each undeclared identifier is reported only once for each function it appears in
cc1: all warnings being treated as errors
[2658/2827] Compiling C object 'examples/c590b3c@@dpdk-ip_pipeline at exe/ip_pipeline_tmgr.c.o'.
[2659/2827] Compiling C object 'examples/c590b3c@@dpdk-ipsec-secgw at exe/ipsec-secgw_esp.c.o'.
[2660/2827] Compiling C object 'examples/c590b3c@@dpdk-ipsec-secgw at exe/ipsec-secgw_ipsec-secgw.c.o'.
[2661/2827] Compiling C object 'drivers/a715181@@tmp_rte_event_octeontx2 at sta/event_octeontx2_otx2_worker_dual.c.o'.
ninja: build stopped




*Build Failed #18:
OS: RHEL83-64
Target: x86_64-native-linuxapp-icc
FAILED: examples/dpdk-ipsec-secgw.p/ipsec-secgw_event_helper.c.o 
icc -Iexamples/dpdk-ipsec-secgw.p -Iexamples -I../examples -Iexamples/ipsec-secgw -I../examples/ipsec-secgw -I. -I.. -Iconfig -I../config -Ilib/eal/include -I../lib/eal/include -Ilib/eal/linux/include -I../lib/eal/linux/include -Ilib/eal/x86/include -I../lib/eal/x86/include -Ilib/eal/common -I../lib/eal/common -Ilib/eal -I../lib/eal -Ilib/kvargs -I../lib/kvargs -Ilib/metrics -I../lib/metrics -Ilib/telemetry -I../lib/telemetry -Ilib/mempool -I../lib/mempool -Ilib/ring -I../lib/ring -Ilib/net -I../lib/net -Ilib/mbuf -I../lib/mbuf -Ilib/ethdev -I../lib/ethdev -Ilib/meter -I../lib/meter -Ilib/cmdline -I../lib/cmdline -Ilib/security -I../lib/security -Ilib/cryptodev -I../lib/cryptodev -Ilib/rcu -I../lib/rcu -Ilib/lpm -I../lib/lpm -Ilib/hash -I../lib/hash -Ilib/acl -I../lib/acl -Ilib/ip_frag -I../lib/ip_frag -Ilib/ipsec -I../lib/ipsec -Ilib/eventdev -I../lib/eventdev -Ilib/timer -I../lib/timer -pipe -D_FILE_OFFSET_BITS=64 -Wall -w3 -diag-disable:remark -Werror -O3 -include rte_config.h -Wextra -Wcast-qual -Wdeprecated -Wformat -Wformat-security -Wmissing-declarations -Wmissing-prototypes -Wold-style-definition -Wpointer-arith -Wsign-compare -Wstrict-prototypes -Wundef -Wwrite-strings -Wno-missing-field-initializers -diag-disable=181 -diag-disable=188 -diag-disable=2203 -diag-disable=2279 -diag-disable=2557 -diag-disable=3179 -diag-disable=3656 -D_GNU_SOURCE -march=native -DALLOW_EXPERIMENTAL_API -MD -MQ examples/dpdk-ipsec-secgw.p/ipsec-secgw_event_helper.c.o -MF examples/dpdk-ipsec-secgw.p/ipsec-secgw_event_helper.c.o.d -o examples/dpdk-ipsec-secgw.p/ipsec-secgw_event_helper.c.o -c ../examples/ipsec-secgw/event_helper.c
../examples/ipsec-secgw/event_helper.c(845): error: struct "rte_event_eth_rx_adapter_queue_conf" has no field "vector_sz"
  			queue_conf.vector_sz = em_conf->ext_params.vector_size;
  			           ^

../examples/ipsec-secgw/event_helper.c(846): error: struct "rte_event_eth_rx_adapter_queue_conf" has no field "vector_timeout_ns"
  			queue_conf.vector_timeout_ns = em_conf->vector_tmo_ns;
  			           ^

../examples/ipsec-secgw/event_helper.c(847): error: struct "rte_event_eth_rx_adapter_queue_conf" has no field "vector_mp"
  			queue_conf.vector_mp = vector_pool;
  			           ^

compilation aborted for ../examples/ipsec-secgw/event_helper.c (code 2)
[2898/3078] Compiling C object examples/dpdk-ip_reassembly.p/ip_reassembly_main.c.o
[2899/3078] Compiling C object examples/dpdk-ioat.p/ioat_ioatfwd.c.o
In file included from ../drivers/raw/ioat/rte_ioat_rawdev.h(208),
                 from ../examples/ioat/ioatfwd.c(14):
../drivers/raw/ioat/rte_ioat_rawdev_fns.h(168): warning #300: const variable "null_hdl" requires an initializer
  	static const uintptr_t null_hdl;
  	                               ^

[2900/3078] Compiling C object examples/dpdk-ip_pipeline.p/ip_pipeline_cli.c.o
[2901/3078] Compiling C object examples/dpdk-ip_pipeline.p/ip_pipeline_thread.c.o
[2902/3078] Compiling C object app/test/dpdk-test.p/test_ring.c.o
[2903/3078] Compiling C object app/test/dpdk-test.p/test_ring_perf.c.o
[2904/3078] Compiling C object app/test/dpdk-test.p/test_memcpy_perf.c.o
[2905/3078] Compiling C object drivers/libtmp_rte_event_octeontx2.a.p/event_octeontx2_otx2_worker_dual.c.o
[2906/3078] Compiling C object drivers/libtmp_rte_event_octeontx2.a.p/event_octeontx2_otx2_worker.c.o
ninja: build stopped


DPDK STV team


More information about the test-report mailing list