[dpdk-test-report] |FAILURE| pw99323-99326 [PATCH] [V5, 4/4] examples/pipeline: add learner table example

dpdklab at iol.unh.edu dpdklab at iol.unh.edu
Mon Sep 20 18:25:21 CEST 2021


Test-Label: iol-testing
Test-Status: FAILURE
http://dpdk.org/patch/99323

_build patch failure_

Submitter: Dumitrescu, Cristian <cristian.dumitrescu at intel.com>
Date: Monday, September 20 2021 15:01:33 
Applied on: CommitID:4777674c4428f528fa2890d8afab551f6dd54c24
Apply patch set 99323-99326 failed:

[1/2701] Compiling C object lib/librte_gro.a.p/gro_gro_vxlan_tcp4.c.o
[2/2701] Compiling C object lib/librte_gso.a.p/gso_gso_common.c.o
[3/2701] Compiling C object lib/librte_gso.a.p/gso_gso_tcp4.c.o
[4/2701] Compiling C object lib/librte_gso.a.p/gso_gso_udp4.c.o
[5/2701] Compiling C object lib/librte_gso.a.p/gso_gso_tunnel_tcp4.c.o
[6/2701] Compiling C object lib/librte_gro.a.p/gro_gro_vxlan_udp4.c.o
[7/2701] Compiling C object lib/librte_gso.a.p/gso_gso_tunnel_udp4.c.o
[8/2701] Generating rte_gro_mingw with a custom command
[9/2701] Compiling C object lib/librte_gso.a.p/gso_rte_gso.c.o
[10/2701] Compiling C object lib/librte_ip_frag.a.p/ip_frag_rte_ipv4_reassembly.c.o
[11/2701] Compiling C object lib/librte_ip_frag.a.p/ip_frag_rte_ipv4_fragmentation.c.o
[12/2701] Compiling C object lib/librte_ip_frag.a.p/ip_frag_rte_ip_frag_common.c.o
[13/2701] Linking static target lib/librte_gro.a
[14/2701] Compiling C object lib/librte_ip_frag.a.p/ip_frag_rte_ipv6_fragmentation.c.o
[15/2701] Compiling C object lib/librte_jobstats.a.p/jobstats_rte_jobstats.c.o
[16/2701] Generating rte_gso_def with a custom command
[17/2701] Compiling C object lib/librte_ip_frag.a.p/ip_frag_ip_frag_internal.c.o
[18/2701] Linking static target lib/librte_gso.a
[19/2701] Compiling C object lib/librte_ip_frag.a.p/ip_frag_rte_ipv6_reassembly.c.o
[20/2701] Generating rte_ip_frag_def with a custom command
[21/2701] Compiling C object lib/librte_latencystats.a.p/latencystats_rte_latencystats.c.o
[22/2701] Linking static target lib/librte_jobstats.a
[23/2701] Linking static target lib/librte_ip_frag.a
[24/2701] Generating rte_jobstats_def with a custom command
[25/2701] Compiling C object lib/librte_kni.a.p/kni_rte_kni.c.o
[26/2701] Generating rte_ip_frag_mingw with a custom command
[27/2701] Linking target lib/librte_eal.so.22.0
[28/2701] Generating rte_kni_mingw with a custom command
[29/2701] Linking static target lib/librte_latencystats.a
[30/2701] Linking static target lib/librte_kni.a
[31/2701] Compiling C object lib/librte_lpm.a.p/lpm_rte_lpm.c.o
[32/2701] Generating rte_kni_def with a custom command
[33/2701] Generating rte_gso_mingw with a custom command
[34/2701] Compiling C object lib/librte_lpm.a.p/lpm_rte_lpm6.c.o
[35/2701] Generating rte_latencystats_def with a custom command
[36/2701] Compiling C object lib/librte_member.a.p/member_rte_member.c.o
[37/2701] Generating rte_jobstats_mingw with a custom command
[38/2701] Compiling C object lib/librte_member.a.p/member_rte_member_ht.c.o
[39/2701] Generating rte_latencystats_mingw with a custom command
[40/2701] Linking static target lib/librte_lpm.a
[41/2701] Compiling C object lib/librte_member.a.p/member_rte_member_vbf.c.o
[42/2701] Compiling C object lib/librte_power.a.p/power_power_common.c.o
[43/2701] Generating rte_lpm_mingw with a custom command
[44/2701] Compiling C object lib/librte_power.a.p/power_guest_channel.c.o
[45/2701] Generating rte_lpm_def with a custom command
[46/2701] Compiling C object lib/librte_power.a.p/power_power_acpi_cpufreq.c.o
[47/2701] Linking static target lib/librte_member.a
[48/2701] Compiling C object lib/librte_power.a.p/power_power_cppc_cpufreq.c.o
[49/2701] Compiling C object lib/librte_power.a.p/power_power_kvm_vm.c.o
[50/2701] Compiling C object lib/librte_power.a.p/power_rte_power.c.o
[51/2701] Compiling C object lib/librte_power.a.p/power_rte_power_empty_poll.c.o
[52/2701] Generating rte_member_def with a custom command
[53/2701] Compiling C object lib/librte_power.a.p/power_power_pstate_cpufreq.c.o
[54/2701] Generating rte_member_mingw with a custom command
[55/2701] Compiling C object lib/librte_power.a.p/power_rte_power_pmd_mgmt.c.o
[56/2701] Compiling C object lib/librte_rawdev.a.p/rawdev_rte_rawdev.c.o
[57/2701] Compiling C object lib/librte_pdump.a.p/pdump_rte_pdump.c.o
[58/2701] Generating rte_power_def with a custom command
[59/2701] Linking static target lib/librte_rawdev.a
[60/2701] Generating rte_power_mingw with a custom command
[61/2701] Linking static target lib/librte_pdump.a
[62/2701] Linking static target lib/librte_power.a
[63/2701] Generating rte_pdump_mingw with a custom command
[64/2701] Generating rte_pdump_def with a custom command
[65/2701] Compiling C object lib/librte_regexdev.a.p/regexdev_rte_regexdev.c.o
[66/2701] Generating rte_rawdev_def with a custom command
[67/2701] Generating rte_rawdev_mingw with a custom command
[68/2701] Compiling C object lib/librte_rib.a.p/rib_rte_rib.c.o
[69/2701] Generating rte_regexdev_def with a custom command
[70/2701] Generating rte_regexdev_mingw with a custom command
[71/2701] Linking static target lib/librte_regexdev.a
[72/2701] Compiling C object lib/librte_rib.a.p/rib_rte_rib6.c.o
[73/2701] Generating rte_rib_mingw with a custom command
[74/2701] Generating rte_rib_def with a custom command
[75/2701] Compiling C object lib/librte_reorder.a.p/reorder_rte_reorder.c.o
[76/2701] Linking static target lib/librte_rib.a
[77/2701] Linking static target lib/librte_reorder.a
[78/2701] Generating rte_reorder_def with a custom command
[79/2701] Generating rte_reorder_mingw with a custom command
[80/2701] Compiling C object lib/librte_sched.a.p/sched_rte_red.c.o
[81/2701] Compiling C object lib/librte_sched.a.p/sched_rte_approx.c.o
[82/2701] Compiling C object lib/librte_sched.a.p/sched_rte_sched.c.o
[83/2701] Generating rte_sched_def with a custom command
[84/2701] Linking static target lib/librte_sched.a
[85/2701] Generating rte_sched_mingw with a custom command
[86/2701] Compiling C object lib/librte_security.a.p/security_rte_security.c.o
[87/2701] Compiling C object lib/librte_pipeline.a.p/pipeline_rte_swx_pipeline.c.o
FAILED: lib/librte_pipeline.a.p/pipeline_rte_swx_pipeline.c.o 
ccache cc -Ilib/librte_pipeline.a.p -Ilib -I../lib -Ilib/pipeline -I../lib/pipeline -I. -I.. -Iconfig -I../config -Ilib/eal/include -I../lib/eal/include -Ilib/eal/linux/include -I../lib/eal/linux/include -Ilib/eal/x86/include -I../lib/eal/x86/include -Ilib/eal/common -I../lib/eal/common -Ilib/eal -I../lib/eal -Ilib/kvargs -I../lib/kvargs -Ilib/metrics -I../lib/metrics -Ilib/telemetry -I../lib/telemetry -Ilib/port -I../lib/port -Ilib/ethdev -I../lib/ethdev -Ilib/net -I../lib/net -Ilib/mbuf -I../lib/mbuf -Ilib/mempool -I../lib/mempool -Ilib/ring -I../lib/ring -Ilib/meter -I../lib/meter -Ilib/sched -I../lib/sched -Ilib/ip_frag -I../lib/ip_frag -Ilib/hash -I../lib/hash -Ilib/rcu -I../lib/rcu -Ilib/cryptodev -I../lib/cryptodev -Ilib/eventdev -I../lib/eventdev -Ilib/timer -I../lib/timer -Ilib/kni -I../lib/kni -Ilib/pci -I../lib/pci -Ilib/table -I../lib/table -Ilib/lpm -I../lib/lpm -Ilib/acl -I../lib/acl -fdiagnostics-color=always -D_FILE_OFFSET_BITS=64 -Wall -Winvalid-pch -O3 -include rte_config.h -Wextra -Wcast-qual -Wdeprecated -Wformat -Wformat-nonliteral -Wformat-security -Wmissing-declarations -Wmissing-prototypes -Wnested-externs -Wold-style-definition -Wpointer-arith -Wsign-compare -Wstrict-prototypes -Wundef -Wwrite-strings -Wno-missing-field-initializers -D_GNU_SOURCE -fPIC -march=native -DALLOW_EXPERIMENTAL_API -DALLOW_INTERNAL_API -Wno-format-truncation -DRTE_LOG_DEFAULT_LOGTYPE=lib.pipeline -MD -MQ lib/librte_pipeline.a.p/pipeline_rte_swx_pipeline.c.o -MF lib/librte_pipeline.a.p/pipeline_rte_swx_pipeline.c.o.d -o lib/librte_pipeline.a.p/pipeline_rte_swx_pipeline.c.o -c ../lib/pipeline/rte_swx_pipeline.c
../lib/pipeline/rte_swx_pipeline.c: In function ‘instr_table_translate’:
../lib/pipeline/rte_swx_pipeline.c:3568:18: warning: unused variable ‘l’ [-Wunused-variable]
  struct learner *l;
                  ^
../lib/pipeline/rte_swx_pipeline.c: In function ‘instr_extern_translate’:
../lib/pipeline/rte_swx_pipeline.c:3883:2: error: ‘l’ undeclared (first use in this function)
  l = learner_find(p, tokens[1]);
  ^
../lib/pipeline/rte_swx_pipeline.c:3883:2: note: each undeclared identifier is reported only once for each function it appears in
[88/2701] Linking static target lib/librte_security.a
[89/2701] Generating symbol file lib/librte_eal.so.22.0.p/librte_eal.so.22.0.symbols
[90/2701] Generating gso.sym_chk with a custom command (wrapped by meson to capture output)
[91/2701] Generating gro.sym_chk with a custom command (wrapped by meson to capture output)
[92/2701] Generating jobstats.sym_chk with a custom command (wrapped by meson to capture output)
[93/2701] Generating kni.sym_chk with a custom command (wrapped by meson to capture output)
[94/2701] Generating ip_frag.sym_chk with a custom command (wrapped by meson to capture output)
[95/2701] Generating member.sym_chk with a custom command (wrapped by meson to capture output)
[96/2701] Generating latencystats.sym_chk with a custom command (wrapped by meson to capture output)
[97/2701] Generating pdump.sym_chk with a custom command (wrapped by meson to capture output)
[98/2701] Generating reorder.sym_chk with a custom command (wrapped by meson to capture output)
[99/2701] Generating lpm.sym_chk with a custom command (wrapped by meson to capture output)
[100/2701] Generating rawdev.sym_chk with a custom command (wrapped by meson to capture output)
[101/2701] Generating sched.sym_chk with a custom command (wrapped by meson to capture output)
[102/2701] Generating power.sym_chk with a custom command (wrapped by meson to capture output)
[103/2701] Generating regexdev.sym_chk with a custom command (wrapped by meson to capture output)
[104/2701] Generating rib.sym_chk with a custom command (wrapped by meson to capture output)
ninja: build stopped: subcommand failed.

https://lab.dpdk.org/results/dashboard/patchsets/18867/

UNH-IOL DPDK Community Lab


More information about the test-report mailing list