[dts-test-report] |FAILURE| pw(98104-98105) sid(18720) job(DTS_AUTO580) [V1, 2/2] tests/cvl_fdir: not need to test GTPU+SCTP protocol package and delete it

sys_stv at intel.com sys_stv at intel.com
Tue Sep 7 10:35:24 CEST 2021


Test-Label: Intel-dts-test
Test-Status: FAILURE
http://dpdk.org/patch/98105
Subject: [V1,2/2] tests/cvl_fdir: not need to test GTPU+SCTP protocol package and delete it

_Testing issues_

Diff:
	test_plans/cvl_fdir_test_plan.rst
	tests/TestSuite_cvl_fdir.py

DPDK:
	commit b344eb5d941a7522ff27b6b7b5419f68c3fea9a0
	Author: Xueming Li <xuemingl at nvidia.com>
	Date:   Tue Apr 13 03:14:12 2021 +0000
	Comment: devargs: parse global device syntax

DTS:
	commit d0f6a0f435e6a854e7ed45f729f838384ac3b4f4
	Author: Owen Hilyard <ohilyard at iol.unh.edu>
	Date:   Mon Aug 23 15:02:09 2021 -0400
	Comment: framework/flow: Update rteflow for new scapy versions


Test environment and result as below:
+----------+----------+--------------------------------+---------------------------------+
| suits    | category | UB2004-64+216_fortville_spirit | UB2004-64+216_columbiaville_25g |
+----------+----------+--------------------------------+---------------------------------+
| cvl_fdir | CVL Only | not run                        | run                             |
+----------+----------+--------------------------------+---------------------------------+

Log path: /regression_dts/results/test/8d69941f89444e76821166d2a39da170

#1: UB2004-64+216_columbiaville_25g
	OS: Ubuntu 20.04.2 LTS
	Kernel: 5.8.0-51-generic
	CPU: Intel(R) Xeon(R) Platinum 8280M CPU @ 2.70GHz
	GCC: gcc (Ubuntu 9.3.0-17ubuntu1~20.04) 9.3.0
	Clang: 10.0.0-4ubuntu1


	Status: FAILURE
	Catogory: CVL Only
	Target: x86_64-native-linuxapp-gcc
	without_patch Total/Pass/Fail/Blocked/NA: 48/44/4/0/0
	with_patch Total/Pass/Fail/Blocked/NA: 48/46/2/0/0
	
	Detail test results:
	+--------------------------------------------------------------+------------+---------------+
	| suit/case                                                    | with_patch | without_patch |
	+--------------------------------------------------------------+------------+---------------+
	| cvl_fdir/test_mac_ipv4_gtpu                                  | passed     | failed        |
	| cvl_fdir/test_mac_ipv4_gtpu_eh                               | passed     | failed        |
	| cvl_fdir/test_two_ports_multi_patterns_count_query           | failed     | failed        |
	| cvl_fdir/test_l2_ethertype                                   | failed     | failed        |
	| cvl_fdir/test_mac_ipv6_pay_protocal                          | passed     | passed        |
	| cvl_fdir/test_conflicted_actions                             | passed     | passed        |
	| cvl_fdir/test_mac_ipv4_tun_ipv4_sctp                         | passed     | passed        |
	| cvl_fdir/test_mac_ipv6_udp                                   | passed     | passed        |
	| cvl_fdir/test_mac_ipv4_sctp                                  | passed     | passed        |
	| cvl_fdir/test_delete_rules                                   | passed     | passed        |
	| cvl_fdir/test_invalid_parameters_of_mark_id                  | passed     | passed        |
	| cvl_fdir/test_mac_ipv4_tun_mac_ipv4_udp                      | passed     | passed        |
	| cvl_fdir/test_mac_ipv4_tun_mac_ipv4_sctp                     | passed     | passed        |
	| cvl_fdir/test_same_rule_on_two_ports                         | passed     | passed        |
	| cvl_fdir/test_invalid_parameters_of_queue_index              | passed     | passed        |
	| cvl_fdir/test_mac_ipv4_tcp                                   | passed     | passed        |
	| cvl_fdir/test_count_for_1_rule                               | passed     | passed        |
	| cvl_fdir/test_same_intput_set_different_actions_on_two_ports | passed     | passed        |
	| cvl_fdir/test_conflicted_rules                               | passed     | passed        |
	| cvl_fdir/test_invalid_parameters_of_rss_queues               | passed     | passed        |
	| cvl_fdir/test_mac_ipv4_tun_ipv4_udp                          | passed     | passed        |
	| cvl_fdir/test_mac_ipv6_gtpu_eh                               | passed     | passed        |
	| cvl_fdir/test_max_rules                                      | passed     | passed        |
	| cvl_fdir/test_mac_ipv4_tun_mac_ipv4_pay                      | passed     | passed        |
	| cvl_fdir/test_conflict_patterns                              | passed     | passed        |
	| cvl_fdir/test_mac_ipv4_tun_ipv4_tcp                          | passed     | passed        |
	| cvl_fdir/test_unsupported_input_set_field                    | passed     | passed        |
	| cvl_fdir/test_max_count_number                               | passed     | passed        |
	| cvl_fdir/test_mac_ipv4_udp                                   | passed     | passed        |
	| cvl_fdir/test_negative_validation                            | passed     | passed        |
	| cvl_fdir/test_mac_ipv6_sctp                                  | passed     | passed        |
	| cvl_fdir/test_void_action                                    | passed     | passed        |
	| cvl_fdir/test_delete_a_nonexistent_rule                      | passed     | passed        |
	| cvl_fdir/test_count_query_identifier_share                   | passed     | passed        |
	| cvl_fdir/test_mac_ipv4_tun_ipv4_pay                          | passed     | passed        |
	| cvl_fdir/test_mac_ipv6_gtpu                                  | passed     | passed        |
	| cvl_fdir/test_port_stop_start_reset                          | passed     | passed        |
	| cvl_fdir/test_mac_ipv4_pay                                   | passed     | passed        |
	| cvl_fdir/test_mac_ipv6_pay                                   | passed     | passed        |
	| cvl_fdir/test_unsupported_ethertype                          | passed     | passed        |
	| cvl_fdir/test_flow_validation                                | passed     | passed        |
	| cvl_fdir/test_mac_ipv4_tun_mac_ipv4_tcp                      | passed     | passed        |
	| cvl_fdir/test_duplicated_rules                               | passed     | passed        |
	| cvl_fdir/test_mac_ipv6_tcp                                   | passed     | passed        |
	| cvl_fdir/test_invalid_port                                   | passed     | passed        |
	| cvl_fdir/test_multi_patterns_mark_count_query                | passed     | passed        |
	| cvl_fdir/test_mac_ipv4_pay_protocal                          | passed     | passed        |
	| cvl_fdir/test_invalid_parameters_of_input_set                | passed     | passed        |
	+--------------------------------------------------------------+------------+---------------+

DOC test failed information:
reading sources... [ 99%] vxlan_gpe_support_in_i40e_test_plan
reading sources... [100%] vxlan_test_plan

rxtx_offload_test_plan.rst:741: WARNING: Unexpected indentation.
looking for now-outdated files... none found
pickling environment... done
checking consistency... done
DPDK STV team


More information about the dts-test-report mailing list