[dpdk-test-report] |FAILURE| pw18074 [PATCH v4 23/29] app/testpmd: handle i40e in VF VLAN filter command

sys_stv at intel.com sys_stv at intel.com
Sat Dec 17 00:03:33 CET 2016


Test-Label: Intel compilation
Test-Status: FAILURE

http://dpdk.org/patch/18074

_Compilation issues_

Submitter: Ferruh Yigit <ferruh.yigit at intel.com>
Date: Fri, 16 Dec 2016 14:39:13 +0000
DPDK git baseline: Repo:dpdk-next-net, Branch:master, CommitID:f4fa617532e5ffa71f0cedc9f37fda069c8eb856

Patch18074-18074 --> compile error
Build Summary: 18 Builds Done, 0 Successful, 18 Failures

Test environment and configuration as below:
OS: RHEL7.2_64
    Kernel Version:3.10.0-327.el7.x86_64
    CPU info:Intel(R) Xeon(R) CPU E5-2699 v4 @ 2.20GHz
    GCC Version:gcc (GCC) 4.8.5 20150623 (Red Hat 4.8.5-4)
    Clang Version:3.4.2
    i686-native-linuxapp-gcc
    x86_64-native-linuxapp-gcc
    x86_64-native-linuxapp-gcc-shared
OS: FreeBSD10.3_64
    Kernel Version:10.3-RELEASE
    CPU info: Intel(R) Xeon(R) CPU E5-2699 v4 @ 2.20GHz (2194.97-MHz K8-class CPU)
    GCC Version:gcc (FreeBSD Ports Collection) 4.8.5
    Clang Version:3.4.1
    x86_64-native-bsdapp-clang
    x86_64-native-bsdapp-gcc
OS: FC24_64
    Kernel Version:4.8.6-201.fc24.x86_64
    CPU info:Intel(R) Xeon(R) CPU E5-2699 v3 @ 2.30GHz
    GCC Version:gcc (GCC) 6.2.1 20160916 (Red Hat 6.2.1-2)
    Clang Version:3.8.0
    x86_64-native-linuxapp-gcc-debug
    i686-native-linuxapp-gcc
    x86_64-native-linuxapp-gcc
    x86_64-native-linuxapp-gcc-shared
    x86_64-native-linuxapp-clang
OS: UB1604_64
    Kernel Version:4.4.0-53-generic
    CPU info:Intel(R) Xeon(R) CPU E5-2699 v3 @ 2.30GHz
    GCC Version:gcc (Ubuntu 5.4.0-6ubuntu1~16.04.4) 5.4.0 20160609
    Clang Version:3.8.0
    i686-native-linuxapp-gcc
    x86_64-native-linuxapp-gcc
    x86_64-native-linuxapp-gcc-shared
    x86_64-native-linuxapp-clang
OS: CentOS7_64
    Kernel Version:3.10.0-327.el7.x86_64
    CPU info:Intel(R) Xeon(R) CPU E5-2699 v3 @ 2.30GHz
    GCC Version:gcc (GCC) 4.8.5 20150623 (Red Hat 4.8.5-4)
    Clang Version:3.4.2
    i686-native-linuxapp-gcc
    x86_64-native-linuxapp-clang
    x86_64-native-linuxapp-gcc-shared
    x86_64-native-linuxapp-gcc

Failed Build #1:
OS: RHEL7.2_64
Target: i686-native-linuxapp-gcc
/home/patchWorkOrg/compilation/app/test-pmd/config.c:96:26: fatal error: rte_pmd_i40e.h: No such file or directory
 #include <rte_pmd_i40e.h>
                          ^
compilation terminated.


Failed Build #2:
OS: RHEL7.2_64
Target: x86_64-native-linuxapp-gcc
/home/patchWorkOrg/compilation/app/test-pmd/config.c:96:26: fatal error: rte_pmd_i40e.h: No such file or directory
 #include <rte_pmd_i40e.h>
                          ^
compilation terminated.


Failed Build #3:
OS: RHEL7.2_64
Target: x86_64-native-linuxapp-gcc-shared

/home/patchWorkOrg/compilation/app/test-pmd/config.c:96:26: fatal error: rte_pmd_i40e.h: No such file or directory
 #include <rte_pmd_i40e.h>
                          ^
compilation terminated.


Failed Build #4:
OS: FreeBSD10.3_64
Target: x86_64-native-bsdapp-clang
MKRES test_resource_c.res.o  /home/patchWorkOrg/compilation/x86_64-native-bsdapp-clang/lib/librte_pmd_virtio.a(virtio_ethdev.o): In function `virtio_init_device':
/home/patchWorkOrg/compilation/drivers/net/virtio/virtio_ethdev.c:(.text+0x205): undefined reference to `virtio_user_driver'
clang: error: linker command failed with exit code 1 (use -v to see invocation)
/home/patchWorkOrg/compilation/mk/rte.app.mk:233: recipe for target 'test' failed
/home/patchWorkOrg/compilation/mk/rte.subdir.mk:61: recipe for target 'test' failed
/home/patchWorkOrg/compilation/mk/rte.sdkbuild.mk:78: recipe for target 'app' failed
/home/patchWorkOrg/compilation/mk/rte.sdkroot.mk:126: recipe for target 'all' failed
/home/patchWorkOrg/compilation/mk/rte.sdkinstall.mk:85: recipe for target 'pre_install' failed
/home/patchWorkOrg/compilation/mk/rte.sdkroot.mk:101: recipe for target 'install' failed


Failed Build #5:
OS: FreeBSD10.3_64
Target: x86_64-native-bsdapp-gcc
MKRES test_resource_c.res.o  /home/patchWorkOrg/compilation/x86_64-native-bsdapp-gcc/lib/librte_pmd_virtio.a(virtio_ethdev.o): In function `virtio_init_device':
virtio_ethdev.c:(.text+0xf44): undefined reference to `virtio_user_driver'
collect2: error: ld returned 1 exit status
/home/patchWorkOrg/compilation/mk/rte.app.mk:233: recipe for target 'test' failed
/home/patchWorkOrg/compilation/mk/rte.subdir.mk:61: recipe for target 'test' failed
/home/patchWorkOrg/compilation/mk/rte.sdkbuild.mk:78: recipe for target 'app' failed
/home/patchWorkOrg/compilation/mk/rte.sdkroot.mk:126: recipe for target 'all' failed
/home/patchWorkOrg/compilation/mk/rte.sdkinstall.mk:85: recipe for target 'pre_install' failed
/home/patchWorkOrg/compilation/mk/rte.sdkroot.mk:101: recipe for target 'install' failed


Failed Build #6:
OS: FC24_64
Target: x86_64-native-linuxapp-gcc-debug

/home/patchWorkOrg/compilation/app/test-pmd/config.c:96:26: fatal error: rte_pmd_i40e.h: No such file or directory
 #include <rte_pmd_i40e.h>
                          ^
compilation terminated.
/home/patchWorkOrg/compilation/mk/internal/rte.compile-pre.mk:138: recipe for target 'config.o' failed
/home/patchWorkOrg/compilation/mk/rte.subdir.mk:61: recipe for target 'test-pmd' failed
/home/patchWorkOrg/compilation/mk/rte.sdkbuild.mk:78: recipe for target 'app' failed
/home/patchWorkOrg/compilation/mk/rte.sdkroot.mk:126: recipe for target 'all' failed
/home/patchWorkOrg/compilation/mk/rte.sdkinstall.mk:85: recipe for target 'pre_install' failed
/home/patchWorkOrg/compilation/mk/rte.sdkroot.mk:101: recipe for target 'install' failed


Failed Build #7:
OS: FC24_64
Target: i686-native-linuxapp-gcc
/home/patchWorkOrg/compilation/app/test-pmd/config.c:96:26: fatal error: rte_pmd_i40e.h: No such file or directory
 #include <rte_pmd_i40e.h>
                          ^
compilation terminated.
/home/patchWorkOrg/compilation/mk/internal/rte.compile-pre.mk:138: recipe for target 'config.o' failed
/home/patchWorkOrg/compilation/mk/rte.subdir.mk:61: recipe for target 'test-pmd' failed
/home/patchWorkOrg/compilation/mk/rte.sdkbuild.mk:78: recipe for target 'app' failed
/home/patchWorkOrg/compilation/mk/rte.sdkroot.mk:126: recipe for target 'all' failed
/home/patchWorkOrg/compilation/mk/rte.sdkinstall.mk:85: recipe for target 'pre_install' failed
/home/patchWorkOrg/compilation/mk/rte.sdkroot.mk:101: recipe for target 'install' failed


Failed Build #8:
OS: FC24_64
Target: x86_64-native-linuxapp-gcc
/home/patchWorkOrg/compilation/app/test-pmd/config.c:96:26: fatal error: rte_pmd_i40e.h: No such file or directory
 #include <rte_pmd_i40e.h>
                          ^
compilation terminated.
/home/patchWorkOrg/compilation/mk/internal/rte.compile-pre.mk:138: recipe for target 'config.o' failed
/home/patchWorkOrg/compilation/mk/rte.subdir.mk:61: recipe for target 'test-pmd' failed
/home/patchWorkOrg/compilation/mk/rte.sdkbuild.mk:78: recipe for target 'app' failed
/home/patchWorkOrg/compilation/mk/rte.sdkroot.mk:126: recipe for target 'all' failed
/home/patchWorkOrg/compilation/mk/rte.sdkinstall.mk:85: recipe for target 'pre_install' failed
/home/patchWorkOrg/compilation/mk/rte.sdkroot.mk:101: recipe for target 'install' failed


Failed Build #9:
OS: FC24_64
Target: x86_64-native-linuxapp-gcc-shared

/home/patchWorkOrg/compilation/app/test-pmd/config.c:96:26: fatal error: rte_pmd_i40e.h: No such file or directory
 #include <rte_pmd_i40e.h>
                          ^
compilation terminated.
/home/patchWorkOrg/compilation/mk/internal/rte.compile-pre.mk:138: recipe for target 'config.o' failed
/home/patchWorkOrg/compilation/mk/rte.subdir.mk:61: recipe for target 'test-pmd' failed
/home/patchWorkOrg/compilation/mk/rte.sdkbuild.mk:78: recipe for target 'app' failed
/home/patchWorkOrg/compilation/mk/rte.sdkroot.mk:126: recipe for target 'all' failed
/home/patchWorkOrg/compilation/mk/rte.sdkinstall.mk:85: recipe for target 'pre_install' failed
/home/patchWorkOrg/compilation/mk/rte.sdkroot.mk:101: recipe for target 'install' failed


Failed Build #10:
OS: FC24_64
Target: x86_64-native-linuxapp-clang
/home/patchWorkOrg/compilation/app/test-pmd/config.c:96:10: fatal error: 'rte_pmd_i40e.h' file not found
#include <rte_pmd_i40e.h>
         ^
1 error generated.
/home/patchWorkOrg/compilation/mk/internal/rte.compile-pre.mk:138: recipe for target 'config.o' failed
/home/patchWorkOrg/compilation/mk/rte.subdir.mk:61: recipe for target 'test-pmd' failed
/home/patchWorkOrg/compilation/mk/rte.sdkbuild.mk:78: recipe for target 'app' failed
/home/patchWorkOrg/compilation/mk/rte.sdkroot.mk:126: recipe for target 'all' failed
/home/patchWorkOrg/compilation/mk/rte.sdkinstall.mk:85: recipe for target 'pre_install' failed
/home/patchWorkOrg/compilation/mk/rte.sdkroot.mk:101: recipe for target 'install' failed


Failed Build #11:
OS: UB1604_64
Target: i686-native-linuxapp-gcc
/home/patchWorkOrg/compilation/app/test-pmd/config.c:96:26: fatal error: rte_pmd_i40e.h: No such file or directory
compilation terminated.
/home/patchWorkOrg/compilation/mk/internal/rte.compile-pre.mk:138: recipe for target 'config.o' failed
/home/patchWorkOrg/compilation/mk/rte.subdir.mk:61: recipe for target 'test-pmd' failed
/home/patchWorkOrg/compilation/mk/rte.sdkbuild.mk:78: recipe for target 'app' failed
/home/patchWorkOrg/compilation/mk/rte.sdkroot.mk:126: recipe for target 'all' failed
/home/patchWorkOrg/compilation/mk/rte.sdkinstall.mk:85: recipe for target 'pre_install' failed
/home/patchWorkOrg/compilation/mk/rte.sdkroot.mk:101: recipe for target 'install' failed


Failed Build #12:
OS: UB1604_64
Target: x86_64-native-linuxapp-gcc
/home/patchWorkOrg/compilation/app/test-pmd/config.c:96:26: fatal error: rte_pmd_i40e.h: No such file or directory
compilation terminated.
/home/patchWorkOrg/compilation/mk/internal/rte.compile-pre.mk:138: recipe for target 'config.o' failed
/home/patchWorkOrg/compilation/mk/rte.subdir.mk:61: recipe for target 'test-pmd' failed
/home/patchWorkOrg/compilation/mk/rte.sdkbuild.mk:78: recipe for target 'app' failed
/home/patchWorkOrg/compilation/mk/rte.sdkroot.mk:126: recipe for target 'all' failed
/home/patchWorkOrg/compilation/mk/rte.sdkinstall.mk:85: recipe for target 'pre_install' failed
/home/patchWorkOrg/compilation/mk/rte.sdkroot.mk:101: recipe for target 'install' failed


Failed Build #13:
OS: UB1604_64
Target: x86_64-native-linuxapp-gcc-shared

/home/patchWorkOrg/compilation/app/test-pmd/config.c:96:26: fatal error: rte_pmd_i40e.h: No such file or directory
compilation terminated.
/home/patchWorkOrg/compilation/mk/internal/rte.compile-pre.mk:138: recipe for target 'config.o' failed
/home/patchWorkOrg/compilation/mk/rte.subdir.mk:61: recipe for target 'test-pmd' failed
/home/patchWorkOrg/compilation/mk/rte.sdkbuild.mk:78: recipe for target 'app' failed
/home/patchWorkOrg/compilation/mk/rte.sdkroot.mk:126: recipe for target 'all' failed
/home/patchWorkOrg/compilation/mk/rte.sdkinstall.mk:85: recipe for target 'pre_install' failed
/home/patchWorkOrg/compilation/mk/rte.sdkroot.mk:101: recipe for target 'install' failed


Failed Build #14:
OS: UB1604_64
Target: x86_64-native-linuxapp-clang
/home/patchWorkOrg/compilation/app/test-pmd/config.c:96:10: fatal error: 'rte_pmd_i40e.h' file not found
#include <rte_pmd_i40e.h>
         ^
1 error generated.
/home/patchWorkOrg/compilation/mk/internal/rte.compile-pre.mk:138: recipe for target 'config.o' failed
/home/patchWorkOrg/compilation/mk/rte.subdir.mk:61: recipe for target 'test-pmd' failed
/home/patchWorkOrg/compilation/mk/rte.sdkbuild.mk:78: recipe for target 'app' failed
/home/patchWorkOrg/compilation/mk/rte.sdkroot.mk:126: recipe for target 'all' failed
/home/patchWorkOrg/compilation/mk/rte.sdkinstall.mk:85: recipe for target 'pre_install' failed
/home/patchWorkOrg/compilation/mk/rte.sdkroot.mk:101: recipe for target 'install' failed


Failed Build #15:
OS: CentOS7_64
Target: i686-native-linuxapp-gcc
/home/patchWorkOrg/compilation/app/test-pmd/config.c:96:26: fatal error: rte_pmd_i40e.h: No such file or directory
 #include <rte_pmd_i40e.h>
                          ^
compilation terminated.


Failed Build #16:
OS: CentOS7_64
Target: x86_64-native-linuxapp-clang
/home/patchWorkOrg/compilation/app/test-pmd/config.c:96:10: fatal error: 'rte_pmd_i40e.h' file not found
#include <rte_pmd_i40e.h>
         ^
1 error generated.


Failed Build #17:
OS: CentOS7_64
Target: x86_64-native-linuxapp-gcc-shared

/home/patchWorkOrg/compilation/app/test-pmd/config.c:96:26: fatal error: rte_pmd_i40e.h: No such file or directory
 #include <rte_pmd_i40e.h>
                          ^
compilation terminated.


Failed Build #18:
OS: CentOS7_64
Target: x86_64-native-linuxapp-gcc
/home/patchWorkOrg/compilation/app/test-pmd/config.c:96:26: fatal error: rte_pmd_i40e.h: No such file or directory
 #include <rte_pmd_i40e.h>
                          ^
compilation terminated.


DPDK STV team


More information about the test-report mailing list