[dpdk-test-report] |FAILURE| pw27420 [PATCH] doc: move metrics libs to device API section
sys_stv at intel.com
sys_stv at intel.com
Thu Aug 3 20:25:23 CEST 2017
Test-Label: Intel-compilation
Test-Status: FAILURE
http://dpdk.org/patch/27420
_apply patch file failure_
Submitter: Thomas Monjalon <thomas at monjalon.net>
Date: Thu, 3 Aug 2017 17:56:05 +0200
DPDK git baseline: Repo:dpdk-next-eventdev, Branch:master, CommitID:cb78ef9859ff68b9e260a844f151055ebd9ae78f
Repo:dpdk-next-crypto, Branch:master, CommitID:f4709b40940395b29521d6e5e36b58c516a74b29
Repo:dpdk-next-net, Branch:master, CommitID:c9f814f331658844c7bc07879daa268f5e54bb5a
Repo:dpdk-next-virtio, Branch:master, CommitID:6c157fe64650167646ff1312f9f7e7dc3674d7eb
Repo:dpdk, Branch:master, CommitID:c9f814f331658844c7bc07879daa268f5e54bb5a
Apply patch file failed:
Repo: dpdk
27420:
patching file doc/api/doxy-api-index.md
Hunk #2 FAILED at 164.
1 out of 2 hunks FAILED -- saving rejects to file doc/api/doxy-api-index.md.rej
Repo: dpdk-next-crypto
27420:
patching file doc/api/doxy-api-index.md
Hunk #2 FAILED at 164.
1 out of 2 hunks FAILED -- saving rejects to file doc/api/doxy-api-index.md.rej
Repo: dpdk-next-net
27420:
patching file doc/api/doxy-api-index.md
Hunk #2 FAILED at 164.
1 out of 2 hunks FAILED -- saving rejects to file doc/api/doxy-api-index.md.rej
Repo: dpdk-next-virtio
27420:
patching file doc/api/doxy-api-index.md
Hunk #2 FAILED at 164.
1 out of 2 hunks FAILED -- saving rejects to file doc/api/doxy-api-index.md.rej
Repo: dpdk-next-eventdev
27420:
patching file doc/api/doxy-api-index.md
Hunk #1 succeeded at 44 (offset 1 line).
Hunk #2 FAILED at 164.
1 out of 2 hunks FAILED -- saving rejects to file doc/api/doxy-api-index.md.rej
DPDK STV team
More information about the test-report
mailing list