[dpdk-test-report] |FAILURE| pw32086 [PATCH v3 7/8] app/eventdev: add service core configuration

sys_stv at intel.com sys_stv at intel.com
Mon Dec 11 17:46:40 CET 2017

Test-Label: Intel-compilation
Test-Status: FAILURE

_apply patch file failure_

Submitter: Pavan Bhagavatula <pbhagavatula at caviumnetworks.com>
Date: Mon, 11 Dec 2017 20:43:42 +0530
DPDK git baseline: Repo:dpdk-next-eventdev, Branch:master, CommitID:5b5e476e59a45aababa019f76d57d21b978400dc
                   Repo:dpdk-next-crypto, Branch:master, CommitID:cdc9b6b37ed6417b46165c341e6e03518837084d
                   Repo:dpdk-next-net, Branch:master, CommitID:efca9d9498ec183658e9ec78ff470663cdc6182e
                   Repo:dpdk-next-virtio, Branch:master, CommitID:4f761c94b520ce71c56be1c913e54a4179b81c43
                   Repo:dpdk, Branch:master, CommitID:224374cc0e3ca44af5141fb7035a97f338d00c18
Apply patch file failed:
Repo: dpdk-next-virtio
patching file app/test-eventdev/evt_common.h
Hunk #1 FAILED at 94.
1 out of 1 hunk FAILED -- saving rejects to file app/test-eventdev/evt_common.h.rej
patching file app/test-eventdev/test_perf_atq.c
Hunk #1 FAILED at 239.
1 out of 1 hunk FAILED -- saving rejects to file app/test-eventdev/test_perf_atq.c.rej
patching file app/test-eventdev/test_perf_common.c
Hunk #1 succeeded at 274 (offset 7 lines).
patching file app/test-eventdev/test_perf_queue.c
Hunk #1 FAILED at 252.
1 out of 1 hunk FAILED -- saving rejects to file app/test-eventdev/test_perf_queue.c.rej


More information about the test-report mailing list