[dpdk-test-report] |FAILURE| pw43818[08/11] telemetry: add vdev kvargs for selftest

sys_stv at intel.com sys_stv at intel.com
Thu Aug 23 14:17:28 CEST 2018


Test-Label: Intel-compilation
Test-Status: FAILURE
http://dpdk.org/patch/43818

_Compilation issues_

Submitter: Ciara Power <ciara.power at intel.com>
Date: 2018-08-23 12:08:10
DPDK git baseline: Repo:dpdk-master, CommitID: 7281cf520f890a5e779596c872e2440af7131eae

Build Summary: 15 Builds Done, 0 Successful, 15 Failures

Test environment and configuration as below:

OS: FC25
	Kernel Version: 4.9.13-100.fc24.x86_64
	CPU info: Intel(R) Xeon(R) CPU E5-2699 v3 @ 2.30GHz
	GCC Version: gcc (GCC) 6.2.1 20160916 (Red Hat 6.2.1-2)
	Clang Version: 3.8.0 (tags/RELEASE_380/final)
	x86_64-native-linuxapp-gcc
	x86_64-native-linuxapp-gcc-debug

OS: FC24
	Kernel Version: 4.9.13-100.fc24.x86_64
	CPU info: Intel(R) Xeon(R) CPU E5-2699 v3 @ 2.30GHz
	GCC Version: gcc (GCC) 6.2.1 20160916 (Red Hat 6.2.1-2)
	Clang Version: 3.8.0 (tags/RELEASE_380/final)
	x86_64-native-linuxapp-clang
	i686-native-linuxapp-gcc
	x86_64-native-linuxapp-gcc-shared

OS: CENTOS
	Kernel Version: 3.10.0-327.el7.x86_64
	CPU info: Intel(R) Xeon(R) CPU E5-2699 v3 @ 2.30GHz
	GCC Version: gcc (GCC) 4.8.5 20150623 (Red Hat 4.8.5-28)
	Clang Version: NA
	x86_64-native-linuxapp-clang
	x86_64-native-linuxapp-gcc
	x86_64-native-linuxapp-gcc-shared
	i686-native-linuxapp-gcc

OS: UB1604
	Kernel Version: 4.4.0-78-generic
	CPU info: Intel(R) Xeon(R) CPU E5-2699 v3 @ 2.30GHz
	GCC Version: gcc (Ubuntu 5.4.0-6ubuntu1~16.04.10) 5.4.0 20160609
	Clang Version: 3.8.0-2ubuntu4 (tags/RELEASE_380/final)
	x86_64-native-linuxapp-gcc
	x86_64-native-linuxapp-gcc-shared
	x86_64-native-linuxapp-clang
	i686-native-linuxapp-gcc

OS: FreeBSD
	Kernel Version: 10.3-RELEASE
	CPU info: Intel(R) Xeon(R) CPU E5-2699 v3 @ 2.30GHz (2294.76-MHz K8-class CPU)
	GCC Version: gcc (FreeBSD Ports Collection) 4.8.5
	Clang Version: 3.4.1 (tags/RELEASE_34/dot1-final 208032) 20140512
	x86_64-native-bsdapp-clang
	x86_64-native-bsdapp-gcc

*Failed Build #1:
OS: FC25
Target: x86_64-native-linuxapp-gcc
  AR librte_gso.a
  INSTALL-LIB librte_gso.a
== Build lib/librte_telemetry
  SYMLINK-FILE include/rte_telemetry.h
  CC rte_telemetry.o
/tmp/FC25_K4.8.6_GCC6.3.1/x86_64-native-linuxapp-gcc/4e0d197768414f0c9b14a5d32b3c0e06/dpdk/lib/librte_telemetry/rte_telemetry.c:9:21: fatal error: jansson.h: No such file or directory
 #include <jansson.h>
                     ^
compilation terminated.
/tmp/FC25_K4.8.6_GCC6.3.1/x86_64-native-linuxapp-gcc/4e0d197768414f0c9b14a5d32b3c0e06/dpdk/mk/internal/rte.compile-pre.mk:114: recipe for target 'rte_telemetry.o' failed
make[5]: *** [rte_telemetry.o] Error 1
/tmp/FC25_K4.8.6_GCC6.3.1/x86_64-native-linuxapp-gcc/4e0d197768414f0c9b14a5d32b3c0e06/dpdk/mk/rte.subdir.mk:35: recipe for target 'librte_telemetry' failed
make[4]: *** [librte_telemetry] Error 2
make[4]: *** Waiting for unfinished jobs....
  CC bpf_pkt.o
  CC bpf_validate.o
  CC bpf_jit_x86.o
  AR librte_bpf.a
  INSTALL-LIB librte_bpf.a
/tmp/FC25_K4.8.6_GCC6.3.1/x86_64-native-linuxapp-gcc/4e0d197768414f0c9b14a5d32b3c0e06/dpdk/mk/rte.sdkbuild.mk:49: recipe for target 'lib' failed
make[3]: *** [lib] Error 2
/tmp/FC25_K4.8.6_GCC6.3.1/x86_64-native-linuxapp-gcc/4e0d197768414f0c9b14a5d32b3c0e06/dpdk/mk/rte.sdkroot.mk:100: recipe for target 'all' failed
make[2]: *** [all] Error 2
/tmp/FC25_K4.8.6_GCC6.3.1/x86_64-native-linuxapp-gcc/4e0d197768414f0c9b14a5d32b3c0e06/dpdk/mk/rte.sdkinstall.mk:57: recipe for target 'pre_install' failed
make[1]: *** [pre_install] Error 2
/tmp/FC25_K4.8.6_GCC6.3.1/x86_64-native-linuxapp-gcc/4e0d197768414f0c9b14a5d32b3c0e06/dpdk/mk/rte.sdkroot.mk:79: recipe for target 'install' failed
make: *** [install] Error 2

*Failed Build #2:
OS: UB1604
Target: x86_64-native-linuxapp-gcc
  AR librte_gso.a
  INSTALL-LIB librte_gso.a
== Build lib/librte_telemetry
  SYMLINK-FILE include/rte_telemetry.h
  CC rte_telemetry.o
/tmp/UB1604_K4.8.0_GCC6.2.0/x86_64-native-linuxapp-gcc/4e0d197768414f0c9b14a5d32b3c0e06/dpdk/lib/librte_telemetry/rte_telemetry.c:9:21: fatal error: jansson.h: No such file or directory
 #include <jansson.h>
                     ^
compilation terminated.
/tmp/UB1604_K4.8.0_GCC6.2.0/x86_64-native-linuxapp-gcc/4e0d197768414f0c9b14a5d32b3c0e06/dpdk/mk/internal/rte.compile-pre.mk:114: recipe for target 'rte_telemetry.o' failed
make[5]: *** [rte_telemetry.o] Error 1
  CC bpf_validate.o
/tmp/UB1604_K4.8.0_GCC6.2.0/x86_64-native-linuxapp-gcc/4e0d197768414f0c9b14a5d32b3c0e06/dpdk/mk/rte.subdir.mk:35: recipe for target 'librte_telemetry' failed
make[4]: *** [librte_telemetry] Error 2
make[4]: *** Waiting for unfinished jobs....
  CC bpf_jit_x86.o
  AR librte_bpf.a
  INSTALL-LIB librte_bpf.a
/tmp/UB1604_K4.8.0_GCC6.2.0/x86_64-native-linuxapp-gcc/4e0d197768414f0c9b14a5d32b3c0e06/dpdk/mk/rte.sdkbuild.mk:49: recipe for target 'lib' failed
make[3]: *** [lib] Error 2
/tmp/UB1604_K4.8.0_GCC6.2.0/x86_64-native-linuxapp-gcc/4e0d197768414f0c9b14a5d32b3c0e06/dpdk/mk/rte.sdkroot.mk:100: recipe for target 'all' failed
make[2]: *** [all] Error 2
/tmp/UB1604_K4.8.0_GCC6.2.0/x86_64-native-linuxapp-gcc/4e0d197768414f0c9b14a5d32b3c0e06/dpdk/mk/rte.sdkinstall.mk:57: recipe for target 'pre_install' failed
make[1]: *** [pre_install] Error 2
/tmp/UB1604_K4.8.0_GCC6.2.0/x86_64-native-linuxapp-gcc/4e0d197768414f0c9b14a5d32b3c0e06/dpdk/mk/rte.sdkroot.mk:79: recipe for target 'install' failed
make: *** [install] Error 2

*Failed Build #3:
OS: UB1604
Target: x86_64-native-linuxapp-gcc-shared
  LD librte_gso.so.1.1
  INSTALL-LIB librte_gso.so.1.1
== Build lib/librte_telemetry
  SYMLINK-FILE include/rte_telemetry.h
  CC rte_telemetry.o
/tmp/UB1604_K4.4.0_GCC5.4.0/x86_64-native-linuxapp-gcc-shared/4e0d197768414f0c9b14a5d32b3c0e06/dpdk/lib/librte_telemetry/rte_telemetry.c:9:21: fatal error: jansson.h: No such file or directory
compilation terminated.
/tmp/UB1604_K4.4.0_GCC5.4.0/x86_64-native-linuxapp-gcc-shared/4e0d197768414f0c9b14a5d32b3c0e06/dpdk/mk/internal/rte.compile-pre.mk:114: recipe for target 'rte_telemetry.o' failed
make[5]: *** [rte_telemetry.o] Error 1
/tmp/UB1604_K4.4.0_GCC5.4.0/x86_64-native-linuxapp-gcc-shared/4e0d197768414f0c9b14a5d32b3c0e06/dpdk/mk/rte.subdir.mk:35: recipe for target 'librte_telemetry' failed
make[4]: *** [librte_telemetry] Error 2
make[4]: *** Waiting for unfinished jobs....
  CC bpf_validate.o
  CC bpf_jit_x86.o
  LD librte_bpf.so.1.1
  INSTALL-LIB librte_bpf.so.1.1
/tmp/UB1604_K4.4.0_GCC5.4.0/x86_64-native-linuxapp-gcc-shared/4e0d197768414f0c9b14a5d32b3c0e06/dpdk/mk/rte.sdkbuild.mk:49: recipe for target 'lib' failed
make[3]: *** [lib] Error 2
/tmp/UB1604_K4.4.0_GCC5.4.0/x86_64-native-linuxapp-gcc-shared/4e0d197768414f0c9b14a5d32b3c0e06/dpdk/mk/rte.sdkroot.mk:100: recipe for target 'all' failed
make[2]: *** [all] Error 2
/tmp/UB1604_K4.4.0_GCC5.4.0/x86_64-native-linuxapp-gcc-shared/4e0d197768414f0c9b14a5d32b3c0e06/dpdk/mk/rte.sdkinstall.mk:57: recipe for target 'pre_install' failed
make[1]: *** [pre_install] Error 2
/tmp/UB1604_K4.4.0_GCC5.4.0/x86_64-native-linuxapp-gcc-shared/4e0d197768414f0c9b14a5d32b3c0e06/dpdk/mk/rte.sdkroot.mk:79: recipe for target 'install' failed
make: *** [install] Error 2

*Failed Build #4:
OS: CENTOS
Target: x86_64-native-linuxapp-clang
  AR librte_gso.a
  INSTALL-LIB librte_gso.a
== Build lib/librte_telemetry
  SYMLINK-FILE include/rte_telemetry.h
  CC rte_telemetry.o
/tmp/CENTOS_K3.10.0_GCC4.8.5/x86_64-native-linuxapp-clang/4e0d197768414f0c9b14a5d32b3c0e06/dpdk/lib/librte_telemetry/rte_telemetry.c:9:10: fatal error: 'jansson.h' file not found
#include <jansson.h>
         ^
  CC bpf_load.o
1 error generated.
make[5]: *** [rte_telemetry.o] Error 1
make[4]: *** [librte_telemetry] Error 2
make[4]: *** Waiting for unfinished jobs....
  CC bpf_pkt.o
  CC bpf_validate.o

*Failed Build #5:
OS: CENTOS
Target: x86_64-native-linuxapp-gcc
  SYMLINK-FILE include/rte_telemetry.h
  CC rte_telemetry.o
  AR librte_bpf.a
  INSTALL-LIB librte_bpf.a
== Build lib/librte_port
/tmp/CENTOS_K3.10.0_GCC4.8.5/x86_64-native-linuxapp-gcc/4e0d197768414f0c9b14a5d32b3c0e06/dpdk/lib/librte_telemetry/rte_telemetry.c:9:21: fatal error: jansson.h: No such file or directory
 #include <jansson.h>
                     ^
compilation terminated.
  SYMLINK-FILE include/rte_port.h
make[5]: *** [rte_telemetry.o] Error 1

*Failed Build #6:
OS: CENTOS
Target: x86_64-native-linuxapp-gcc-shared
  LD librte_gso.so.1.1
  INSTALL-LIB librte_gso.so.1.1
== Build lib/librte_telemetry
  SYMLINK-FILE include/rte_telemetry.h
  CC rte_telemetry.o
/tmp/CENTOS_K3.10.0_GCC4.8.5/x86_64-native-linuxapp-gcc-shared/4e0d197768414f0c9b14a5d32b3c0e06/dpdk/lib/librte_telemetry/rte_telemetry.c:9:21: fatal error: jansson.h: No such file or directory
 #include <jansson.h>
                     ^
compilation terminated.
make[5]: *** [rte_telemetry.o] Error 1
make[4]: *** [librte_telemetry] Error 2

*Failed Build #7:
OS: CENTOS
Target: i686-native-linuxapp-gcc
  SYMLINK-FILE include/rte_telemetry.h
  CC rte_telemetry.o
  AR librte_bpf.a
  INSTALL-LIB librte_bpf.a
== Build lib/librte_table
/tmp/CENTOS_K3.10.0_GCC4.8.5/i686-native-linuxapp-gcc/4e0d197768414f0c9b14a5d32b3c0e06/dpdk/lib/librte_telemetry/rte_telemetry.c:9:21: fatal error: jansson.h: No such file or directory
 #include <jansson.h>
                     ^
compilation terminated.
make[5]: *** [rte_telemetry.o] Error 1
make[4]: *** [librte_telemetry] Error 2

*Failed Build #8:
OS: UB1604
Target: x86_64-native-linuxapp-clang
  INSTALL-LIB librte_gso.a
== Build lib/librte_telemetry
  SYMLINK-FILE include/rte_telemetry.h
  CC rte_telemetry.o
  CC bpf_validate.o
/tmp/UB1604_K4.4.0_GCC5.4.0/x86_64-native-linuxapp-clang/4e0d197768414f0c9b14a5d32b3c0e06/dpdk/lib/librte_telemetry/rte_telemetry.c:9:10: fatal error: 'jansson.h' file not found
#include <jansson.h>
         ^
1 error generated.
/tmp/UB1604_K4.4.0_GCC5.4.0/x86_64-native-linuxapp-clang/4e0d197768414f0c9b14a5d32b3c0e06/dpdk/mk/internal/rte.compile-pre.mk:114: recipe for target 'rte_telemetry.o' failed
make[5]: *** [rte_telemetry.o] Error 1
/tmp/UB1604_K4.4.0_GCC5.4.0/x86_64-native-linuxapp-clang/4e0d197768414f0c9b14a5d32b3c0e06/dpdk/mk/rte.subdir.mk:35: recipe for target 'librte_telemetry' failed
make[4]: *** [librte_telemetry] Error 2
make[4]: *** Waiting for unfinished jobs....
  CC bpf_jit_x86.o
  AR librte_bpf.a
  INSTALL-LIB librte_bpf.a
/tmp/UB1604_K4.4.0_GCC5.4.0/x86_64-native-linuxapp-clang/4e0d197768414f0c9b14a5d32b3c0e06/dpdk/mk/rte.sdkbuild.mk:49: recipe for target 'lib' failed
make[3]: *** [lib] Error 2
/tmp/UB1604_K4.4.0_GCC5.4.0/x86_64-native-linuxapp-clang/4e0d197768414f0c9b14a5d32b3c0e06/dpdk/mk/rte.sdkroot.mk:100: recipe for target 'all' failed
make[2]: *** [all] Error 2
/tmp/UB1604_K4.4.0_GCC5.4.0/x86_64-native-linuxapp-clang/4e0d197768414f0c9b14a5d32b3c0e06/dpdk/mk/rte.sdkinstall.mk:57: recipe for target 'pre_install' failed
make[1]: *** [pre_install] Error 2
/tmp/UB1604_K4.4.0_GCC5.4.0/x86_64-native-linuxapp-clang/4e0d197768414f0c9b14a5d32b3c0e06/dpdk/mk/rte.sdkroot.mk:79: recipe for target 'install' failed
make: *** [install] Error 2

*Failed Build #9:
OS: UB1604
Target: i686-native-linuxapp-gcc
  SYMLINK-FILE include/rte_bpf.h
  SYMLINK-FILE include/rte_bpf_ethdev.h
  CC bpf.o
  SYMLINK-FILE include/rte_telemetry.h
  CC rte_telemetry.o
/tmp/UB1604_K4.4.0_GCC5.4.0/i686-native-linuxapp-gcc/4e0d197768414f0c9b14a5d32b3c0e06/dpdk/lib/librte_telemetry/rte_telemetry.c:9:21: fatal error: jansson.h: No such file or directory
compilation terminated.
/tmp/UB1604_K4.4.0_GCC5.4.0/i686-native-linuxapp-gcc/4e0d197768414f0c9b14a5d32b3c0e06/dpdk/mk/internal/rte.compile-pre.mk:114: recipe for target 'rte_telemetry.o' failed
make[5]: *** [rte_telemetry.o] Error 1
/tmp/UB1604_K4.4.0_GCC5.4.0/i686-native-linuxapp-gcc/4e0d197768414f0c9b14a5d32b3c0e06/dpdk/mk/rte.subdir.mk:35: recipe for target 'librte_telemetry' failed
make[4]: *** [librte_telemetry] Error 2
make[4]: *** Waiting for unfinished jobs....
  CC bpf_exec.o
  CC bpf_load.o
  CC bpf_pkt.o
  CC bpf_validate.o
  AR librte_bpf.a
  INSTALL-LIB librte_bpf.a
/tmp/UB1604_K4.4.0_GCC5.4.0/i686-native-linuxapp-gcc/4e0d197768414f0c9b14a5d32b3c0e06/dpdk/mk/rte.sdkbuild.mk:49: recipe for target 'lib' failed
make[3]: *** [lib] Error 2
/tmp/UB1604_K4.4.0_GCC5.4.0/i686-native-linuxapp-gcc/4e0d197768414f0c9b14a5d32b3c0e06/dpdk/mk/rte.sdkroot.mk:100: recipe for target 'all' failed
make[2]: *** [all] Error 2
/tmp/UB1604_K4.4.0_GCC5.4.0/i686-native-linuxapp-gcc/4e0d197768414f0c9b14a5d32b3c0e06/dpdk/mk/rte.sdkinstall.mk:57: recipe for target 'pre_install' failed
make[1]: *** [pre_install] Error 2
/tmp/UB1604_K4.4.0_GCC5.4.0/i686-native-linuxapp-gcc/4e0d197768414f0c9b14a5d32b3c0e06/dpdk/mk/rte.sdkroot.mk:79: recipe for target 'install' failed
make: *** [install] Error 2

*Failed Build #10:
OS: FreeBSD
Target: x86_64-native-bsdapp-clang
  CC bpf_pkt.o
  CC bpf_validate.o
== Build lib/librte_telemetry
  SYMLINK-FILE include/rte_telemetry.h
  CC rte_telemetry.o
/tmp/FreeBSD_K10.3_GCC4.8.5/x86_64-native-bsdapp-clang/4e0d197768414f0c9b14a5d32b3c0e06/dpdk/lib/librte_telemetry/rte_telemetry.c:9:10: fatal error: 'jansson.h' file not found
#include <jansson.h>
         ^
1 error generated.
/tmp/FreeBSD_K10.3_GCC4.8.5/x86_64-native-bsdapp-clang/4e0d197768414f0c9b14a5d32b3c0e06/dpdk/mk/internal/rte.compile-pre.mk:114: recipe for target 'rte_telemetry.o' failed
gmake[5]: *** [rte_telemetry.o] Error 1
/tmp/FreeBSD_K10.3_GCC4.8.5/x86_64-native-bsdapp-clang/4e0d197768414f0c9b14a5d32b3c0e06/dpdk/mk/rte.subdir.mk:35: recipe for target 'librte_telemetry' failed
gmake[4]: *** [librte_telemetry] Error 2
gmake[4]: *** Waiting for unfinished jobs....
  CC bpf_jit_x86.o
  AR librte_bpf.a
  INSTALL-LIB librte_bpf.a
/tmp/FreeBSD_K10.3_GCC4.8.5/x86_64-native-bsdapp-clang/4e0d197768414f0c9b14a5d32b3c0e06/dpdk/mk/rte.sdkbuild.mk:49: recipe for target 'lib' failed
gmake[3]: *** [lib] Error 2
/tmp/FreeBSD_K10.3_GCC4.8.5/x86_64-native-bsdapp-clang/4e0d197768414f0c9b14a5d32b3c0e06/dpdk/mk/rte.sdkroot.mk:100: recipe for target 'all' failed
gmake[2]: *** [all] Error 2
/tmp/FreeBSD_K10.3_GCC4.8.5/x86_64-native-bsdapp-clang/4e0d197768414f0c9b14a5d32b3c0e06/dpdk/mk/rte.sdkinstall.mk:57: recipe for target 'pre_install' failed
gmake[1]: *** [pre_install] Error 2
/tmp/FreeBSD_K10.3_GCC4.8.5/x86_64-native-bsdapp-clang/4e0d197768414f0c9b14a5d32b3c0e06/dpdk/mk/rte.sdkroot.mk:79: recipe for target 'install' failed
gmake: *** [install] Error 2

*Failed Build #11:
OS: FC24
Target: x86_64-native-linuxapp-clang
  CC bpf_validate.o
  CC bpf_jit_x86.o
== Build lib/librte_telemetry
  SYMLINK-FILE include/rte_telemetry.h
  CC rte_telemetry.o
/tmp/FC24_K4.9.13_GCC6.2.1/x86_64-native-linuxapp-clang/4e0d197768414f0c9b14a5d32b3c0e06/dpdk/lib/librte_telemetry/rte_telemetry.c:9:10: fatal error: 'jansson.h' file not found
#include <jansson.h>
         ^
1 error generated.
/tmp/FC24_K4.9.13_GCC6.2.1/x86_64-native-linuxapp-clang/4e0d197768414f0c9b14a5d32b3c0e06/dpdk/mk/internal/rte.compile-pre.mk:114: recipe for target 'rte_telemetry.o' failed
make[5]: *** [rte_telemetry.o] Error 1
/tmp/FC24_K4.9.13_GCC6.2.1/x86_64-native-linuxapp-clang/4e0d197768414f0c9b14a5d32b3c0e06/dpdk/mk/rte.subdir.mk:35: recipe for target 'librte_telemetry' failed
make[4]: *** [librte_telemetry] Error 2
make[4]: *** Waiting for unfinished jobs....
  AR librte_bpf.a
  INSTALL-LIB librte_bpf.a
/tmp/FC24_K4.9.13_GCC6.2.1/x86_64-native-linuxapp-clang/4e0d197768414f0c9b14a5d32b3c0e06/dpdk/mk/rte.sdkbuild.mk:49: recipe for target 'lib' failed
make[3]: *** [lib] Error 2
/tmp/FC24_K4.9.13_GCC6.2.1/x86_64-native-linuxapp-clang/4e0d197768414f0c9b14a5d32b3c0e06/dpdk/mk/rte.sdkroot.mk:100: recipe for target 'all' failed
make[2]: *** [all] Error 2
/tmp/FC24_K4.9.13_GCC6.2.1/x86_64-native-linuxapp-clang/4e0d197768414f0c9b14a5d32b3c0e06/dpdk/mk/rte.sdkinstall.mk:57: recipe for target 'pre_install' failed
make[1]: *** [pre_install] Error 2
/tmp/FC24_K4.9.13_GCC6.2.1/x86_64-native-linuxapp-clang/4e0d197768414f0c9b14a5d32b3c0e06/dpdk/mk/rte.sdkroot.mk:79: recipe for target 'install' failed
make: *** [install] Error 2

*Failed Build #12:
OS: FC25
Target: x86_64-native-linuxapp-gcc-debug
  AR librte_gso.a
  INSTALL-LIB librte_gso.a
== Build lib/librte_telemetry
  SYMLINK-FILE include/rte_telemetry.h
  CC rte_telemetry.o
/tmp/FC25_K4.8.6_GCC6.3.1/x86_64-native-linuxapp-gcc-debug/4e0d197768414f0c9b14a5d32b3c0e06/dpdk/lib/librte_telemetry/rte_telemetry.c:9:21: fatal error: jansson.h: No such file or directory
 #include <jansson.h>
                     ^
compilation terminated.
/tmp/FC25_K4.8.6_GCC6.3.1/x86_64-native-linuxapp-gcc-debug/4e0d197768414f0c9b14a5d32b3c0e06/dpdk/mk/internal/rte.compile-pre.mk:114: recipe for target 'rte_telemetry.o' failed
make[5]: *** [rte_telemetry.o] Error 1
/tmp/FC25_K4.8.6_GCC6.3.1/x86_64-native-linuxapp-gcc-debug/4e0d197768414f0c9b14a5d32b3c0e06/dpdk/mk/rte.subdir.mk:35: recipe for target 'librte_telemetry' failed
make[4]: *** [librte_telemetry] Error 2
make[4]: *** Waiting for unfinished jobs....
  CC bpf_pkt.o
  CC bpf_validate.o
  CC bpf_jit_x86.o
  AR librte_bpf.a
  INSTALL-LIB librte_bpf.a
/tmp/FC25_K4.8.6_GCC6.3.1/x86_64-native-linuxapp-gcc-debug/4e0d197768414f0c9b14a5d32b3c0e06/dpdk/mk/rte.sdkbuild.mk:49: recipe for target 'lib' failed
make[3]: *** [lib] Error 2
/tmp/FC25_K4.8.6_GCC6.3.1/x86_64-native-linuxapp-gcc-debug/4e0d197768414f0c9b14a5d32b3c0e06/dpdk/mk/rte.sdkroot.mk:100: recipe for target 'all' failed
make[2]: *** [all] Error 2
/tmp/FC25_K4.8.6_GCC6.3.1/x86_64-native-linuxapp-gcc-debug/4e0d197768414f0c9b14a5d32b3c0e06/dpdk/mk/rte.sdkinstall.mk:57: recipe for target 'pre_install' failed
make[1]: *** [pre_install] Error 2
/tmp/FC25_K4.8.6_GCC6.3.1/x86_64-native-linuxapp-gcc-debug/4e0d197768414f0c9b14a5d32b3c0e06/dpdk/mk/rte.sdkroot.mk:79: recipe for target 'install' failed
make: *** [install] Error 2

*Failed Build #13:
OS: FreeBSD
Target: x86_64-native-bsdapp-gcc
  SYMLINK-FILE include/rte_bpf.h
  SYMLINK-FILE include/rte_bpf_ethdev.h
  CC bpf.o
  SYMLINK-FILE include/rte_telemetry.h
  CC rte_telemetry.o
/tmp/FreeBSD_K10.3_GCC4.8.5/x86_64-native-bsdapp-gcc/4e0d197768414f0c9b14a5d32b3c0e06/dpdk/lib/librte_telemetry/rte_telemetry.c:9:21: fatal error: jansson.h: No such file or directory
 #include <jansson.h>
                     ^
compilation terminated.
/tmp/FreeBSD_K10.3_GCC4.8.5/x86_64-native-bsdapp-gcc/4e0d197768414f0c9b14a5d32b3c0e06/dpdk/mk/internal/rte.compile-pre.mk:114: recipe for target 'rte_telemetry.o' failed
gmake[5]: *** [rte_telemetry.o] Error 1
/tmp/FreeBSD_K10.3_GCC4.8.5/x86_64-native-bsdapp-gcc/4e0d197768414f0c9b14a5d32b3c0e06/dpdk/mk/rte.subdir.mk:35: recipe for target 'librte_telemetry' failed
gmake[4]: *** [librte_telemetry] Error 2
gmake[4]: *** Waiting for unfinished jobs....
  CC bpf_exec.o
  CC bpf_load.o
  CC bpf_pkt.o
  CC bpf_validate.o
  CC bpf_jit_x86.o
  AR librte_bpf.a
  INSTALL-LIB librte_bpf.a
/tmp/FreeBSD_K10.3_GCC4.8.5/x86_64-native-bsdapp-gcc/4e0d197768414f0c9b14a5d32b3c0e06/dpdk/mk/rte.sdkbuild.mk:49: recipe for target 'lib' failed
gmake[3]: *** [lib] Error 2
/tmp/FreeBSD_K10.3_GCC4.8.5/x86_64-native-bsdapp-gcc/4e0d197768414f0c9b14a5d32b3c0e06/dpdk/mk/rte.sdkroot.mk:100: recipe for target 'all' failed
gmake[2]: *** [all] Error 2
/tmp/FreeBSD_K10.3_GCC4.8.5/x86_64-native-bsdapp-gcc/4e0d197768414f0c9b14a5d32b3c0e06/dpdk/mk/rte.sdkinstall.mk:57: recipe for target 'pre_install' failed
gmake[1]: *** [pre_install] Error 2
/tmp/FreeBSD_K10.3_GCC4.8.5/x86_64-native-bsdapp-gcc/4e0d197768414f0c9b14a5d32b3c0e06/dpdk/mk/rte.sdkroot.mk:79: recipe for target 'install' failed
gmake: *** [install] Error 2

*Failed Build #14:
OS: FC24
Target: i686-native-linuxapp-gcc
  INSTALL-LIB librte_gso.a
== Build lib/librte_telemetry
  SYMLINK-FILE include/rte_telemetry.h
  CC bpf_exec.o
  CC rte_telemetry.o
/tmp/FC24_K4.5.5_GCC6.1.1/i686-native-linuxapp-gcc/4e0d197768414f0c9b14a5d32b3c0e06/dpdk/lib/librte_telemetry/rte_telemetry.c:9:21: fatal error: jansson.h: No such file or directory
 #include <jansson.h>
                     ^
compilation terminated.
/tmp/FC24_K4.5.5_GCC6.1.1/i686-native-linuxapp-gcc/4e0d197768414f0c9b14a5d32b3c0e06/dpdk/mk/internal/rte.compile-pre.mk:114: recipe for target 'rte_telemetry.o' failed
make[5]: *** [rte_telemetry.o] Error 1
/tmp/FC24_K4.5.5_GCC6.1.1/i686-native-linuxapp-gcc/4e0d197768414f0c9b14a5d32b3c0e06/dpdk/mk/rte.subdir.mk:35: recipe for target 'librte_telemetry' failed
make[4]: *** [librte_telemetry] Error 2
make[4]: *** Waiting for unfinished jobs....
  CC bpf_load.o
  CC bpf_pkt.o
  CC bpf_validate.o
  AR librte_bpf.a
  INSTALL-LIB librte_bpf.a
/tmp/FC24_K4.5.5_GCC6.1.1/i686-native-linuxapp-gcc/4e0d197768414f0c9b14a5d32b3c0e06/dpdk/mk/rte.sdkbuild.mk:49: recipe for target 'lib' failed
make[3]: *** [lib] Error 2
/tmp/FC24_K4.5.5_GCC6.1.1/i686-native-linuxapp-gcc/4e0d197768414f0c9b14a5d32b3c0e06/dpdk/mk/rte.sdkroot.mk:100: recipe for target 'all' failed
make[2]: *** [all] Error 2
/tmp/FC24_K4.5.5_GCC6.1.1/i686-native-linuxapp-gcc/4e0d197768414f0c9b14a5d32b3c0e06/dpdk/mk/rte.sdkinstall.mk:57: recipe for target 'pre_install' failed
make[1]: *** [pre_install] Error 2
/tmp/FC24_K4.5.5_GCC6.1.1/i686-native-linuxapp-gcc/4e0d197768414f0c9b14a5d32b3c0e06/dpdk/mk/rte.sdkroot.mk:79: recipe for target 'install' failed
make: *** [install] Error 2

*Failed Build #15:
OS: FC24
Target: x86_64-native-linuxapp-gcc-shared
  INSTALL-LIB librte_gso.so.1.1
== Build lib/librte_telemetry
  CC bpf_pkt.o
  SYMLINK-FILE include/rte_telemetry.h
  CC rte_telemetry.o
/tmp/FC24_K4.9.13_GCC6.2.1/x86_64-native-linuxapp-gcc-shared/4e0d197768414f0c9b14a5d32b3c0e06/dpdk/lib/librte_telemetry/rte_telemetry.c:9:21: fatal error: jansson.h: No such file or directory
 #include <jansson.h>
                     ^
compilation terminated.
/tmp/FC24_K4.9.13_GCC6.2.1/x86_64-native-linuxapp-gcc-shared/4e0d197768414f0c9b14a5d32b3c0e06/dpdk/mk/internal/rte.compile-pre.mk:114: recipe for target 'rte_telemetry.o' failed
make[5]: *** [rte_telemetry.o] Error 1
/tmp/FC24_K4.9.13_GCC6.2.1/x86_64-native-linuxapp-gcc-shared/4e0d197768414f0c9b14a5d32b3c0e06/dpdk/mk/rte.subdir.mk:35: recipe for target 'librte_telemetry' failed
make[4]: *** [librte_telemetry] Error 2
make[4]: *** Waiting for unfinished jobs....
  CC bpf_validate.o
  CC bpf_jit_x86.o
  LD librte_bpf.so.1.1
  INSTALL-LIB librte_bpf.so.1.1
/tmp/FC24_K4.9.13_GCC6.2.1/x86_64-native-linuxapp-gcc-shared/4e0d197768414f0c9b14a5d32b3c0e06/dpdk/mk/rte.sdkbuild.mk:49: recipe for target 'lib' failed
make[3]: *** [lib] Error 2
/tmp/FC24_K4.9.13_GCC6.2.1/x86_64-native-linuxapp-gcc-shared/4e0d197768414f0c9b14a5d32b3c0e06/dpdk/mk/rte.sdkroot.mk:100: recipe for target 'all' failed
make[2]: *** [all] Error 2
/tmp/FC24_K4.9.13_GCC6.2.1/x86_64-native-linuxapp-gcc-shared/4e0d197768414f0c9b14a5d32b3c0e06/dpdk/mk/rte.sdkinstall.mk:57: recipe for target 'pre_install' failed
make[1]: *** [pre_install] Error 2
/tmp/FC24_K4.9.13_GCC6.2.1/x86_64-native-linuxapp-gcc-shared/4e0d197768414f0c9b14a5d32b3c0e06/dpdk/mk/rte.sdkroot.mk:79: recipe for target 'install' failed
make: *** [install] Error 2

DPDK STV team


More information about the test-report mailing list