[dpdk-test-report] |FAILURE| pw43843doc: fix wrong usage of bind command

sys_stv at intel.com sys_stv at intel.com
Fri Aug 24 09:57:11 CEST 2018


Test-Label: Intel-compilation
Test-Status: FAILURE
http://dpdk.org/patch/43843

_Compilation issues_

Submitter: Rami Rosen <ramirose at gmail.com>
Date: 2018-08-24 07:43:02
DPDK git baseline: Repo:dpdk-master, CommitID: 7281cf520f890a5e779596c872e2440af7131eae

Build Summary: 15 Builds Done, 14 Successful, 1 Failures

Test environment and configuration as below:

OS: FC25
	Kernel Version: 4.9.13-100.fc24.x86_64
	CPU info: Intel(R) Xeon(R) CPU E5-2699 v3 @ 2.30GHz
	GCC Version: gcc (GCC) 6.2.1 20160916 (Red Hat 6.2.1-2)
	Clang Version: 3.8.0 (tags/RELEASE_380/final)
	x86_64-native-linuxapp-gcc
	x86_64-native-linuxapp-gcc-debug

OS: FC24
	Kernel Version: 4.9.13-100.fc24.x86_64
	CPU info: Intel(R) Xeon(R) CPU E5-2699 v3 @ 2.30GHz
	GCC Version: gcc (GCC) 6.2.1 20160916 (Red Hat 6.2.1-2)
	Clang Version: 3.8.0 (tags/RELEASE_380/final)
	i686-native-linuxapp-gcc
	x86_64-native-linuxapp-gcc-shared
	x86_64-native-linuxapp-clang

OS: CENTOS
	Kernel Version: 
	CPU info: 
	GCC Version: 
	Clang Version: NA
	x86_64-native-linuxapp-gcc-shared
	i686-native-linuxapp-gcc
	x86_64-native-linuxapp-clang
	x86_64-native-linuxapp-gcc

OS: UB1604
	Kernel Version: 4.4.0-78-generic
	CPU info: Intel(R) Xeon(R) CPU E5-2699 v3 @ 2.30GHz
	GCC Version: gcc (Ubuntu 5.4.0-6ubuntu1~16.04.10) 5.4.0 20160609
	Clang Version: 3.8.0-2ubuntu4 (tags/RELEASE_380/final)
	x86_64-native-linuxapp-gcc
	x86_64-native-linuxapp-clang
	x86_64-native-linuxapp-gcc-shared
	i686-native-linuxapp-gcc

OS: FreeBSD
	Kernel Version: 10.3-RELEASE
	CPU info: Intel(R) Xeon(R) CPU E5-2699 v3 @ 2.30GHz (2294.76-MHz K8-class CPU)
	GCC Version: gcc (FreeBSD Ports Collection) 4.8.5
	Clang Version: 3.4.1 (tags/RELEASE_34/dot1-final 208032) 20140512
	x86_64-native-bsdapp-clang
	x86_64-native-bsdapp-gcc

*Failed Build #1:
OS: CENTOS
Target: x86_64-native-linuxapp-gcc
  CC ifpga_enumerate.o
  CC ifpga_feature_dev.o
  CC ifpga_fme.o
  CC ifpga_fme_iperf.o
  CC ifpga_fme_dperf.o
  CC ifpga_fme_error.o
  CC ifpga_port.o
  CC ifpga_port_error.o
  CC opae_hw_api.o
  CC opae_ifpga_hw_api.o
  CC opae_debug.o
  AR librte_pmd_dpaa2_qdma.a
  INSTALL-LIB librte_pmd_dpaa2_qdma.a
--
== Build app/test-bbdev
  CC cmdline.o
  CC main.o
  CC test_bbdev.o
  CC test_bbdev_perf.o
/tmp/CENTOS_K3.10.0_GCC4.8.5/x86_64-native-linuxapp-gcc/65130fdced44441b9b3cd4b49ed59f77/dpdk/app/test-bbdev/test_bbdev_perf.c:1:0: fatal error: can’t open /tmp/ccop0dne.s for writing: Input/output error
compilation terminated.
Cannot create temporary file in /tmp/: Input/output error
/bin/sh: line 1: 10780 Aborted                 gcc -Wp,-MD,./.test_bbdev_perf.o.d.tmp -m64 -pthread -march=native -DRTE_MACHINE_CPUFLAG_SSE -DRTE_MACHINE_CPUFLAG_SSE2 -DRTE_MACHINE_CPUFLAG_SSE3 -DRTE_MACHINE_CPUFLAG_SSSE3 -DRTE_MACHINE_CPUFLAG_SSE4_1 -DRTE_MACHINE_CPUFLAG_SSE4_2 -DRTE_MACHINE_CPUFLAG_AES -DRTE_MACHINE_CPUFLAG_PCLMULQDQ -DRTE_MACHINE_CPUFLAG_AVX -DRTE_MACHINE_CPUFLAG_RDRAND -DRTE_MACHINE_CPUFLAG_FSGSBASE -DRTE_MACHINE_CPUFLAG_F16C -DRTE_MACHINE_CPUFLAG_AVX2 -I/tmp/CENTOS_K3.10.0_GCC4.8.5/x86_64-native-linuxapp-gcc/65130fdced44441b9b3cd4b49ed59f77/dpdk/x86_64-native-linuxapp-gcc/include -include /tmp/CENTOS_K3.10.0_GCC4.8.5/x86_64-native-linuxapp-gcc/65130fdced44441b9b3cd4b49ed59f77/dpdk/x86_64-native-linuxapp-gcc/include/rte_config.h -DALLOW_EXPERIMENTAL_API -O3 -W -Wall -Wstrict-prototypes -Wmissing-prototypes -Wmissing-declarations -Wold-style-definition -Wpointer-arith -Wcast-align -Wnested-externs -Wcast-qual -Wformat-nonliteral -Wformat-security -Wundef -Wwrite-strings -Wdeprecated -o test_bbdev_perf.o -c /tmp/CENTOS_K3.10.0_GCC4.8.5/x86_64-native-linuxapp-gcc/65130fdced44441b9b3cd4b49ed59f77/dpdk/app/test-bbdev/test_bbdev_perf.c
make[5]: *** [test_bbdev_perf.o] Error 134
make[4]: *** [test-bbdev] Error 2
make[4]: *** Waiting for unfinished jobs....
make[5]: execvp: /bin/sh: Input/output error
make[5]: stat: cmdline_mtr.o: Input/output error
make[5]: *** No rule to make target `cmdline_mtr.o', needed by `testpmd'.  Stop.
make[5]: *** Waiting for unfinished jobs....
make[5]: *** [cmdline_flow.o] Error 127
/tmp/CENTOS_K3.10.0_GCC4.8.5/x86_64-native-linuxapp-gcc/65130fdced44441b9b3cd4b49ed59f77/dpdk/app/test-pmd/cmdline.c:17938:1: fatal error: error writing to /tmp/cc0tsxSx.s: Input/output error
compilation terminated.
Cannot create temporary file in /tmp/: Input/output error
/bin/sh: line 1: 10600 Aborted                 gcc -Wp,-MD,./.cmdline.o.d.tmp -m64 -pthread -march=native -DRTE_MACHINE_CPUFLAG_SSE -DRTE_MACHINE_CPUFLAG_SSE2 -DRTE_MACHINE_CPUFLAG_SSE3 -DRTE_MACHINE_CPUFLAG_SSSE3 -DRTE_MACHINE_CPUFLAG_SSE4_1 -DRTE_MACHINE_CPUFLAG_SSE4_2 -DRTE_MACHINE_CPUFLAG_AES -DRTE_MACHINE_CPUFLAG_PCLMULQDQ -DRTE_MACHINE_CPUFLAG_AVX -DRTE_MACHINE_CPUFLAG_RDRAND -DRTE_MACHINE_CPUFLAG_FSGSBASE -DRTE_MACHINE_CPUFLAG_F16C -DRTE_MACHINE_CPUFLAG_AVX2 -I/tmp/CENTOS_K3.10.0_GCC4.8.5/x86_64-native-linuxapp-gcc/65130fdced44441b9b3cd4b49ed59f77/dpdk/x86_64-native-linuxapp-gcc/include -include /tmp/CENTOS_K3.10.0_GCC4.8.5/x86_64-native-linuxapp-gcc/65130fdced44441b9b3cd4b49ed59f77/dpdk/x86_64-native-linuxapp-gcc/include/rte_config.h -DALLOW_EXPERIMENTAL_API -O3 -W -Wall -Wstrict-prototypes -Wmissing-prototypes -Wmissing-declarations -Wold-style-definition -Wpointer-arith -Wcast-align -Wnested-externs -Wcast-qual -Wformat-nonliteral -Wformat-security -Wundef -Wwrite-strings -Wdeprecated -Wno-deprecated-declarations -D_GNU_SOURCE -o cmdline.o -c /tmp/CENTOS_K3.10.0_GCC4.8.5/x86_64-native-linuxapp-gcc/65130fdced44441b9b3cd4b49ed59f77/dpdk/app/test-pmd/cmdline.c
make[5]: *** [cmdline.o] Error 134
make[4]: *** [test-pmd] Error 2
make[3]: *** [app] Error 2
make[2]: *** [all] Error 2

DPDK STV team


More information about the test-report mailing list