[dpdk-test-report] |FAILURE| pw43998[4/5] event/dpaa2: support Max event port value

sys_stv at intel.com sys_stv at intel.com
Thu Aug 30 08:17:27 CEST 2018


Test-Label: Intel-compilation
Test-Status: FAILURE
http://dpdk.org/patch/43998

_Compilation issues_

Submitter: Hemant Agrawal <hemant.agrawal at nxp.com>
Date: 2018-08-30 06:03:58
DPDK git baseline: Repo:dpdk-master, CommitID: 3605968c2fa783674624562a7dfab256eb9044ea

Build Summary: 15 Builds Done, 12 Successful, 3 Failures

Test environment and configuration as below:

OS: FC25
	Kernel Version: 4.9.13-100.fc24.x86_64
	CPU info: Intel(R) Xeon(R) CPU E5-2699 v3 @ 2.30GHz
	GCC Version: gcc (GCC) 6.2.1 20160916 (Red Hat 6.2.1-2)
	Clang Version: 3.8.0 (tags/RELEASE_380/final)
	x86_64-native-linuxapp-gcc
	x86_64-native-linuxapp-gcc-debug

OS: FC24
	Kernel Version: 4.9.13-100.fc24.x86_64
	CPU info: Intel(R) Xeon(R) CPU E5-2699 v3 @ 2.30GHz
	GCC Version: gcc (GCC) 6.2.1 20160916 (Red Hat 6.2.1-2)
	Clang Version: 3.8.0 (tags/RELEASE_380/final)
	i686-native-linuxapp-gcc
	x86_64-native-linuxapp-clang
	x86_64-native-linuxapp-gcc-shared

OS: CENTOS
	Kernel Version: 3.10.0-514.10.2.el7.x86_64
	CPU info: Intel(R) Xeon(R) CPU E5-2699 v3 @ 2.30GHz
	GCC Version: gcc (GCC) 4.8.5 20150623 (Red Hat 4.8.5-4)
	Clang Version: 3.4.2 (tags/RELEASE_34/dot2-final)
	i686-native-linuxapp-gcc
	x86_64-native-linuxapp-gcc-shared
	x86_64-native-linuxapp-gcc
	x86_64-native-linuxapp-clang

OS: UB1604
	Kernel Version: 4.4.0-128-generic
	CPU info: Intel(R) Xeon(R) CPU E5-2699 v3 @ 2.30GHz
	GCC Version: gcc (Ubuntu 5.4.0-6ubuntu1~16.04.10) 5.4.0 20160609
	Clang Version: 3.8.0-2ubuntu4 (tags/RELEASE_380/final)
	x86_64-native-linuxapp-gcc
	x86_64-native-linuxapp-clang
	i686-native-linuxapp-gcc
	x86_64-native-linuxapp-gcc-shared

OS: FreeBSD
	Kernel Version: 10.3-RELEASE
	CPU info: Intel(R) Xeon(R) CPU E5-2699 v3 @ 2.30GHz (2294.76-MHz K8-class CPU)
	GCC Version: gcc (FreeBSD Ports Collection) 4.8.5
	Clang Version: 3.4.1 (tags/RELEASE_34/dot1-final 208032) 20140512
	x86_64-native-bsdapp-clang
	x86_64-native-bsdapp-gcc

*Failed Build #1:
OS: CENTOS
Target: i686-native-linuxapp-gcc
  PMDINFO dpaa2_hw_dpcon.o.pmd.c
  CC dpaa2_hw_dpcon.o.pmd.o
  LD dpaa2_hw_dpcon.o
  CC dpaa2_eventdev.o
/tmp/CENTOS_K3.10.0_GCC4.8.5/i686-native-linuxapp-gcc/7ae31965d3fb45588ff19899cf8ccc93/dpdk/drivers/event/dpaa2/dpaa2_eventdev.c: In function ‘dpaa2_eventdev_enqueue_burst’:
/tmp/CENTOS_K3.10.0_GCC4.8.5/i686-native-linuxapp-gcc/7ae31965d3fb45588ff19899cf8ccc93/dpdk/drivers/event/dpaa2/dpaa2_eventdev.c:176:2: error: ‘for’ loop initial declarations are only allowed in C99 mode
  for (int n = 0; n < i; n++) {
  ^
/tmp/CENTOS_K3.10.0_GCC4.8.5/i686-native-linuxapp-gcc/7ae31965d3fb45588ff19899cf8ccc93/dpdk/drivers/event/dpaa2/dpaa2_eventdev.c:176:2: note: use option -std=c99 or -std=gnu99 to compile your code
make[6]: *** [dpaa2_eventdev.o] Error 1
make[5]: *** [dpaa2] Error 2

*Failed Build #2:
OS: CENTOS
Target: x86_64-native-linuxapp-gcc-shared
  CC dpaa2_hw_dpcon.o.pmd.o
  LD dpaa2_hw_dpcon.o
  CC dpaa2_eventdev.o
  CC sw_evdev_selftest.o
/tmp/CENTOS_K3.10.0_GCC4.8.5/x86_64-native-linuxapp-gcc-shared/7ae31965d3fb45588ff19899cf8ccc93/dpdk/drivers/event/dpaa2/dpaa2_eventdev.c: In function ‘dpaa2_eventdev_enqueue_burst’:
/tmp/CENTOS_K3.10.0_GCC4.8.5/x86_64-native-linuxapp-gcc-shared/7ae31965d3fb45588ff19899cf8ccc93/dpdk/drivers/event/dpaa2/dpaa2_eventdev.c:176:2: error: ‘for’ loop initial declarations are only allowed in C99 mode
  for (int n = 0; n < i; n++) {
  ^
/tmp/CENTOS_K3.10.0_GCC4.8.5/x86_64-native-linuxapp-gcc-shared/7ae31965d3fb45588ff19899cf8ccc93/dpdk/drivers/event/dpaa2/dpaa2_eventdev.c:176:2: note: use option -std=c99 or -std=gnu99 to compile your code
make[6]: *** [dpaa2_eventdev.o] Error 1
make[5]: *** [dpaa2] Error 2

*Failed Build #3:
OS: CENTOS
Target: x86_64-native-linuxapp-gcc
  CC dpaa2_hw_dpcon.o.pmd.o
  LD dpaa2_hw_dpcon.o
  CC dpaa2_eventdev.o
  CC sw_evdev_selftest.o
/tmp/CENTOS_K3.10.0_GCC4.8.5/x86_64-native-linuxapp-gcc/7ae31965d3fb45588ff19899cf8ccc93/dpdk/drivers/event/dpaa2/dpaa2_eventdev.c: In function ‘dpaa2_eventdev_enqueue_burst’:
/tmp/CENTOS_K3.10.0_GCC4.8.5/x86_64-native-linuxapp-gcc/7ae31965d3fb45588ff19899cf8ccc93/dpdk/drivers/event/dpaa2/dpaa2_eventdev.c:176:2: error: ‘for’ loop initial declarations are only allowed in C99 mode
  for (int n = 0; n < i; n++) {
  ^
/tmp/CENTOS_K3.10.0_GCC4.8.5/x86_64-native-linuxapp-gcc/7ae31965d3fb45588ff19899cf8ccc93/dpdk/drivers/event/dpaa2/dpaa2_eventdev.c:176:2: note: use option -std=c99 or -std=gnu99 to compile your code
make[6]: *** [dpaa2_eventdev.o] Error 1
make[5]: *** [dpaa2] Error 2

DPDK STV team


More information about the test-report mailing list