[dpdk-test-report] |FAILURE| pw44051[4/5] net/nfp: check hugepages IOVAs based on DMA mask

sys_stv at intel.com sys_stv at intel.com
Thu Aug 30 17:32:29 CEST 2018


Test-Label: Intel-compilation
Test-Status: FAILURE
http://dpdk.org/patch/44051

_Compilation issues_

Submitter: Alejandro Lucero <alejandro.lucero at netronome.com>
Date: 2018-08-30 15:21:31
DPDK git baseline: Repo:dpdk-master, CommitID: 3605968c2fa783674624562a7dfab256eb9044ea

Build Summary: 15 Builds Done, 3 Successful, 12 Failures

Test environment and configuration as below:

OS: FC25
	Kernel Version: 4.9.13-100.fc24.x86_64
	CPU info: Intel(R) Xeon(R) CPU E5-2699 v3 @ 2.30GHz
	GCC Version: gcc (GCC) 6.2.1 20160916 (Red Hat 6.2.1-2)
	Clang Version: 3.8.0 (tags/RELEASE_380/final)
	x86_64-native-linuxapp-gcc
	x86_64-native-linuxapp-gcc-debug

OS: FC24
	Kernel Version: 4.9.13-100.fc24.x86_64
	CPU info: Intel(R) Xeon(R) CPU E5-2699 v3 @ 2.30GHz
	GCC Version: gcc (GCC) 6.3.1 20161221 (Red Hat 6.3.1-1)
	Clang Version: 3.8.0 (tags/RELEASE_380/final)
	x86_64-native-linuxapp-clang
	x86_64-native-linuxapp-gcc-shared
	i686-native-linuxapp-gcc

OS: CENTOS
	Kernel Version: 3.10.0-327.el7.x86_64
	CPU info: Intel(R) Xeon(R) CPU E5-2699 v3 @ 2.30GHz
	GCC Version: gcc (GCC) 4.8.5 20150623 (Red Hat 4.8.5-28)
	Clang Version: NA
	x86_64-native-linuxapp-gcc-shared
	x86_64-native-linuxapp-clang
	x86_64-native-linuxapp-gcc
	i686-native-linuxapp-gcc

OS: UB1604
	Kernel Version: 4.4.0-78-generic
	CPU info: Intel(R) Xeon(R) CPU E5-2699 v3 @ 2.30GHz
	GCC Version: gcc (Ubuntu 5.4.0-6ubuntu1~16.04.10) 5.4.0 20160609
	Clang Version: 3.8.0-2ubuntu4 (tags/RELEASE_380/final)
	x86_64-native-linuxapp-gcc
	x86_64-native-linuxapp-gcc-shared
	x86_64-native-linuxapp-clang
	i686-native-linuxapp-gcc

OS: FreeBSD
	Kernel Version: 10.3-RELEASE
	CPU info: Intel(R) Xeon(R) CPU E5-2699 v3 @ 2.30GHz (2294.76-MHz K8-class CPU)
	GCC Version: gcc (FreeBSD Ports Collection) 4.8.5
	Clang Version: 3.4.1 (tags/RELEASE_34/dot1-final 208032) 20140512
	x86_64-native-bsdapp-clang
	x86_64-native-bsdapp-gcc

*Failed Build #1:
OS: FC25
Target: x86_64-native-linuxapp-gcc
  CC eal_common_log.o
  CC eal_common_launch.o
  CC eal_common_memalloc.o
  CC eal_common_memory.o
/tmp/FC25_K4.8.6_GCC6.3.1/x86_64-native-linuxapp-gcc/957df8d9b80f4e44af8a0904600fcc88/dpdk/lib/librte_eal/common/eal_common_memory.c: In function ‘rte_eal_check_dma_mask’:
/tmp/FC25_K4.8.6_GCC6.3.1/x86_64-native-linuxapp-gcc/957df8d9b80f4e44af8a0904600fcc88/dpdk/lib/librte_eal/common/eal_common_memory.c:454:17: error: ‘MAX_DMA_MASK_BITS’ undeclared (first use in this function)
  if (maskbits > MAX_DMA_MASK_BITS) {
                 ^~~~~~~~~~~~~~~~~
/tmp/FC25_K4.8.6_GCC6.3.1/x86_64-native-linuxapp-gcc/957df8d9b80f4e44af8a0904600fcc88/dpdk/lib/librte_eal/common/eal_common_memory.c:454:17: note: each undeclared identifier is reported only once for each function it appears in
/tmp/FC25_K4.8.6_GCC6.3.1/x86_64-native-linuxapp-gcc/957df8d9b80f4e44af8a0904600fcc88/dpdk/mk/internal/rte.compile-pre.mk:114: recipe for target 'eal_common_memory.o' failed
make[7]: *** [eal_common_memory.o] Error 1
make[7]: *** Waiting for unfinished jobs....
/tmp/FC25_K4.8.6_GCC6.3.1/x86_64-native-linuxapp-gcc/957df8d9b80f4e44af8a0904600fcc88/dpdk/mk/rte.subdir.mk:35: recipe for target 'eal' failed
make[6]: *** [eal] Error 2
/tmp/FC25_K4.8.6_GCC6.3.1/x86_64-native-linuxapp-gcc/957df8d9b80f4e44af8a0904600fcc88/dpdk/mk/rte.subdir.mk:35: recipe for target 'linuxapp' failed
make[5]: *** [linuxapp] Error 2
/tmp/FC25_K4.8.6_GCC6.3.1/x86_64-native-linuxapp-gcc/957df8d9b80f4e44af8a0904600fcc88/dpdk/mk/rte.subdir.mk:35: recipe for target 'librte_eal' failed
make[4]: *** [librte_eal] Error 2
/tmp/FC25_K4.8.6_GCC6.3.1/x86_64-native-linuxapp-gcc/957df8d9b80f4e44af8a0904600fcc88/dpdk/mk/rte.sdkbuild.mk:49: recipe for target 'lib' failed
make[3]: *** [lib] Error 2
/tmp/FC25_K4.8.6_GCC6.3.1/x86_64-native-linuxapp-gcc/957df8d9b80f4e44af8a0904600fcc88/dpdk/mk/rte.sdkroot.mk:100: recipe for target 'all' failed
make[2]: *** [all] Error 2
/tmp/FC25_K4.8.6_GCC6.3.1/x86_64-native-linuxapp-gcc/957df8d9b80f4e44af8a0904600fcc88/dpdk/mk/rte.sdkinstall.mk:57: recipe for target 'pre_install' failed
make[1]: *** [pre_install] Error 2
/tmp/FC25_K4.8.6_GCC6.3.1/x86_64-native-linuxapp-gcc/957df8d9b80f4e44af8a0904600fcc88/dpdk/mk/rte.sdkroot.mk:79: recipe for target 'install' failed
make: *** [install] Error 2

*Failed Build #2:
OS: UB1604
Target: x86_64-native-linuxapp-gcc
  CC eal_common_log.o
  CC eal_common_launch.o
  CC eal_common_memalloc.o
  CC eal_common_memory.o
/tmp/UB1604_K4.8.0_GCC6.2.0/x86_64-native-linuxapp-gcc/957df8d9b80f4e44af8a0904600fcc88/dpdk/lib/librte_eal/common/eal_common_memory.c: In function ‘rte_eal_check_dma_mask’:
/tmp/UB1604_K4.8.0_GCC6.2.0/x86_64-native-linuxapp-gcc/957df8d9b80f4e44af8a0904600fcc88/dpdk/lib/librte_eal/common/eal_common_memory.c:454:17: error: ‘MAX_DMA_MASK_BITS’ undeclared (first use in this function)
  if (maskbits > MAX_DMA_MASK_BITS) {
                 ^~~~~~~~~~~~~~~~~
/tmp/UB1604_K4.8.0_GCC6.2.0/x86_64-native-linuxapp-gcc/957df8d9b80f4e44af8a0904600fcc88/dpdk/lib/librte_eal/common/eal_common_memory.c:454:17: note: each undeclared identifier is reported only once for each function it appears in
/tmp/UB1604_K4.8.0_GCC6.2.0/x86_64-native-linuxapp-gcc/957df8d9b80f4e44af8a0904600fcc88/dpdk/mk/internal/rte.compile-pre.mk:114: recipe for target 'eal_common_memory.o' failed
make[7]: *** [eal_common_memory.o] Error 1
make[7]: *** Waiting for unfinished jobs....
/tmp/UB1604_K4.8.0_GCC6.2.0/x86_64-native-linuxapp-gcc/957df8d9b80f4e44af8a0904600fcc88/dpdk/mk/rte.subdir.mk:35: recipe for target 'eal' failed
make[6]: *** [eal] Error 2
/tmp/UB1604_K4.8.0_GCC6.2.0/x86_64-native-linuxapp-gcc/957df8d9b80f4e44af8a0904600fcc88/dpdk/mk/rte.subdir.mk:35: recipe for target 'linuxapp' failed
make[5]: *** [linuxapp] Error 2
/tmp/UB1604_K4.8.0_GCC6.2.0/x86_64-native-linuxapp-gcc/957df8d9b80f4e44af8a0904600fcc88/dpdk/mk/rte.subdir.mk:35: recipe for target 'librte_eal' failed
make[4]: *** [librte_eal] Error 2
/tmp/UB1604_K4.8.0_GCC6.2.0/x86_64-native-linuxapp-gcc/957df8d9b80f4e44af8a0904600fcc88/dpdk/mk/rte.sdkbuild.mk:49: recipe for target 'lib' failed
make[3]: *** [lib] Error 2
/tmp/UB1604_K4.8.0_GCC6.2.0/x86_64-native-linuxapp-gcc/957df8d9b80f4e44af8a0904600fcc88/dpdk/mk/rte.sdkroot.mk:100: recipe for target 'all' failed
make[2]: *** [all] Error 2
/tmp/UB1604_K4.8.0_GCC6.2.0/x86_64-native-linuxapp-gcc/957df8d9b80f4e44af8a0904600fcc88/dpdk/mk/rte.sdkinstall.mk:57: recipe for target 'pre_install' failed
make[1]: *** [pre_install] Error 2
/tmp/UB1604_K4.8.0_GCC6.2.0/x86_64-native-linuxapp-gcc/957df8d9b80f4e44af8a0904600fcc88/dpdk/mk/rte.sdkroot.mk:79: recipe for target 'install' failed
make: *** [install] Error 2

*Failed Build #3:
OS: CENTOS
Target: x86_64-native-linuxapp-gcc-shared
  CC eal_common_log.o
  CC eal_common_launch.o
  CC eal_common_memalloc.o
  CC eal_common_memory.o
/tmp/CENTOS_K3.10.0_GCC4.8.5/x86_64-native-linuxapp-gcc-shared/957df8d9b80f4e44af8a0904600fcc88/dpdk/lib/librte_eal/common/eal_common_memory.c: In function ‘rte_eal_check_dma_mask’:
/tmp/CENTOS_K3.10.0_GCC4.8.5/x86_64-native-linuxapp-gcc-shared/957df8d9b80f4e44af8a0904600fcc88/dpdk/lib/librte_eal/common/eal_common_memory.c:454:17: error: ‘MAX_DMA_MASK_BITS’ undeclared (first use in this function)
  if (maskbits > MAX_DMA_MASK_BITS) {
                 ^
/tmp/CENTOS_K3.10.0_GCC4.8.5/x86_64-native-linuxapp-gcc-shared/957df8d9b80f4e44af8a0904600fcc88/dpdk/lib/librte_eal/common/eal_common_memory.c:454:17: note: each undeclared identifier is reported only once for each function it appears in
make[7]: *** [eal_common_memory.o] Error 1
make[7]: *** Waiting for unfinished jobs....

*Failed Build #4:
OS: UB1604
Target: x86_64-native-linuxapp-gcc-shared
  CC eal_common_log.o
  CC eal_common_launch.o
  CC eal_common_memalloc.o
  CC eal_common_memory.o
/tmp/UB1604_K4.4.0_GCC5.4.0/x86_64-native-linuxapp-gcc-shared/957df8d9b80f4e44af8a0904600fcc88/dpdk/lib/librte_eal/common/eal_common_memory.c: In function ‘rte_eal_check_dma_mask’:
/tmp/UB1604_K4.4.0_GCC5.4.0/x86_64-native-linuxapp-gcc-shared/957df8d9b80f4e44af8a0904600fcc88/dpdk/lib/librte_eal/common/eal_common_memory.c:454:17: error: ‘MAX_DMA_MASK_BITS’ undeclared (first use in this function)
  if (maskbits > MAX_DMA_MASK_BITS) {
                 ^
/tmp/UB1604_K4.4.0_GCC5.4.0/x86_64-native-linuxapp-gcc-shared/957df8d9b80f4e44af8a0904600fcc88/dpdk/lib/librte_eal/common/eal_common_memory.c:454:17: note: each undeclared identifier is reported only once for each function it appears in
/tmp/UB1604_K4.4.0_GCC5.4.0/x86_64-native-linuxapp-gcc-shared/957df8d9b80f4e44af8a0904600fcc88/dpdk/mk/internal/rte.compile-pre.mk:114: recipe for target 'eal_common_memory.o' failed
make[7]: *** [eal_common_memory.o] Error 1
make[7]: *** Waiting for unfinished jobs....
/tmp/UB1604_K4.4.0_GCC5.4.0/x86_64-native-linuxapp-gcc-shared/957df8d9b80f4e44af8a0904600fcc88/dpdk/mk/rte.subdir.mk:35: recipe for target 'eal' failed
make[6]: *** [eal] Error 2
/tmp/UB1604_K4.4.0_GCC5.4.0/x86_64-native-linuxapp-gcc-shared/957df8d9b80f4e44af8a0904600fcc88/dpdk/mk/rte.subdir.mk:35: recipe for target 'linuxapp' failed
make[5]: *** [linuxapp] Error 2
/tmp/UB1604_K4.4.0_GCC5.4.0/x86_64-native-linuxapp-gcc-shared/957df8d9b80f4e44af8a0904600fcc88/dpdk/mk/rte.subdir.mk:35: recipe for target 'librte_eal' failed
make[4]: *** [librte_eal] Error 2
/tmp/UB1604_K4.4.0_GCC5.4.0/x86_64-native-linuxapp-gcc-shared/957df8d9b80f4e44af8a0904600fcc88/dpdk/mk/rte.sdkbuild.mk:49: recipe for target 'lib' failed
make[3]: *** [lib] Error 2
/tmp/UB1604_K4.4.0_GCC5.4.0/x86_64-native-linuxapp-gcc-shared/957df8d9b80f4e44af8a0904600fcc88/dpdk/mk/rte.sdkroot.mk:100: recipe for target 'all' failed
make[2]: *** [all] Error 2
/tmp/UB1604_K4.4.0_GCC5.4.0/x86_64-native-linuxapp-gcc-shared/957df8d9b80f4e44af8a0904600fcc88/dpdk/mk/rte.sdkinstall.mk:57: recipe for target 'pre_install' failed
make[1]: *** [pre_install] Error 2
/tmp/UB1604_K4.4.0_GCC5.4.0/x86_64-native-linuxapp-gcc-shared/957df8d9b80f4e44af8a0904600fcc88/dpdk/mk/rte.sdkroot.mk:79: recipe for target 'install' failed
make: *** [install] Error 2

*Failed Build #5:
OS: CENTOS
Target: x86_64-native-linuxapp-clang
  CC eal_common_memzone.o
  CC eal_common_log.o
  CC eal_common_launch.o
  CC eal_common_memalloc.o
  CC eal_common_memory.o
/tmp/CENTOS_K3.10.0_GCC4.8.5/x86_64-native-linuxapp-clang/957df8d9b80f4e44af8a0904600fcc88/dpdk/lib/librte_eal/common/eal_common_memory.c:454:17: error: use of undeclared identifier 'MAX_DMA_MASK_BITS'
        if (maskbits > MAX_DMA_MASK_BITS) {
                       ^
/tmp/CENTOS_K3.10.0_GCC4.8.5/x86_64-native-linuxapp-clang/957df8d9b80f4e44af8a0904600fcc88/dpdk/lib/librte_eal/common/eal_common_memory.c:456:18: error: use of undeclared identifier 'MAX_DMA_MASK_BITS'
                                   maskbits, MAX_DMA_MASK_BITS);
                                             ^
/tmp/CENTOS_K3.10.0_GCC4.8.5/x86_64-native-linuxapp-clang/957df8d9b80f4e44af8a0904600fcc88/dpdk/x86_64-native-linuxapp-clang/include/rte_log.h:322:32: note: expanded from macro 'RTE_LOG'
                 RTE_LOGTYPE_ ## t, # t ": " __VA_ARGS__)
                                             ^
2 errors generated.
make[7]: *** [eal_common_memory.o] Error 1
make[7]: *** Waiting for unfinished jobs....
make[6]: *** [eal] Error 2
make[5]: *** [linuxapp] Error 2
make[4]: *** [librte_eal] Error 2

*Failed Build #6:
OS: UB1604
Target: x86_64-native-linuxapp-clang
  CC eal_common_memzone.o
  CC eal_common_log.o
  CC eal_common_launch.o
  CC eal_common_memalloc.o
  CC eal_common_memory.o
/tmp/UB1604_K4.4.0_GCC5.4.0/x86_64-native-linuxapp-clang/957df8d9b80f4e44af8a0904600fcc88/dpdk/lib/librte_eal/common/eal_common_memory.c:454:17: error: use of undeclared identifier 'MAX_DMA_MASK_BITS'
        if (maskbits > MAX_DMA_MASK_BITS) {
                       ^
  CC eal_common_tailqs.o
/tmp/UB1604_K4.4.0_GCC5.4.0/x86_64-native-linuxapp-clang/957df8d9b80f4e44af8a0904600fcc88/dpdk/lib/librte_eal/common/eal_common_memory.c:456:18: error: use of undeclared identifier 'MAX_DMA_MASK_BITS'
                                   maskbits, MAX_DMA_MASK_BITS);
                                             ^
2 errors generated.
/tmp/UB1604_K4.4.0_GCC5.4.0/x86_64-native-linuxapp-clang/957df8d9b80f4e44af8a0904600fcc88/dpdk/mk/internal/rte.compile-pre.mk:114: recipe for target 'eal_common_memory.o' failed
make[7]: *** [eal_common_memory.o] Error 1
make[7]: *** Waiting for unfinished jobs....
/tmp/UB1604_K4.4.0_GCC5.4.0/x86_64-native-linuxapp-clang/957df8d9b80f4e44af8a0904600fcc88/dpdk/mk/rte.subdir.mk:35: recipe for target 'eal' failed
make[6]: *** [eal] Error 2
/tmp/UB1604_K4.4.0_GCC5.4.0/x86_64-native-linuxapp-clang/957df8d9b80f4e44af8a0904600fcc88/dpdk/mk/rte.subdir.mk:35: recipe for target 'linuxapp' failed
make[5]: *** [linuxapp] Error 2
/tmp/UB1604_K4.4.0_GCC5.4.0/x86_64-native-linuxapp-clang/957df8d9b80f4e44af8a0904600fcc88/dpdk/mk/rte.subdir.mk:35: recipe for target 'librte_eal' failed
make[4]: *** [librte_eal] Error 2
/tmp/UB1604_K4.4.0_GCC5.4.0/x86_64-native-linuxapp-clang/957df8d9b80f4e44af8a0904600fcc88/dpdk/mk/rte.sdkbuild.mk:49: recipe for target 'lib' failed
make[3]: *** [lib] Error 2
/tmp/UB1604_K4.4.0_GCC5.4.0/x86_64-native-linuxapp-clang/957df8d9b80f4e44af8a0904600fcc88/dpdk/mk/rte.sdkroot.mk:100: recipe for target 'all' failed
make[2]: *** [all] Error 2
/tmp/UB1604_K4.4.0_GCC5.4.0/x86_64-native-linuxapp-clang/957df8d9b80f4e44af8a0904600fcc88/dpdk/mk/rte.sdkinstall.mk:57: recipe for target 'pre_install' failed
make[1]: *** [pre_install] Error 2
/tmp/UB1604_K4.4.0_GCC5.4.0/x86_64-native-linuxapp-clang/957df8d9b80f4e44af8a0904600fcc88/dpdk/mk/rte.sdkroot.mk:79: recipe for target 'install' failed
make: *** [install] Error 2

*Failed Build #7:
OS: CENTOS
Target: x86_64-native-linuxapp-gcc
  CC eal_common_log.o
  CC eal_common_launch.o
  CC eal_common_memalloc.o
  CC eal_common_memory.o
/tmp/CENTOS_K3.10.0_GCC4.8.5/x86_64-native-linuxapp-gcc/957df8d9b80f4e44af8a0904600fcc88/dpdk/lib/librte_eal/common/eal_common_memory.c: In function ‘rte_eal_check_dma_mask’:
/tmp/CENTOS_K3.10.0_GCC4.8.5/x86_64-native-linuxapp-gcc/957df8d9b80f4e44af8a0904600fcc88/dpdk/lib/librte_eal/common/eal_common_memory.c:454:17: error: ‘MAX_DMA_MASK_BITS’ undeclared (first use in this function)
  if (maskbits > MAX_DMA_MASK_BITS) {
                 ^
/tmp/CENTOS_K3.10.0_GCC4.8.5/x86_64-native-linuxapp-gcc/957df8d9b80f4e44af8a0904600fcc88/dpdk/lib/librte_eal/common/eal_common_memory.c:454:17: note: each undeclared identifier is reported only once for each function it appears in
make[7]: *** [eal_common_memory.o] Error 1
make[7]: *** Waiting for unfinished jobs....

*Failed Build #8:
OS: FC24
Target: x86_64-native-linuxapp-clang
  CC eal_common_log.o
  CC eal_common_launch.o
  CC eal_common_memalloc.o
  CC eal_common_memory.o
  CC eal_common_tailqs.o
/tmp/FC24_K4.9.13_GCC6.2.1/x86_64-native-linuxapp-clang/957df8d9b80f4e44af8a0904600fcc88/dpdk/lib/librte_eal/common/eal_common_memory.c:454:17: error: use of undeclared identifier 'MAX_DMA_MASK_BITS'
        if (maskbits > MAX_DMA_MASK_BITS) {
                       ^
  CC eal_common_errno.o
/tmp/FC24_K4.9.13_GCC6.2.1/x86_64-native-linuxapp-clang/957df8d9b80f4e44af8a0904600fcc88/dpdk/lib/librte_eal/common/eal_common_memory.c:456:18: error: use of undeclared identifier 'MAX_DMA_MASK_BITS'
                                   maskbits, MAX_DMA_MASK_BITS);
                                             ^
2 errors generated.
/tmp/FC24_K4.9.13_GCC6.2.1/x86_64-native-linuxapp-clang/957df8d9b80f4e44af8a0904600fcc88/dpdk/mk/internal/rte.compile-pre.mk:114: recipe for target 'eal_common_memory.o' failed
make[7]: *** [eal_common_memory.o] Error 1
make[7]: *** Waiting for unfinished jobs....
/tmp/FC24_K4.9.13_GCC6.2.1/x86_64-native-linuxapp-clang/957df8d9b80f4e44af8a0904600fcc88/dpdk/mk/rte.subdir.mk:35: recipe for target 'eal' failed
make[6]: *** [eal] Error 2
/tmp/FC24_K4.9.13_GCC6.2.1/x86_64-native-linuxapp-clang/957df8d9b80f4e44af8a0904600fcc88/dpdk/mk/rte.subdir.mk:35: recipe for target 'linuxapp' failed
make[5]: *** [linuxapp] Error 2
/tmp/FC24_K4.9.13_GCC6.2.1/x86_64-native-linuxapp-clang/957df8d9b80f4e44af8a0904600fcc88/dpdk/mk/rte.subdir.mk:35: recipe for target 'librte_eal' failed
make[4]: *** [librte_eal] Error 2
/tmp/FC24_K4.9.13_GCC6.2.1/x86_64-native-linuxapp-clang/957df8d9b80f4e44af8a0904600fcc88/dpdk/mk/rte.sdkbuild.mk:49: recipe for target 'lib' failed
make[3]: *** [lib] Error 2
/tmp/FC24_K4.9.13_GCC6.2.1/x86_64-native-linuxapp-clang/957df8d9b80f4e44af8a0904600fcc88/dpdk/mk/rte.sdkroot.mk:100: recipe for target 'all' failed
make[2]: *** [all] Error 2
/tmp/FC24_K4.9.13_GCC6.2.1/x86_64-native-linuxapp-clang/957df8d9b80f4e44af8a0904600fcc88/dpdk/mk/rte.sdkinstall.mk:57: recipe for target 'pre_install' failed
make[1]: *** [pre_install] Error 2
/tmp/FC24_K4.9.13_GCC6.2.1/x86_64-native-linuxapp-clang/957df8d9b80f4e44af8a0904600fcc88/dpdk/mk/rte.sdkroot.mk:79: recipe for target 'install' failed
make: *** [install] Error 2

*Failed Build #9:
OS: FC25
Target: x86_64-native-linuxapp-gcc-debug
  CC eal_common_log.o
  CC eal_common_launch.o
  CC eal_common_memalloc.o
  CC eal_common_memory.o
/tmp/FC25_K4.8.6_GCC6.3.1/x86_64-native-linuxapp-gcc-debug/957df8d9b80f4e44af8a0904600fcc88/dpdk/lib/librte_eal/common/eal_common_memory.c: In function ‘rte_eal_check_dma_mask’:
/tmp/FC25_K4.8.6_GCC6.3.1/x86_64-native-linuxapp-gcc-debug/957df8d9b80f4e44af8a0904600fcc88/dpdk/lib/librte_eal/common/eal_common_memory.c:454:17: error: ‘MAX_DMA_MASK_BITS’ undeclared (first use in this function)
  if (maskbits > MAX_DMA_MASK_BITS) {
                 ^~~~~~~~~~~~~~~~~
/tmp/FC25_K4.8.6_GCC6.3.1/x86_64-native-linuxapp-gcc-debug/957df8d9b80f4e44af8a0904600fcc88/dpdk/lib/librte_eal/common/eal_common_memory.c:454:17: note: each undeclared identifier is reported only once for each function it appears in
/tmp/FC25_K4.8.6_GCC6.3.1/x86_64-native-linuxapp-gcc-debug/957df8d9b80f4e44af8a0904600fcc88/dpdk/mk/internal/rte.compile-pre.mk:114: recipe for target 'eal_common_memory.o' failed
make[7]: *** [eal_common_memory.o] Error 1
make[7]: *** Waiting for unfinished jobs....
/tmp/FC25_K4.8.6_GCC6.3.1/x86_64-native-linuxapp-gcc-debug/957df8d9b80f4e44af8a0904600fcc88/dpdk/mk/rte.subdir.mk:35: recipe for target 'eal' failed
make[6]: *** [eal] Error 2
/tmp/FC25_K4.8.6_GCC6.3.1/x86_64-native-linuxapp-gcc-debug/957df8d9b80f4e44af8a0904600fcc88/dpdk/mk/rte.subdir.mk:35: recipe for target 'linuxapp' failed
make[5]: *** [linuxapp] Error 2
/tmp/FC25_K4.8.6_GCC6.3.1/x86_64-native-linuxapp-gcc-debug/957df8d9b80f4e44af8a0904600fcc88/dpdk/mk/rte.subdir.mk:35: recipe for target 'librte_eal' failed
make[4]: *** [librte_eal] Error 2
/tmp/FC25_K4.8.6_GCC6.3.1/x86_64-native-linuxapp-gcc-debug/957df8d9b80f4e44af8a0904600fcc88/dpdk/mk/rte.sdkbuild.mk:49: recipe for target 'lib' failed
make[3]: *** [lib] Error 2
/tmp/FC25_K4.8.6_GCC6.3.1/x86_64-native-linuxapp-gcc-debug/957df8d9b80f4e44af8a0904600fcc88/dpdk/mk/rte.sdkroot.mk:100: recipe for target 'all' failed
make[2]: *** [all] Error 2
/tmp/FC25_K4.8.6_GCC6.3.1/x86_64-native-linuxapp-gcc-debug/957df8d9b80f4e44af8a0904600fcc88/dpdk/mk/rte.sdkinstall.mk:57: recipe for target 'pre_install' failed
make[1]: *** [pre_install] Error 2
/tmp/FC25_K4.8.6_GCC6.3.1/x86_64-native-linuxapp-gcc-debug/957df8d9b80f4e44af8a0904600fcc88/dpdk/mk/rte.sdkroot.mk:79: recipe for target 'install' failed
make: *** [install] Error 2

*Failed Build #10:
OS: FreeBSD
Target: x86_64-native-bsdapp-clang
  CC eal_common_launch.o
  CC eal_common_memalloc.o
  CC eal_common_memory.o
  CC eal_common_tailqs.o
  CC eal_common_errno.o
/tmp/FreeBSD_K10.3_GCC4.8.5/x86_64-native-bsdapp-clang/957df8d9b80f4e44af8a0904600fcc88/dpdk/lib/librte_eal/common/eal_common_memory.c:454:17: error: use of undeclared identifier 'MAX_DMA_MASK_BITS'
        if (maskbits > MAX_DMA_MASK_BITS) {
                       ^
/tmp/FreeBSD_K10.3_GCC4.8.5/x86_64-native-bsdapp-clang/957df8d9b80f4e44af8a0904600fcc88/dpdk/lib/librte_eal/common/eal_common_memory.c:456:18: error: use of undeclared identifier 'MAX_DMA_MASK_BITS'
                                   maskbits, MAX_DMA_MASK_BITS);
                                             ^
/tmp/FreeBSD_K10.3_GCC4.8.5/x86_64-native-bsdapp-clang/957df8d9b80f4e44af8a0904600fcc88/dpdk/x86_64-native-bsdapp-clang/include/rte_log.h:322:32: note: expanded from macro 'RTE_LOG'
                 RTE_LOGTYPE_ ## t, # t ": " __VA_ARGS__)
                                             ^
2 errors generated.
/tmp/FreeBSD_K10.3_GCC4.8.5/x86_64-native-bsdapp-clang/957df8d9b80f4e44af8a0904600fcc88/dpdk/mk/internal/rte.compile-pre.mk:114: recipe for target 'eal_common_memory.o' failed
gmake[7]: *** [eal_common_memory.o] Error 1
gmake[7]: *** Waiting for unfinished jobs....
/tmp/FreeBSD_K10.3_GCC4.8.5/x86_64-native-bsdapp-clang/957df8d9b80f4e44af8a0904600fcc88/dpdk/mk/rte.subdir.mk:35: recipe for target 'eal' failed
gmake[6]: *** [eal] Error 2
/tmp/FreeBSD_K10.3_GCC4.8.5/x86_64-native-bsdapp-clang/957df8d9b80f4e44af8a0904600fcc88/dpdk/mk/rte.subdir.mk:35: recipe for target 'bsdapp' failed
gmake[5]: *** [bsdapp] Error 2
/tmp/FreeBSD_K10.3_GCC4.8.5/x86_64-native-bsdapp-clang/957df8d9b80f4e44af8a0904600fcc88/dpdk/mk/rte.subdir.mk:35: recipe for target 'librte_eal' failed
gmake[4]: *** [librte_eal] Error 2
/tmp/FreeBSD_K10.3_GCC4.8.5/x86_64-native-bsdapp-clang/957df8d9b80f4e44af8a0904600fcc88/dpdk/mk/rte.sdkbuild.mk:49: recipe for target 'lib' failed
gmake[3]: *** [lib] Error 2
/tmp/FreeBSD_K10.3_GCC4.8.5/x86_64-native-bsdapp-clang/957df8d9b80f4e44af8a0904600fcc88/dpdk/mk/rte.sdkroot.mk:100: recipe for target 'all' failed
gmake[2]: *** [all] Error 2
/tmp/FreeBSD_K10.3_GCC4.8.5/x86_64-native-bsdapp-clang/957df8d9b80f4e44af8a0904600fcc88/dpdk/mk/rte.sdkinstall.mk:57: recipe for target 'pre_install' failed
gmake[1]: *** [pre_install] Error 2
/tmp/FreeBSD_K10.3_GCC4.8.5/x86_64-native-bsdapp-clang/957df8d9b80f4e44af8a0904600fcc88/dpdk/mk/rte.sdkroot.mk:79: recipe for target 'install' failed
gmake: *** [install] Error 2

*Failed Build #11:
OS: FC24
Target: x86_64-native-linuxapp-gcc-shared
  CC eal_common_log.o
  CC eal_common_launch.o
  CC eal_common_memalloc.o
  CC eal_common_memory.o
/tmp/FC24_K4.9.13_GCC6.2.1/x86_64-native-linuxapp-gcc-shared/957df8d9b80f4e44af8a0904600fcc88/dpdk/lib/librte_eal/common/eal_common_memory.c: In function ‘rte_eal_check_dma_mask’:
/tmp/FC24_K4.9.13_GCC6.2.1/x86_64-native-linuxapp-gcc-shared/957df8d9b80f4e44af8a0904600fcc88/dpdk/lib/librte_eal/common/eal_common_memory.c:454:17: error: ‘MAX_DMA_MASK_BITS’ undeclared (first use in this function)
  if (maskbits > MAX_DMA_MASK_BITS) {
                 ^~~~~~~~~~~~~~~~~
/tmp/FC24_K4.9.13_GCC6.2.1/x86_64-native-linuxapp-gcc-shared/957df8d9b80f4e44af8a0904600fcc88/dpdk/lib/librte_eal/common/eal_common_memory.c:454:17: note: each undeclared identifier is reported only once for each function it appears in
/tmp/FC24_K4.9.13_GCC6.2.1/x86_64-native-linuxapp-gcc-shared/957df8d9b80f4e44af8a0904600fcc88/dpdk/mk/internal/rte.compile-pre.mk:114: recipe for target 'eal_common_memory.o' failed
make[7]: *** [eal_common_memory.o] Error 1
make[7]: *** Waiting for unfinished jobs....
/tmp/FC24_K4.9.13_GCC6.2.1/x86_64-native-linuxapp-gcc-shared/957df8d9b80f4e44af8a0904600fcc88/dpdk/mk/rte.subdir.mk:35: recipe for target 'eal' failed
make[6]: *** [eal] Error 2
/tmp/FC24_K4.9.13_GCC6.2.1/x86_64-native-linuxapp-gcc-shared/957df8d9b80f4e44af8a0904600fcc88/dpdk/mk/rte.subdir.mk:35: recipe for target 'linuxapp' failed
make[5]: *** [linuxapp] Error 2
/tmp/FC24_K4.9.13_GCC6.2.1/x86_64-native-linuxapp-gcc-shared/957df8d9b80f4e44af8a0904600fcc88/dpdk/mk/rte.subdir.mk:35: recipe for target 'librte_eal' failed
make[4]: *** [librte_eal] Error 2
/tmp/FC24_K4.9.13_GCC6.2.1/x86_64-native-linuxapp-gcc-shared/957df8d9b80f4e44af8a0904600fcc88/dpdk/mk/rte.sdkbuild.mk:49: recipe for target 'lib' failed
make[3]: *** [lib] Error 2
/tmp/FC24_K4.9.13_GCC6.2.1/x86_64-native-linuxapp-gcc-shared/957df8d9b80f4e44af8a0904600fcc88/dpdk/mk/rte.sdkroot.mk:100: recipe for target 'all' failed
make[2]: *** [all] Error 2
/tmp/FC24_K4.9.13_GCC6.2.1/x86_64-native-linuxapp-gcc-shared/957df8d9b80f4e44af8a0904600fcc88/dpdk/mk/rte.sdkinstall.mk:57: recipe for target 'pre_install' failed
make[1]: *** [pre_install] Error 2
/tmp/FC24_K4.9.13_GCC6.2.1/x86_64-native-linuxapp-gcc-shared/957df8d9b80f4e44af8a0904600fcc88/dpdk/mk/rte.sdkroot.mk:79: recipe for target 'install' failed
make: *** [install] Error 2

*Failed Build #12:
OS: FreeBSD
Target: x86_64-native-bsdapp-gcc
  CC eal_common_launch.o
  CC eal_common_memalloc.o
  CC eal_common_memory.o
  CC eal_common_tailqs.o
/tmp/FreeBSD_K10.3_GCC4.8.5/x86_64-native-bsdapp-gcc/957df8d9b80f4e44af8a0904600fcc88/dpdk/lib/librte_eal/common/eal_common_memory.c: In function 'rte_eal_check_dma_mask':
/tmp/FreeBSD_K10.3_GCC4.8.5/x86_64-native-bsdapp-gcc/957df8d9b80f4e44af8a0904600fcc88/dpdk/lib/librte_eal/common/eal_common_memory.c:454:17: error: 'MAX_DMA_MASK_BITS' undeclared (first use in this function)
  if (maskbits > MAX_DMA_MASK_BITS) {
                 ^
/tmp/FreeBSD_K10.3_GCC4.8.5/x86_64-native-bsdapp-gcc/957df8d9b80f4e44af8a0904600fcc88/dpdk/lib/librte_eal/common/eal_common_memory.c:454:17: note: each undeclared identifier is reported only once for each function it appears in
/tmp/FreeBSD_K10.3_GCC4.8.5/x86_64-native-bsdapp-gcc/957df8d9b80f4e44af8a0904600fcc88/dpdk/mk/internal/rte.compile-pre.mk:114: recipe for target 'eal_common_memory.o' failed
gmake[7]: *** [eal_common_memory.o] Error 1
gmake[7]: *** Waiting for unfinished jobs....
/tmp/FreeBSD_K10.3_GCC4.8.5/x86_64-native-bsdapp-gcc/957df8d9b80f4e44af8a0904600fcc88/dpdk/mk/rte.subdir.mk:35: recipe for target 'eal' failed
gmake[6]: *** [eal] Error 2
/tmp/FreeBSD_K10.3_GCC4.8.5/x86_64-native-bsdapp-gcc/957df8d9b80f4e44af8a0904600fcc88/dpdk/mk/rte.subdir.mk:35: recipe for target 'bsdapp' failed
gmake[5]: *** [bsdapp] Error 2
/tmp/FreeBSD_K10.3_GCC4.8.5/x86_64-native-bsdapp-gcc/957df8d9b80f4e44af8a0904600fcc88/dpdk/mk/rte.subdir.mk:35: recipe for target 'librte_eal' failed
gmake[4]: *** [librte_eal] Error 2
/tmp/FreeBSD_K10.3_GCC4.8.5/x86_64-native-bsdapp-gcc/957df8d9b80f4e44af8a0904600fcc88/dpdk/mk/rte.sdkbuild.mk:49: recipe for target 'lib' failed
gmake[3]: *** [lib] Error 2
/tmp/FreeBSD_K10.3_GCC4.8.5/x86_64-native-bsdapp-gcc/957df8d9b80f4e44af8a0904600fcc88/dpdk/mk/rte.sdkroot.mk:100: recipe for target 'all' failed
gmake[2]: *** [all] Error 2
/tmp/FreeBSD_K10.3_GCC4.8.5/x86_64-native-bsdapp-gcc/957df8d9b80f4e44af8a0904600fcc88/dpdk/mk/rte.sdkinstall.mk:57: recipe for target 'pre_install' failed
gmake[1]: *** [pre_install] Error 2
/tmp/FreeBSD_K10.3_GCC4.8.5/x86_64-native-bsdapp-gcc/957df8d9b80f4e44af8a0904600fcc88/dpdk/mk/rte.sdkroot.mk:79: recipe for target 'install' failed
gmake: *** [install] Error 2

DPDK STV team


More information about the test-report mailing list