[dpdk-test-report] |FAILURE| pw35440 [PATCH RFC 4/7] net/af_xdp: use mbuf mempool for buffer management

sys_stv at intel.com sys_stv at intel.com
Tue Feb 27 12:41:31 CET 2018


Test-Label: Intel-compilation
Test-Status: FAILURE

http://dpdk.org/patch/35440

_Compilation issues_

Submitter: Qi Zhang <qi.z.zhang at intel.com>
Date: Tue, 27 Feb 2018 17:33:02 +0800
DPDK git baseline: Repo:dpdk, Branch:master, CommitID:c06ddf9698e0c2a9653cfa971f9ddc205065662c

Patch35437-35440 --> compile error
Build Summary: 15 Builds Done, 2 Successful, 13 Failures

Test environment and configuration as below:
OS: FreeBSD10.3_64
    Kernel Version:10.3-RELEASE
    CPU info: Intel(R) Xeon(R) CPU E5-2699 v4 @ 2.20GHz (2194.97-MHz K8-class CPU)
    GCC Version:gcc (FreeBSD Ports Collection) 4.8.5
    Clang Version:3.4.1
    x86_64-native-bsdapp-clang
    x86_64-native-bsdapp-gcc
OS: FC24_64
    Kernel Version:4.9.13-100.fc24.x86_64
    CPU info:Intel(R) Xeon(R) CPU E5-2699 v3 @ 2.30GHz
    GCC Version:gcc (GCC) 6.2.1 20160916 (Red Hat 6.2.1-2)
    Clang Version:3.8.0
    x86_64-native-linuxapp-gcc-debug
    i686-native-linuxapp-gcc
    x86_64-native-linuxapp-clang
    x86_64-native-linuxapp-gcc-shared
    x86_64-native-linuxapp-gcc
OS: UB1604_64
    Kernel Version:4.4.0-78-generic
    CPU info:Intel(R) Xeon(R) CPU E5-2699 v3 @ 2.30GHz
    GCC Version:gcc (Ubuntu 5.4.0-6ubuntu1~16.04.4) 5.4.0 20160609
    Clang Version:3.8.0
    i686-native-linuxapp-gcc
    x86_64-native-linuxapp-gcc
    x86_64-native-linuxapp-gcc-shared
    x86_64-native-linuxapp-clang
OS: CentOS7_64
    Kernel Version:3.10.0-514.10.2.el7.x86_64
    CPU info:Intel(R) Xeon(R) CPU E5-2699 v3 @ 2.30GHz
    GCC Version:gcc (GCC) 4.8.5 20150623 (Red Hat 4.8.5-4)
    Clang Version:3.4.2
    i686-native-linuxapp-gcc
    x86_64-native-linuxapp-clang
    x86_64-native-linuxapp-gcc-shared
    x86_64-native-linuxapp-gcc

Failed Build #1:
OS: FC24_64
Target: x86_64-native-linuxapp-gcc-debug

/home/patchWorkOrg/compilation/drivers/net/af_xdp/rte_eth_af_xdp.c:17:26: fatal error: linux/if_xdp.h: No such file or directory
 #include <linux/if_xdp.h>
                          ^
compilation terminated.
/home/patchWorkOrg/compilation/mk/internal/rte.compile-pre.mk:114: recipe for target 'rte_eth_af_xdp.o' failed
/home/patchWorkOrg/compilation/mk/rte.subdir.mk:35: recipe for target 'af_xdp' failed
/home/patchWorkOrg/compilation/mk/rte.subdir.mk:35: recipe for target 'net' failed
/home/patchWorkOrg/compilation/mk/rte.sdkbuild.mk:48: recipe for target 'drivers' failed
/home/patchWorkOrg/compilation/mk/rte.sdkroot.mk:100: recipe for target 'all' failed
/home/patchWorkOrg/compilation/mk/rte.sdkinstall.mk:85: recipe for target 'pre_install' failed
/home/patchWorkOrg/compilation/mk/rte.sdkroot.mk:79: recipe for target 'install' failed


Failed Build #2:
OS: FC24_64
Target: i686-native-linuxapp-gcc
/home/patchWorkOrg/compilation/drivers/net/af_xdp/rte_eth_af_xdp.c:17:26: fatal error: linux/if_xdp.h: No such file or directory
 #include <linux/if_xdp.h>
                          ^
compilation terminated.
/home/patchWorkOrg/compilation/mk/internal/rte.compile-pre.mk:114: recipe for target 'rte_eth_af_xdp.o' failed
/home/patchWorkOrg/compilation/mk/rte.subdir.mk:35: recipe for target 'af_xdp' failed
/home/patchWorkOrg/compilation/mk/rte.subdir.mk:35: recipe for target 'net' failed
/home/patchWorkOrg/compilation/mk/rte.sdkbuild.mk:48: recipe for target 'drivers' failed
/home/patchWorkOrg/compilation/mk/rte.sdkroot.mk:100: recipe for target 'all' failed
/home/patchWorkOrg/compilation/mk/rte.sdkinstall.mk:85: recipe for target 'pre_install' failed
/home/patchWorkOrg/compilation/mk/rte.sdkroot.mk:79: recipe for target 'install' failed


Failed Build #3:
OS: FC24_64
Target: x86_64-native-linuxapp-clang
/home/patchWorkOrg/compilation/drivers/net/af_xdp/rte_eth_af_xdp.c:17:10: fatal error: 'linux/if_xdp.h' file not found
#include <linux/if_xdp.h>
         ^
1 error generated.
/home/patchWorkOrg/compilation/mk/internal/rte.compile-pre.mk:114: recipe for target 'rte_eth_af_xdp.o' failed
/home/patchWorkOrg/compilation/mk/rte.subdir.mk:35: recipe for target 'af_xdp' failed
/home/patchWorkOrg/compilation/mk/rte.subdir.mk:35: recipe for target 'net' failed
/home/patchWorkOrg/compilation/mk/rte.sdkbuild.mk:48: recipe for target 'drivers' failed
/home/patchWorkOrg/compilation/mk/rte.sdkroot.mk:100: recipe for target 'all' failed
/home/patchWorkOrg/compilation/mk/rte.sdkinstall.mk:85: recipe for target 'pre_install' failed
/home/patchWorkOrg/compilation/mk/rte.sdkroot.mk:79: recipe for target 'install' failed


Failed Build #4:
OS: FC24_64
Target: x86_64-native-linuxapp-gcc-shared

/home/patchWorkOrg/compilation/drivers/net/af_xdp/rte_eth_af_xdp.c:17:26: fatal error: linux/if_xdp.h: No such file or directory
 #include <linux/if_xdp.h>
                          ^
compilation terminated.
/home/patchWorkOrg/compilation/mk/internal/rte.compile-pre.mk:114: recipe for target 'rte_eth_af_xdp.o' failed
/home/patchWorkOrg/compilation/mk/rte.subdir.mk:35: recipe for target 'af_xdp' failed
/home/patchWorkOrg/compilation/mk/rte.subdir.mk:35: recipe for target 'net' failed
/home/patchWorkOrg/compilation/mk/rte.sdkbuild.mk:48: recipe for target 'drivers' failed
/home/patchWorkOrg/compilation/mk/rte.sdkroot.mk:100: recipe for target 'all' failed
/home/patchWorkOrg/compilation/mk/rte.sdkinstall.mk:85: recipe for target 'pre_install' failed
/home/patchWorkOrg/compilation/mk/rte.sdkroot.mk:79: recipe for target 'install' failed


Failed Build #5:
OS: FC24_64
Target: x86_64-native-linuxapp-gcc
/home/patchWorkOrg/compilation/drivers/net/af_xdp/rte_eth_af_xdp.c:17:26: fatal error: linux/if_xdp.h: No such file or directory
 #include <linux/if_xdp.h>
                          ^
compilation terminated.
/home/patchWorkOrg/compilation/mk/internal/rte.compile-pre.mk:114: recipe for target 'rte_eth_af_xdp.o' failed
/home/patchWorkOrg/compilation/mk/rte.subdir.mk:35: recipe for target 'af_xdp' failed
/home/patchWorkOrg/compilation/mk/rte.subdir.mk:35: recipe for target 'net' failed
/home/patchWorkOrg/compilation/mk/rte.sdkbuild.mk:48: recipe for target 'drivers' failed
/home/patchWorkOrg/compilation/mk/rte.sdkroot.mk:100: recipe for target 'all' failed
/home/patchWorkOrg/compilation/mk/rte.sdkinstall.mk:85: recipe for target 'pre_install' failed
/home/patchWorkOrg/compilation/mk/rte.sdkroot.mk:79: recipe for target 'install' failed


Failed Build #6:
OS: UB1604_64
Target: i686-native-linuxapp-gcc
/home/patchWorkOrg/compilation/drivers/net/af_xdp/rte_eth_af_xdp.c:17:26: fatal error: linux/if_xdp.h: No such file or directory
compilation terminated.
/home/patchWorkOrg/compilation/mk/internal/rte.compile-pre.mk:114: recipe for target 'rte_eth_af_xdp.o' failed
/home/patchWorkOrg/compilation/mk/rte.subdir.mk:35: recipe for target 'af_xdp' failed
/home/patchWorkOrg/compilation/mk/rte.subdir.mk:35: recipe for target 'net' failed
/home/patchWorkOrg/compilation/mk/rte.sdkbuild.mk:48: recipe for target 'drivers' failed
/home/patchWorkOrg/compilation/mk/rte.sdkroot.mk:100: recipe for target 'all' failed
/home/patchWorkOrg/compilation/mk/rte.sdkinstall.mk:85: recipe for target 'pre_install' failed
/home/patchWorkOrg/compilation/mk/rte.sdkroot.mk:79: recipe for target 'install' failed


Failed Build #7:
OS: UB1604_64
Target: x86_64-native-linuxapp-gcc
/home/patchWorkOrg/compilation/drivers/net/af_xdp/rte_eth_af_xdp.c:17:26: fatal error: linux/if_xdp.h: No such file or directory
compilation terminated.
/home/patchWorkOrg/compilation/mk/internal/rte.compile-pre.mk:114: recipe for target 'rte_eth_af_xdp.o' failed
/home/patchWorkOrg/compilation/mk/rte.subdir.mk:35: recipe for target 'af_xdp' failed
/home/patchWorkOrg/compilation/mk/rte.subdir.mk:35: recipe for target 'net' failed
/home/patchWorkOrg/compilation/mk/rte.sdkbuild.mk:48: recipe for target 'drivers' failed
/home/patchWorkOrg/compilation/mk/rte.sdkroot.mk:100: recipe for target 'all' failed
/home/patchWorkOrg/compilation/mk/rte.sdkinstall.mk:85: recipe for target 'pre_install' failed
/home/patchWorkOrg/compilation/mk/rte.sdkroot.mk:79: recipe for target 'install' failed


Failed Build #8:
OS: UB1604_64
Target: x86_64-native-linuxapp-gcc-shared

/home/patchWorkOrg/compilation/drivers/net/af_xdp/rte_eth_af_xdp.c:17:26: fatal error: linux/if_xdp.h: No such file or directory
compilation terminated.
/home/patchWorkOrg/compilation/mk/internal/rte.compile-pre.mk:114: recipe for target 'rte_eth_af_xdp.o' failed
/home/patchWorkOrg/compilation/mk/rte.subdir.mk:35: recipe for target 'af_xdp' failed
/home/patchWorkOrg/compilation/mk/rte.subdir.mk:35: recipe for target 'net' failed
/home/patchWorkOrg/compilation/mk/rte.sdkbuild.mk:48: recipe for target 'drivers' failed
/home/patchWorkOrg/compilation/mk/rte.sdkroot.mk:100: recipe for target 'all' failed
/home/patchWorkOrg/compilation/mk/rte.sdkinstall.mk:85: recipe for target 'pre_install' failed
/home/patchWorkOrg/compilation/mk/rte.sdkroot.mk:79: recipe for target 'install' failed


Failed Build #9:
OS: UB1604_64
Target: x86_64-native-linuxapp-clang
/home/patchWorkOrg/compilation/drivers/net/af_xdp/rte_eth_af_xdp.c:17:10: fatal error: 'linux/if_xdp.h' file not found
#include <linux/if_xdp.h>
         ^
1 error generated.
/home/patchWorkOrg/compilation/mk/internal/rte.compile-pre.mk:114: recipe for target 'rte_eth_af_xdp.o' failed
/home/patchWorkOrg/compilation/mk/rte.subdir.mk:35: recipe for target 'af_xdp' failed
/home/patchWorkOrg/compilation/mk/rte.subdir.mk:35: recipe for target 'net' failed
/home/patchWorkOrg/compilation/mk/rte.sdkbuild.mk:48: recipe for target 'drivers' failed
/home/patchWorkOrg/compilation/mk/rte.sdkroot.mk:100: recipe for target 'all' failed
/home/patchWorkOrg/compilation/mk/rte.sdkinstall.mk:85: recipe for target 'pre_install' failed
/home/patchWorkOrg/compilation/mk/rte.sdkroot.mk:79: recipe for target 'install' failed


Failed Build #10:
OS: CentOS7_64
Target: i686-native-linuxapp-gcc
/home/patchWorkOrg/compilation/drivers/net/af_xdp/rte_eth_af_xdp.c:17:26: fatal error: linux/if_xdp.h: No such file or directory
 #include <linux/if_xdp.h>
                          ^
compilation terminated.


Failed Build #11:
OS: CentOS7_64
Target: x86_64-native-linuxapp-clang
/home/patchWorkOrg/compilation/drivers/net/af_xdp/rte_eth_af_xdp.c:17:10: fatal error: 'linux/if_xdp.h' file not found
#include <linux/if_xdp.h>
         ^
1 error generated.


Failed Build #12:
OS: CentOS7_64
Target: x86_64-native-linuxapp-gcc-shared

/home/patchWorkOrg/compilation/drivers/net/af_xdp/rte_eth_af_xdp.c:17:26: fatal error: linux/if_xdp.h: No such file or directory
 #include <linux/if_xdp.h>
                          ^
compilation terminated.


Failed Build #13:
OS: CentOS7_64
Target: x86_64-native-linuxapp-gcc
/home/patchWorkOrg/compilation/drivers/net/af_xdp/rte_eth_af_xdp.c:17:26: fatal error: linux/if_xdp.h: No such file or directory
 #include <linux/if_xdp.h>
                          ^
compilation terminated.


DPDK STV team


More information about the test-report mailing list