[dpdk-test-report] |FAILURE| pw33571 [PATCH v5 01/11] eal: add common test assert macros

sys_stv at intel.com sys_stv at intel.com
Thu Jan 18 01:15:19 CET 2018


Test-Label: Intel-compilation
Test-Status: FAILURE
http://dpdk.org/patch/33571

_apply patch file failure_

Submitter: Pavan Nikhilesh <pbhagavatula at caviumnetworks.com>
Date: Thu, 11 Jan 2018 15:51:56 +0530
DPDK git baseline: Repo:dpdk-next-eventdev, Branch:master, CommitID:9f723abd4c9366625e7392f1e66234e9e120dea5
                   Repo:dpdk-next-crypto, Branch:master, CommitID:eb228b9064587fb979abf1ee2ebc6f735019c88f
                   Repo:dpdk-next-net, Branch:master, CommitID:b5660f95e192b8b51a010aa3ca354aadaf85a966
                   Repo:dpdk-next-virtio, Branch:master, CommitID:9158926a0f24e9b8cccfe97211fa72d52a6f6a36
                   Repo:dpdk, Branch:master, CommitID:c281b4fc71ddefe809994be10f53b87e1ba6c669
                   
Apply patch file failed:
Repo: dpdk
33571:
patching file lib/librte_eal/common/Makefile
Hunk #1 FAILED at 43.
1 out of 1 hunk FAILED -- saving rejects to file lib/librte_eal/common/Makefile.rej
patching file lib/librte_eal/common/include/rte_test.h
patching file test/test/test.h
Hunk #1 succeeded at 10 with fuzz 2 (offset -28 lines).
Hunk #2 succeeded at 22 (offset -27 lines).
Hunk #3 succeeded at 96 (offset -27 lines).

Repo: dpdk-next-crypto
33571:
patching file lib/librte_eal/common/Makefile
Hunk #1 FAILED at 43.
1 out of 1 hunk FAILED -- saving rejects to file lib/librte_eal/common/Makefile.rej
patching file lib/librte_eal/common/include/rte_test.h
patching file test/test/test.h
Hunk #1 succeeded at 10 with fuzz 2 (offset -28 lines).
Hunk #2 succeeded at 21 (offset -28 lines).
Hunk #3 succeeded at 95 (offset -28 lines).

Repo: dpdk-next-net
33571:
patching file lib/librte_eal/common/Makefile
Hunk #1 FAILED at 43.
1 out of 1 hunk FAILED -- saving rejects to file lib/librte_eal/common/Makefile.rej
patching file lib/librte_eal/common/include/rte_test.h
patching file test/test/test.h
Hunk #1 succeeded at 9 (offset -29 lines).
Hunk #2 succeeded at 20 (offset -29 lines).
Hunk #3 succeeded at 94 (offset -29 lines).


DPDK STV team


More information about the test-report mailing list