[dpdk-test-report] |FAILURE| pw42416[v3, 06/16] compress/qat: check that correct firmware is in use

sys_stv at intel.com sys_stv at intel.com
Fri Jul 6 09:35:29 CEST 2018


Test-Label: Intel-compilation
Test-Status: FAILURE
http://dpdk.org/patch/42416

_Compilation issues_

Submitter: Fiona Trahe <fiona.trahe at intel.com>
Date: 2018-07-05 17:32:50
DPDK git baseline: Repo:dpdk-next-crypto, CommitID: e4eb7ecc21bc161489d095f96e7769a1406fdaa4

Build Summary: 15 Builds Done, 0 Successful, 15 Failures

Test environment and configuration as below:

OS: FC25
	Kernel Version: 4.9.13-100.fc24.x86_64
	CPU info: Intel(R) Xeon(R) CPU E5-2699 v3 @ 2.30GHz
	GCC Version: gcc (GCC) 6.2.1 20160916 (Red Hat 6.2.1-2)
	Clang Version: 3.8.0 (tags/RELEASE_380/final)
	x86_64-native-linuxapp-gcc
	x86_64-native-linuxapp-gcc-debug

OS: FC24
	Kernel Version: 4.9.13-100.fc24.x86_64
	CPU info: Intel(R) Xeon(R) CPU E5-2699 v3 @ 2.30GHz
	GCC Version: gcc (GCC) 6.2.1 20160916 (Red Hat 6.2.1-2)
	Clang Version: 3.8.0 (tags/RELEASE_380/final)
	i686-native-linuxapp-gcc
	x86_64-native-linuxapp-gcc-shared
	x86_64-native-linuxapp-clang

OS: CENTOS
	Kernel Version: 3.10.0-514.10.2.el7.x86_64
	CPU info: Intel(R) Xeon(R) CPU E5-2699 v3 @ 2.30GHz
	GCC Version: gcc (GCC) 4.8.5 20150623 (Red Hat 4.8.5-4)
	Clang Version: 3.4.2 (tags/RELEASE_34/dot2-final)
	i686-native-linuxapp-gcc
	x86_64-native-linuxapp-clang
	x86_64-native-linuxapp-gcc
	x86_64-native-linuxapp-gcc-shared

OS: UB1604
	Kernel Version: 4.4.0-78-generic
	CPU info: Intel(R) Xeon(R) CPU E5-2699 v3 @ 2.30GHz
	GCC Version: gcc (Ubuntu 5.4.0-6ubuntu1~16.04.10) 5.4.0 20160609
	Clang Version: 3.8.0-2ubuntu4 (tags/RELEASE_380/final)
	x86_64-native-linuxapp-gcc
	x86_64-native-linuxapp-clang
	x86_64-native-linuxapp-gcc-shared
	i686-native-linuxapp-gcc

OS: FreeBSD
	Kernel Version: 10.3-RELEASE
	CPU info: Intel(R) Xeon(R) CPU E5-2699 v3 @ 2.30GHz (2294.76-MHz K8-class CPU)
	GCC Version: gcc (FreeBSD Ports Collection) 4.8.5
	Clang Version: 3.4.1 (tags/RELEASE_34/dot1-final 208032) 20140512
	x86_64-native-bsdapp-clang
	x86_64-native-bsdapp-gcc

*Failed Build #1:
OS: FC25
Target: x86_64-native-linuxapp-gcc
  AR librte_pmd_bond.a
  INSTALL-LIB librte_pmd_bond.a
== Build drivers/common/qat
  CC /tmp/FC25_K4.8.6_GCC6.3.1/x86_64-native-linuxapp-gcc/f1b73b77d718441789db6ff0afc2f02c/dpdk/drivers/compress/qat/qat_comp.o
  CC /tmp/FC25_K4.8.6_GCC6.3.1/x86_64-native-linuxapp-gcc/f1b73b77d718441789db6ff0afc2f02c/dpdk/drivers/compress/qat/qat_comp_pmd.o
/tmp/FC25_K4.8.6_GCC6.3.1/x86_64-native-linuxapp-gcc/f1b73b77d718441789db6ff0afc2f02c/dpdk/drivers/compress/qat/qat_comp_pmd.c:13:11: error: ‘RTE_COMP_FF_HUFFMAN_FIXED’ undeclared here (not in a function)
           RTE_COMP_FF_HUFFMAN_FIXED,
           ^~~~~~~~~~~~~~~~~~~~~~~~~
/tmp/FC25_K4.8.6_GCC6.3.1/x86_64-native-linuxapp-gcc/f1b73b77d718441789db6ff0afc2f02c/dpdk/drivers/compress/qat/qat_comp_pmd.c:15:2: warning: missing initializer for field ‘window_size’ of ‘const struct rte_compressdev_capabilities’ [-Wmissing-field-initializers]
  {RTE_COMP_ALGO_LIST_END, 0, {0, 0, 0} } };
  ^
In file included from /tmp/FC25_K4.8.6_GCC6.3.1/x86_64-native-linuxapp-gcc/f1b73b77d718441789db6ff0afc2f02c/dpdk/drivers/compress/qat/qat_comp.h:10:0,
                 from /tmp/FC25_K4.8.6_GCC6.3.1/x86_64-native-linuxapp-gcc/f1b73b77d718441789db6ff0afc2f02c/dpdk/drivers/compress/qat/qat_comp_pmd.c:5:
/tmp/FC25_K4.8.6_GCC6.3.1/x86_64-native-linuxapp-gcc/f1b73b77d718441789db6ff0afc2f02c/dpdk/x86_64-native-linuxapp-gcc/include/rte_compressdev.h:45:30: note: ‘window_size’ declared here
  struct rte_param_log2_range window_size;
                              ^~~~~~~~~~~
/tmp/FC25_K4.8.6_GCC6.3.1/x86_64-native-linuxapp-gcc/f1b73b77d718441789db6ff0afc2f02c/dpdk/mk/internal/rte.compile-pre.mk:114: recipe for target '/tmp/FC25_K4.8.6_GCC6.3.1/x86_64-native-linuxapp-gcc/f1b73b77d718441789db6ff0afc2f02c/dpdk/drivers/compress/qat/qat_comp_pmd.o' failed
make[5]: *** [/tmp/FC25_K4.8.6_GCC6.3.1/x86_64-native-linuxapp-gcc/f1b73b77d718441789db6ff0afc2f02c/dpdk/drivers/compress/qat/qat_comp_pmd.o] Error 1
/tmp/FC25_K4.8.6_GCC6.3.1/x86_64-native-linuxapp-gcc/f1b73b77d718441789db6ff0afc2f02c/dpdk/mk/rte.subdir.mk:35: recipe for target 'common/qat' failed
make[4]: *** [common/qat] Error 2
make[4]: *** Waiting for unfinished jobs....
== Build drivers/net/dpaa
  SYMLINK-FILE include/rte_pmd_dpaa.h
  CC dpaa_ethdev.o
--
  PMDINFO ifcvf_vdpa.o.pmd.c
  CC ifcvf_vdpa.o.pmd.o
  LD ifcvf_vdpa.o
  AR librte_pmd_ifc.a
  INSTALL-LIB librte_pmd_ifc.a
/tmp/FC25_K4.8.6_GCC6.3.1/x86_64-native-linuxapp-gcc/f1b73b77d718441789db6ff0afc2f02c/dpdk/mk/rte.sdkbuild.mk:49: recipe for target 'drivers' failed
make[3]: *** [drivers] Error 2
/tmp/FC25_K4.8.6_GCC6.3.1/x86_64-native-linuxapp-gcc/f1b73b77d718441789db6ff0afc2f02c/dpdk/mk/rte.sdkroot.mk:100: recipe for target 'all' failed
make[2]: *** [all] Error 2
/tmp/FC25_K4.8.6_GCC6.3.1/x86_64-native-linuxapp-gcc/f1b73b77d718441789db6ff0afc2f02c/dpdk/mk/rte.sdkinstall.mk:57: recipe for target 'pre_install' failed
make[1]: *** [pre_install] Error 2
/tmp/FC25_K4.8.6_GCC6.3.1/x86_64-native-linuxapp-gcc/f1b73b77d718441789db6ff0afc2f02c/dpdk/mk/rte.sdkroot.mk:79: recipe for target 'install' failed
make: *** [install] Error 2

*Failed Build #2:
OS: UB1604
Target: x86_64-native-linuxapp-gcc
== Build drivers/common/qat
  CC axgbe_phy_impl.o
  CC /tmp/UB1604_K4.8.0_GCC6.2.0/x86_64-native-linuxapp-gcc/f1b73b77d718441789db6ff0afc2f02c/dpdk/drivers/compress/qat/qat_comp.o
  CC /tmp/UB1604_K4.8.0_GCC6.2.0/x86_64-native-linuxapp-gcc/f1b73b77d718441789db6ff0afc2f02c/dpdk/drivers/compress/qat/qat_comp_pmd.o
  CC axgbe_i2c.o
/tmp/UB1604_K4.8.0_GCC6.2.0/x86_64-native-linuxapp-gcc/f1b73b77d718441789db6ff0afc2f02c/dpdk/drivers/compress/qat/qat_comp_pmd.c:13:11: error: ‘RTE_COMP_FF_HUFFMAN_FIXED’ undeclared here (not in a function)
           RTE_COMP_FF_HUFFMAN_FIXED,
           ^~~~~~~~~~~~~~~~~~~~~~~~~
/tmp/UB1604_K4.8.0_GCC6.2.0/x86_64-native-linuxapp-gcc/f1b73b77d718441789db6ff0afc2f02c/dpdk/drivers/compress/qat/qat_comp_pmd.c:15:2: warning: missing initializer for field ‘window_size’ of ‘const struct rte_compressdev_capabilities’ [-Wmissing-field-initializers]
  {RTE_COMP_ALGO_LIST_END, 0, {0, 0, 0} } };
  ^
In file included from /tmp/UB1604_K4.8.0_GCC6.2.0/x86_64-native-linuxapp-gcc/f1b73b77d718441789db6ff0afc2f02c/dpdk/drivers/compress/qat/qat_comp.h:10:0,
                 from /tmp/UB1604_K4.8.0_GCC6.2.0/x86_64-native-linuxapp-gcc/f1b73b77d718441789db6ff0afc2f02c/dpdk/drivers/compress/qat/qat_comp_pmd.c:5:
/tmp/UB1604_K4.8.0_GCC6.2.0/x86_64-native-linuxapp-gcc/f1b73b77d718441789db6ff0afc2f02c/dpdk/x86_64-native-linuxapp-gcc/include/rte_compressdev.h:45:30: note: ‘window_size’ declared here
  struct rte_param_log2_range window_size;
                              ^~~~~~~~~~~
/tmp/UB1604_K4.8.0_GCC6.2.0/x86_64-native-linuxapp-gcc/f1b73b77d718441789db6ff0afc2f02c/dpdk/mk/internal/rte.compile-pre.mk:114: recipe for target '/tmp/UB1604_K4.8.0_GCC6.2.0/x86_64-native-linuxapp-gcc/f1b73b77d718441789db6ff0afc2f02c/dpdk/drivers/compress/qat/qat_comp_pmd.o' failed
make[5]: *** [/tmp/UB1604_K4.8.0_GCC6.2.0/x86_64-native-linuxapp-gcc/f1b73b77d718441789db6ff0afc2f02c/dpdk/drivers/compress/qat/qat_comp_pmd.o] Error 1
/tmp/UB1604_K4.8.0_GCC6.2.0/x86_64-native-linuxapp-gcc/f1b73b77d718441789db6ff0afc2f02c/dpdk/mk/rte.subdir.mk:35: recipe for target 'common/qat' failed
make[4]: *** [common/qat] Error 2
make[4]: *** Waiting for unfinished jobs....
== Build drivers/net/bonding
  SYMLINK-FILE include/rte_eth_bond.h
  SYMLINK-FILE include/rte_eth_bond_8023ad.h
--
  CC hunt_nic.o
  CC medford_nic.o
  CC medford2_nic.o
  AR librte_pmd_sfc_efx.a
  INSTALL-LIB librte_pmd_sfc_efx.a
/tmp/UB1604_K4.8.0_GCC6.2.0/x86_64-native-linuxapp-gcc/f1b73b77d718441789db6ff0afc2f02c/dpdk/mk/rte.sdkbuild.mk:49: recipe for target 'drivers' failed
make[3]: *** [drivers] Error 2
/tmp/UB1604_K4.8.0_GCC6.2.0/x86_64-native-linuxapp-gcc/f1b73b77d718441789db6ff0afc2f02c/dpdk/mk/rte.sdkroot.mk:100: recipe for target 'all' failed
make[2]: *** [all] Error 2
/tmp/UB1604_K4.8.0_GCC6.2.0/x86_64-native-linuxapp-gcc/f1b73b77d718441789db6ff0afc2f02c/dpdk/mk/rte.sdkinstall.mk:57: recipe for target 'pre_install' failed
make[1]: *** [pre_install] Error 2
/tmp/UB1604_K4.8.0_GCC6.2.0/x86_64-native-linuxapp-gcc/f1b73b77d718441789db6ff0afc2f02c/dpdk/mk/rte.sdkroot.mk:79: recipe for target 'install' failed
make: *** [install] Error 2

*Failed Build #3:
OS: CENTOS
Target: i686-native-linuxapp-gcc
  INSTALL-LIB librte_pmd_virtio_crypto.a
== Build drivers/common/qat
  CC rte_eth_bond_pmd.o
  CC /tmp/CENTOS_K3.10.0_GCC4.8.5/i686-native-linuxapp-gcc/f1b73b77d718441789db6ff0afc2f02c/dpdk/drivers/compress/qat/qat_comp.o
  CC /tmp/CENTOS_K3.10.0_GCC4.8.5/i686-native-linuxapp-gcc/f1b73b77d718441789db6ff0afc2f02c/dpdk/drivers/compress/qat/qat_comp_pmd.o
/tmp/CENTOS_K3.10.0_GCC4.8.5/i686-native-linuxapp-gcc/f1b73b77d718441789db6ff0afc2f02c/dpdk/drivers/compress/qat/qat_comp_pmd.c:13:11: error: ‘RTE_COMP_FF_HUFFMAN_FIXED’ undeclared here (not in a function)
           RTE_COMP_FF_HUFFMAN_FIXED,
           ^
/tmp/CENTOS_K3.10.0_GCC4.8.5/i686-native-linuxapp-gcc/f1b73b77d718441789db6ff0afc2f02c/dpdk/drivers/compress/qat/qat_comp_pmd.c:15:2: warning: missing initializer for field ‘window_size’ of ‘const struct rte_compressdev_capabilities’ [-Wmissing-field-initializers]
  {RTE_COMP_ALGO_LIST_END, 0, {0, 0, 0} } };
  ^
In file included from /tmp/CENTOS_K3.10.0_GCC4.8.5/i686-native-linuxapp-gcc/f1b73b77d718441789db6ff0afc2f02c/dpdk/drivers/compress/qat/qat_comp.h:10:0,
                 from /tmp/CENTOS_K3.10.0_GCC4.8.5/i686-native-linuxapp-gcc/f1b73b77d718441789db6ff0afc2f02c/dpdk/drivers/compress/qat/qat_comp_pmd.c:5:
/tmp/CENTOS_K3.10.0_GCC4.8.5/i686-native-linuxapp-gcc/f1b73b77d718441789db6ff0afc2f02c/dpdk/i686-native-linuxapp-gcc/include/rte_compressdev.h:45:30: note: ‘window_size’ declared here

*Failed Build #4:
OS: CENTOS
Target: x86_64-native-linuxapp-clang
== Build drivers/common/qat
  CC e1000_82543.o
  CC /tmp/CENTOS_K3.10.0_GCC4.8.5/x86_64-native-linuxapp-clang/f1b73b77d718441789db6ff0afc2f02c/dpdk/drivers/compress/qat/qat_comp.o
  CC e1000_82571.o
  CC /tmp/CENTOS_K3.10.0_GCC4.8.5/x86_64-native-linuxapp-clang/f1b73b77d718441789db6ff0afc2f02c/dpdk/drivers/compress/qat/qat_comp_pmd.o
/tmp/CENTOS_K3.10.0_GCC4.8.5/x86_64-native-linuxapp-clang/f1b73b77d718441789db6ff0afc2f02c/dpdk/drivers/compress/qat/qat_comp_pmd.c:13:11: error: use of undeclared identifier 'RTE_COMP_FF_HUFFMAN_FIXED'; did you mean 'RTE_COMP_HUFFMAN_FIXED'?
                               RTE_COMP_FF_HUFFMAN_FIXED,
                               ^~~~~~~~~~~~~~~~~~~~~~~~~
                               RTE_COMP_HUFFMAN_FIXED
/tmp/CENTOS_K3.10.0_GCC4.8.5/x86_64-native-linuxapp-clang/f1b73b77d718441789db6ff0afc2f02c/dpdk/x86_64-native-linuxapp-clang/include/rte_comp.h:144:2: note: 'RTE_COMP_HUFFMAN_FIXED' declared here
        RTE_COMP_HUFFMAN_FIXED,
        ^
1 error generated.
make[5]: *** [/tmp/CENTOS_K3.10.0_GCC4.8.5/x86_64-native-linuxapp-clang/f1b73b77d718441789db6ff0afc2f02c/dpdk/drivers/compress/qat/qat_comp_pmd.o] Error 1
make[4]: *** [common/qat] Error 2
make[4]: *** Waiting for unfinished jobs....
== Build drivers/net/ena
  CC e1000_82575.o

*Failed Build #5:
OS: CENTOS
Target: x86_64-native-linuxapp-gcc
  AR librte_pmd_axgbe.a
  INSTALL-LIB librte_pmd_axgbe.a
== Build drivers/common/qat
  CC /tmp/CENTOS_K3.10.0_GCC4.8.5/x86_64-native-linuxapp-gcc/f1b73b77d718441789db6ff0afc2f02c/dpdk/drivers/compress/qat/qat_comp.o
  CC /tmp/CENTOS_K3.10.0_GCC4.8.5/x86_64-native-linuxapp-gcc/f1b73b77d718441789db6ff0afc2f02c/dpdk/drivers/compress/qat/qat_comp_pmd.o
/tmp/CENTOS_K3.10.0_GCC4.8.5/x86_64-native-linuxapp-gcc/f1b73b77d718441789db6ff0afc2f02c/dpdk/drivers/compress/qat/qat_comp_pmd.c:13:11: error: ‘RTE_COMP_FF_HUFFMAN_FIXED’ undeclared here (not in a function)
           RTE_COMP_FF_HUFFMAN_FIXED,
           ^
/tmp/CENTOS_K3.10.0_GCC4.8.5/x86_64-native-linuxapp-gcc/f1b73b77d718441789db6ff0afc2f02c/dpdk/drivers/compress/qat/qat_comp_pmd.c:15:2: warning: missing initializer for field ‘window_size’ of ‘const struct rte_compressdev_capabilities’ [-Wmissing-field-initializers]
  {RTE_COMP_ALGO_LIST_END, 0, {0, 0, 0} } };
  ^
In file included from /tmp/CENTOS_K3.10.0_GCC4.8.5/x86_64-native-linuxapp-gcc/f1b73b77d718441789db6ff0afc2f02c/dpdk/drivers/compress/qat/qat_comp.h:10:0,
                 from /tmp/CENTOS_K3.10.0_GCC4.8.5/x86_64-native-linuxapp-gcc/f1b73b77d718441789db6ff0afc2f02c/dpdk/drivers/compress/qat/qat_comp_pmd.c:5:
/tmp/CENTOS_K3.10.0_GCC4.8.5/x86_64-native-linuxapp-gcc/f1b73b77d718441789db6ff0afc2f02c/dpdk/x86_64-native-linuxapp-gcc/include/rte_compressdev.h:45:30: note: ‘window_size’ declared here

*Failed Build #6:
OS: UB1604
Target: x86_64-native-linuxapp-clang
== Build drivers/common/qat
  CC /tmp/UB1604_K4.4.0_GCC5.4.0/x86_64-native-linuxapp-clang/f1b73b77d718441789db6ff0afc2f02c/dpdk/drivers/compress/qat/qat_comp.o
  CC e1000_api.o
  CC e1000_ich8lan.o
  CC /tmp/UB1604_K4.4.0_GCC5.4.0/x86_64-native-linuxapp-clang/f1b73b77d718441789db6ff0afc2f02c/dpdk/drivers/compress/qat/qat_comp_pmd.o
/tmp/UB1604_K4.4.0_GCC5.4.0/x86_64-native-linuxapp-clang/f1b73b77d718441789db6ff0afc2f02c/dpdk/drivers/compress/qat/qat_comp_pmd.c:13:11: error: use of undeclared identifier 'RTE_COMP_FF_HUFFMAN_FIXED'; did you mean 'RTE_COMP_HUFFMAN_FIXED'?
                               RTE_COMP_FF_HUFFMAN_FIXED,
                               ^~~~~~~~~~~~~~~~~~~~~~~~~
                               RTE_COMP_HUFFMAN_FIXED
/tmp/UB1604_K4.4.0_GCC5.4.0/x86_64-native-linuxapp-clang/f1b73b77d718441789db6ff0afc2f02c/dpdk/x86_64-native-linuxapp-clang/include/rte_comp.h:144:2: note: 'RTE_COMP_HUFFMAN_FIXED' declared here
        RTE_COMP_HUFFMAN_FIXED,
        ^
1 error generated.
/tmp/UB1604_K4.4.0_GCC5.4.0/x86_64-native-linuxapp-clang/f1b73b77d718441789db6ff0afc2f02c/dpdk/mk/internal/rte.compile-pre.mk:114: recipe for target '/tmp/UB1604_K4.4.0_GCC5.4.0/x86_64-native-linuxapp-clang/f1b73b77d718441789db6ff0afc2f02c/dpdk/drivers/compress/qat/qat_comp_pmd.o' failed
make[5]: *** [/tmp/UB1604_K4.4.0_GCC5.4.0/x86_64-native-linuxapp-clang/f1b73b77d718441789db6ff0afc2f02c/dpdk/drivers/compress/qat/qat_comp_pmd.o] Error 1
/tmp/UB1604_K4.4.0_GCC5.4.0/x86_64-native-linuxapp-clang/f1b73b77d718441789db6ff0afc2f02c/dpdk/mk/rte.subdir.mk:35: recipe for target 'common/qat' failed
make[4]: *** [common/qat] Error 2
make[4]: *** Waiting for unfinished jobs....
  CC e1000_logs.o
== Build drivers/net/enic
  CC enic_ethdev.o
--
  CC ifcvf.o
  AR librte_pmd_ifc.a
  INSTALL-LIB librte_pmd_ifc.a
  AR librte_pmd_softnic.a
  INSTALL-LIB librte_pmd_softnic.a
/tmp/UB1604_K4.4.0_GCC5.4.0/x86_64-native-linuxapp-clang/f1b73b77d718441789db6ff0afc2f02c/dpdk/mk/rte.sdkbuild.mk:49: recipe for target 'drivers' failed
make[3]: *** [drivers] Error 2
/tmp/UB1604_K4.4.0_GCC5.4.0/x86_64-native-linuxapp-clang/f1b73b77d718441789db6ff0afc2f02c/dpdk/mk/rte.sdkroot.mk:100: recipe for target 'all' failed
make[2]: *** [all] Error 2
/tmp/UB1604_K4.4.0_GCC5.4.0/x86_64-native-linuxapp-clang/f1b73b77d718441789db6ff0afc2f02c/dpdk/mk/rte.sdkinstall.mk:57: recipe for target 'pre_install' failed
make[1]: *** [pre_install] Error 2
/tmp/UB1604_K4.4.0_GCC5.4.0/x86_64-native-linuxapp-clang/f1b73b77d718441789db6ff0afc2f02c/dpdk/mk/rte.sdkroot.mk:79: recipe for target 'install' failed
make: *** [install] Error 2

*Failed Build #7:
OS: CENTOS
Target: x86_64-native-linuxapp-gcc-shared
  INSTALL-LIB librte_pmd_virtio_crypto.so.1.1
== Build drivers/common/qat
  CC /tmp/CENTOS_K3.10.0_GCC4.8.5/x86_64-native-linuxapp-gcc-shared/f1b73b77d718441789db6ff0afc2f02c/dpdk/drivers/compress/qat/qat_comp.o
  CC axgbe_rxtx_vec_sse.o
  CC /tmp/CENTOS_K3.10.0_GCC4.8.5/x86_64-native-linuxapp-gcc-shared/f1b73b77d718441789db6ff0afc2f02c/dpdk/drivers/compress/qat/qat_comp_pmd.o
/tmp/CENTOS_K3.10.0_GCC4.8.5/x86_64-native-linuxapp-gcc-shared/f1b73b77d718441789db6ff0afc2f02c/dpdk/drivers/compress/qat/qat_comp_pmd.c:13:11: error: ‘RTE_COMP_FF_HUFFMAN_FIXED’ undeclared here (not in a function)
           RTE_COMP_FF_HUFFMAN_FIXED,
           ^
/tmp/CENTOS_K3.10.0_GCC4.8.5/x86_64-native-linuxapp-gcc-shared/f1b73b77d718441789db6ff0afc2f02c/dpdk/drivers/compress/qat/qat_comp_pmd.c:15:2: warning: missing initializer for field ‘window_size’ of ‘const struct rte_compressdev_capabilities’ [-Wmissing-field-initializers]
  {RTE_COMP_ALGO_LIST_END, 0, {0, 0, 0} } };
  ^
In file included from /tmp/CENTOS_K3.10.0_GCC4.8.5/x86_64-native-linuxapp-gcc-shared/f1b73b77d718441789db6ff0afc2f02c/dpdk/drivers/compress/qat/qat_comp.h:10:0,
                 from /tmp/CENTOS_K3.10.0_GCC4.8.5/x86_64-native-linuxapp-gcc-shared/f1b73b77d718441789db6ff0afc2f02c/dpdk/drivers/compress/qat/qat_comp_pmd.c:5:
/tmp/CENTOS_K3.10.0_GCC4.8.5/x86_64-native-linuxapp-gcc-shared/f1b73b77d718441789db6ff0afc2f02c/dpdk/x86_64-native-linuxapp-gcc/include/rte_compressdev.h:45:30: note: ‘window_size’ declared here

*Failed Build #8:
OS: UB1604
Target: x86_64-native-linuxapp-gcc-shared
== Build drivers/common/qat
  CC /tmp/UB1604_K4.4.0_GCC5.4.0/x86_64-native-linuxapp-gcc-shared/f1b73b77d718441789db6ff0afc2f02c/dpdk/drivers/compress/qat/qat_comp.o
  CC axgbe_i2c.o
  CC axgbe_rxtx.o
  CC /tmp/UB1604_K4.4.0_GCC5.4.0/x86_64-native-linuxapp-gcc-shared/f1b73b77d718441789db6ff0afc2f02c/dpdk/drivers/compress/qat/qat_comp_pmd.o
/tmp/UB1604_K4.4.0_GCC5.4.0/x86_64-native-linuxapp-gcc-shared/f1b73b77d718441789db6ff0afc2f02c/dpdk/drivers/compress/qat/qat_comp_pmd.c:13:11: error: ‘RTE_COMP_FF_HUFFMAN_FIXED’ undeclared here (not in a function)
           RTE_COMP_FF_HUFFMAN_FIXED,
           ^
/tmp/UB1604_K4.4.0_GCC5.4.0/x86_64-native-linuxapp-gcc-shared/f1b73b77d718441789db6ff0afc2f02c/dpdk/drivers/compress/qat/qat_comp_pmd.c:15:2: warning: missing initializer for field ‘window_size’ of ‘const struct rte_compressdev_capabilities’ [-Wmissing-field-initializers]
  {RTE_COMP_ALGO_LIST_END, 0, {0, 0, 0} } };
  ^
In file included from /tmp/UB1604_K4.4.0_GCC5.4.0/x86_64-native-linuxapp-gcc-shared/f1b73b77d718441789db6ff0afc2f02c/dpdk/drivers/compress/qat/qat_comp.h:10:0,
                 from /tmp/UB1604_K4.4.0_GCC5.4.0/x86_64-native-linuxapp-gcc-shared/f1b73b77d718441789db6ff0afc2f02c/dpdk/drivers/compress/qat/qat_comp_pmd.c:5:
/tmp/UB1604_K4.4.0_GCC5.4.0/x86_64-native-linuxapp-gcc-shared/f1b73b77d718441789db6ff0afc2f02c/dpdk/x86_64-native-linuxapp-gcc/include/rte_compressdev.h:45:30: note: ‘window_size’ declared here
  struct rte_param_log2_range window_size;
                              ^
/tmp/UB1604_K4.4.0_GCC5.4.0/x86_64-native-linuxapp-gcc-shared/f1b73b77d718441789db6ff0afc2f02c/dpdk/mk/internal/rte.compile-pre.mk:114: recipe for target '/tmp/UB1604_K4.4.0_GCC5.4.0/x86_64-native-linuxapp-gcc-shared/f1b73b77d718441789db6ff0afc2f02c/dpdk/drivers/compress/qat/qat_comp_pmd.o' failed
make[5]: *** [/tmp/UB1604_K4.4.0_GCC5.4.0/x86_64-native-linuxapp-gcc-shared/f1b73b77d718441789db6ff0afc2f02c/dpdk/drivers/compress/qat/qat_comp_pmd.o] Error 1
/tmp/UB1604_K4.4.0_GCC5.4.0/x86_64-native-linuxapp-gcc-shared/f1b73b77d718441789db6ff0afc2f02c/dpdk/mk/rte.subdir.mk:35: recipe for target 'common/qat' failed
make[4]: *** [common/qat] Error 2
make[4]: *** Waiting for unfinished jobs....
== Build drivers/net/bonding
  SYMLINK-FILE include/rte_eth_bond.h
  SYMLINK-FILE include/rte_eth_bond_8023ad.h
--
  LD ifcvf_vdpa.o
  CC ifcvf.o
  INSTALL-LIB librte_pmd_vhost.so.2.1
  LD librte_pmd_ifc.so.1.1
  INSTALL-LIB librte_pmd_ifc.so.1.1
/tmp/UB1604_K4.4.0_GCC5.4.0/x86_64-native-linuxapp-gcc-shared/f1b73b77d718441789db6ff0afc2f02c/dpdk/mk/rte.sdkbuild.mk:49: recipe for target 'drivers' failed
make[3]: *** [drivers] Error 2
/tmp/UB1604_K4.4.0_GCC5.4.0/x86_64-native-linuxapp-gcc-shared/f1b73b77d718441789db6ff0afc2f02c/dpdk/mk/rte.sdkroot.mk:100: recipe for target 'all' failed
make[2]: *** [all] Error 2
/tmp/UB1604_K4.4.0_GCC5.4.0/x86_64-native-linuxapp-gcc-shared/f1b73b77d718441789db6ff0afc2f02c/dpdk/mk/rte.sdkinstall.mk:57: recipe for target 'pre_install' failed
make[1]: *** [pre_install] Error 2
/tmp/UB1604_K4.4.0_GCC5.4.0/x86_64-native-linuxapp-gcc-shared/f1b73b77d718441789db6ff0afc2f02c/dpdk/mk/rte.sdkroot.mk:79: recipe for target 'install' failed
make: *** [install] Error 2

*Failed Build #9:
OS: UB1604
Target: i686-native-linuxapp-gcc
== Build drivers/common/qat
  CC bnxt_rxq.o
  CC /tmp/UB1604_K4.4.0_GCC5.4.0/i686-native-linuxapp-gcc/f1b73b77d718441789db6ff0afc2f02c/dpdk/drivers/compress/qat/qat_comp.o
  CC /tmp/UB1604_K4.4.0_GCC5.4.0/i686-native-linuxapp-gcc/f1b73b77d718441789db6ff0afc2f02c/dpdk/drivers/compress/qat/qat_comp_pmd.o
  CC bnxt_rxr.o
/tmp/UB1604_K4.4.0_GCC5.4.0/i686-native-linuxapp-gcc/f1b73b77d718441789db6ff0afc2f02c/dpdk/drivers/compress/qat/qat_comp_pmd.c:13:11: error: ‘RTE_COMP_FF_HUFFMAN_FIXED’ undeclared here (not in a function)
           RTE_COMP_FF_HUFFMAN_FIXED,
           ^
/tmp/UB1604_K4.4.0_GCC5.4.0/i686-native-linuxapp-gcc/f1b73b77d718441789db6ff0afc2f02c/dpdk/drivers/compress/qat/qat_comp_pmd.c:15:2: warning: missing initializer for field ‘window_size’ of ‘const struct rte_compressdev_capabilities’ [-Wmissing-field-initializers]
  {RTE_COMP_ALGO_LIST_END, 0, {0, 0, 0} } };
  ^
In file included from /tmp/UB1604_K4.4.0_GCC5.4.0/i686-native-linuxapp-gcc/f1b73b77d718441789db6ff0afc2f02c/dpdk/drivers/compress/qat/qat_comp.h:10:0,
                 from /tmp/UB1604_K4.4.0_GCC5.4.0/i686-native-linuxapp-gcc/f1b73b77d718441789db6ff0afc2f02c/dpdk/drivers/compress/qat/qat_comp_pmd.c:5:
/tmp/UB1604_K4.4.0_GCC5.4.0/i686-native-linuxapp-gcc/f1b73b77d718441789db6ff0afc2f02c/dpdk/i686-native-linuxapp-gcc/include/rte_compressdev.h:45:30: note: ‘window_size’ declared here
  struct rte_param_log2_range window_size;
                              ^
/tmp/UB1604_K4.4.0_GCC5.4.0/i686-native-linuxapp-gcc/f1b73b77d718441789db6ff0afc2f02c/dpdk/mk/internal/rte.compile-pre.mk:114: recipe for target '/tmp/UB1604_K4.4.0_GCC5.4.0/i686-native-linuxapp-gcc/f1b73b77d718441789db6ff0afc2f02c/dpdk/drivers/compress/qat/qat_comp_pmd.o' failed
make[5]: *** [/tmp/UB1604_K4.4.0_GCC5.4.0/i686-native-linuxapp-gcc/f1b73b77d718441789db6ff0afc2f02c/dpdk/drivers/compress/qat/qat_comp_pmd.o] Error 1
/tmp/UB1604_K4.4.0_GCC5.4.0/i686-native-linuxapp-gcc/f1b73b77d718441789db6ff0afc2f02c/dpdk/mk/rte.subdir.mk:35: recipe for target 'common/qat' failed
make[4]: *** [common/qat] Error 2
make[4]: *** Waiting for unfinished jobs....
  CC bnxt_stats.o
== Build drivers/net/null
  CC rte_eth_null.o
--
  PMDINFO ifcvf_vdpa.o.pmd.c
  CC ifcvf_vdpa.o.pmd.o
  LD ifcvf_vdpa.o
  AR librte_pmd_ifc.a
  INSTALL-LIB librte_pmd_ifc.a
/tmp/UB1604_K4.4.0_GCC5.4.0/i686-native-linuxapp-gcc/f1b73b77d718441789db6ff0afc2f02c/dpdk/mk/rte.sdkbuild.mk:49: recipe for target 'drivers' failed
make[3]: *** [drivers] Error 2
/tmp/UB1604_K4.4.0_GCC5.4.0/i686-native-linuxapp-gcc/f1b73b77d718441789db6ff0afc2f02c/dpdk/mk/rte.sdkroot.mk:100: recipe for target 'all' failed
make[2]: *** [all] Error 2
/tmp/UB1604_K4.4.0_GCC5.4.0/i686-native-linuxapp-gcc/f1b73b77d718441789db6ff0afc2f02c/dpdk/mk/rte.sdkinstall.mk:57: recipe for target 'pre_install' failed
make[1]: *** [pre_install] Error 2
/tmp/UB1604_K4.4.0_GCC5.4.0/i686-native-linuxapp-gcc/f1b73b77d718441789db6ff0afc2f02c/dpdk/mk/rte.sdkroot.mk:79: recipe for target 'install' failed
make: *** [install] Error 2

*Failed Build #10:
OS: FreeBSD
Target: x86_64-native-bsdapp-clang
x86 -> /usr/src/sys/x86/include
awk -f @/tools/makeobjops.awk @/kern/device_if.m -h
awk -f @/tools/makeobjops.awk @/kern/device_if.m -h
awk -f @/tools/makeobjops.awk @/kern/bus_if.m -h
awk -f @/tools/makeobjops.awk @/kern/bus_if.m -h
cc -Winline -Wall -Werror -include /tmp/FreeBSD_K10.3_GCC4.8.5/x86_64-native-bsdapp-clang/f1b73b77d718441789db6ff0afc2f02c/dpdk/x86_64-native-bsdapp-clang/include/rte_config.h  -Werror -D_KERNEL -DKLD_MODULE -nostdinc  -I/tmp/FreeBSD_K10.3_GCC4.8.5/x86_64-native-bsdapp-clang/f1b73b77d718441789db6ff0afc2f02c/dpdk/kernel/freebsd/contigmem -I/tmp/FreeBSD_K10.3_GCC4.8.5/x86_64-native-bsdapp-clang/f1b73b77d718441789db6ff0afc2f02c/dpdk/x86_64-native-bsdapp-clang/include -I. -I@ -I@/contrib/altq -fno-common  -fno-omit-frame-pointer -mno-omit-leaf-frame-pointer  -mno-aes -mno-avx -mcmodel=kernel -mno-red-zone -mno-mmx -mno-sse -msoft-float  -fno-asynchronous-unwind-tables -ffreestanding -fstack-protector -std=iso9899:1999 -Qunused-arguments  -fstack-protector -Wall -Wredundant-decls -Wnested-externs -Wstrict-prototypes  -Wmissing-prototypes -Wpointer-arith -Winline -Wcast-qual  -Wundef -Wno-pointer-sign -fformat-extensions  -Wmissing-include-dirs -fdiagnostics-show-option  -Wno-error-tautological-compare -Wno-error-empty-body  -Wno-error-parentheses-equality -Wno-error-unused-function    -c contigmem.c -o contigmem.o
awk -f @/tools/makeobjops.awk @/dev/pci/pci_if.m -h
cc -Winline -Wall -Werror -include /tmp/FreeBSD_K10.3_GCC4.8.5/x86_64-native-bsdapp-clang/f1b73b77d718441789db6ff0afc2f02c/dpdk/x86_64-native-bsdapp-clang/include/rte_config.h  -Werror -D_KERNEL -DKLD_MODULE -nostdinc  -I/tmp/FreeBSD_K10.3_GCC4.8.5/x86_64-native-bsdapp-clang/f1b73b77d718441789db6ff0afc2f02c/dpdk/kernel/freebsd/nic_uio -I/tmp/FreeBSD_K10.3_GCC4.8.5/x86_64-native-bsdapp-clang/f1b73b77d718441789db6ff0afc2f02c/dpdk/x86_64-native-bsdapp-clang/include -I. -I@ -I@/contrib/altq -fno-common  -fno-omit-frame-pointer -mno-omit-leaf-frame-pointer  -mno-aes -mno-avx -mcmodel=kernel -mno-red-zone -mno-mmx -mno-sse -msoft-float  -fno-asynchronous-unwind-tables -ffreestanding -fstack-protector -std=iso9899:1999 -Qunused-arguments  -fstack-protector -Wall -Wredundant-decls -Wnested-externs -Wstrict-prototypes  -Wmissing-prototypes -Wpointer-arith -Winline -Wcast-qual  -Wundef -Wno-pointer-sign -fformat-extensions  -Wmissing-include-dirs -fdiagnostics-show-option  -Wno-error-tautological-compare -Wno-error-empty-body  -Wno-error-parentheses-equality -Wno-error-unused-function    -c nic_uio.c -o nic_uio.o
ld      -L/tmp/FreeBSD_K10.3_GCC4.8.5/x86_64-native-bsdapp-clang/f1b73b77d718441789db6ff0afc2f02c/dpdk/x86_64-native-bsdapp-clang/lib -d -warn-common -r -d -o contigmem.ko contigmem.o
ld      -L/tmp/FreeBSD_K10.3_GCC4.8.5/x86_64-native-bsdapp-clang/f1b73b77d718441789db6ff0afc2f02c/dpdk/x86_64-native-bsdapp-clang/lib -d -warn-common -r -d -o nic_uio.ko nic_uio.o
:> export_syms
:> export_syms
awk -f /sys/conf/kmod_syms.awk contigmem.ko  export_syms | xargs -J% objcopy % contigmem.ko
--
== Build drivers/net/cxgbe
  CC /tmp/FreeBSD_K10.3_GCC4.8.5/x86_64-native-bsdapp-clang/f1b73b77d718441789db6ff0afc2f02c/dpdk/drivers/compress/qat/qat_comp_pmd.o
  CC cxgbe_ethdev.o
  PMDINFO cxgbe_ethdev.o.pmd.c
  CC cxgbe_ethdev.o.pmd.o
/tmp/FreeBSD_K10.3_GCC4.8.5/x86_64-native-bsdapp-clang/f1b73b77d718441789db6ff0afc2f02c/dpdk/drivers/compress/qat/qat_comp_pmd.c:13:11: error: use of undeclared identifier 'RTE_COMP_FF_HUFFMAN_FIXED'; did you mean 'RTE_COMP_HUFFMAN_FIXED'?
                               RTE_COMP_FF_HUFFMAN_FIXED,
                               ^~~~~~~~~~~~~~~~~~~~~~~~~
                               RTE_COMP_HUFFMAN_FIXED
/tmp/FreeBSD_K10.3_GCC4.8.5/x86_64-native-bsdapp-clang/f1b73b77d718441789db6ff0afc2f02c/dpdk/x86_64-native-bsdapp-clang/include/rte_comp.h:144:2: note: 'RTE_COMP_HUFFMAN_FIXED' declared here
        RTE_COMP_HUFFMAN_FIXED,
        ^
1 error generated.
/tmp/FreeBSD_K10.3_GCC4.8.5/x86_64-native-bsdapp-clang/f1b73b77d718441789db6ff0afc2f02c/dpdk/mk/internal/rte.compile-pre.mk:114: recipe for target '/tmp/FreeBSD_K10.3_GCC4.8.5/x86_64-native-bsdapp-clang/f1b73b77d718441789db6ff0afc2f02c/dpdk/drivers/compress/qat/qat_comp_pmd.o' failed
gmake[5]: *** [/tmp/FreeBSD_K10.3_GCC4.8.5/x86_64-native-bsdapp-clang/f1b73b77d718441789db6ff0afc2f02c/dpdk/drivers/compress/qat/qat_comp_pmd.o] Error 1
/tmp/FreeBSD_K10.3_GCC4.8.5/x86_64-native-bsdapp-clang/f1b73b77d718441789db6ff0afc2f02c/dpdk/mk/rte.subdir.mk:35: recipe for target 'common/qat' failed
gmake[4]: *** [common/qat] Error 2
gmake[4]: *** Waiting for unfinished jobs....
  LD cxgbe_ethdev.o
  CC cxgbevf_ethdev.o
== Build drivers/net/e1000
--
  PMDINFO rte_eth_softnic.o.pmd.c
  CC rte_eth_softnic.o.pmd.o
  LD rte_eth_softnic.o
  AR librte_pmd_softnic.a
  INSTALL-LIB librte_pmd_softnic.a
/tmp/FreeBSD_K10.3_GCC4.8.5/x86_64-native-bsdapp-clang/f1b73b77d718441789db6ff0afc2f02c/dpdk/mk/rte.sdkbuild.mk:49: recipe for target 'drivers' failed
gmake[3]: *** [drivers] Error 2
/tmp/FreeBSD_K10.3_GCC4.8.5/x86_64-native-bsdapp-clang/f1b73b77d718441789db6ff0afc2f02c/dpdk/mk/rte.sdkroot.mk:100: recipe for target 'all' failed
gmake[2]: *** [all] Error 2
/tmp/FreeBSD_K10.3_GCC4.8.5/x86_64-native-bsdapp-clang/f1b73b77d718441789db6ff0afc2f02c/dpdk/mk/rte.sdkinstall.mk:57: recipe for target 'pre_install' failed
gmake[1]: *** [pre_install] Error 2
/tmp/FreeBSD_K10.3_GCC4.8.5/x86_64-native-bsdapp-clang/f1b73b77d718441789db6ff0afc2f02c/dpdk/mk/rte.sdkroot.mk:79: recipe for target 'install' failed
gmake: *** [install] Error 2

*Failed Build #11:
OS: FreeBSD
Target: x86_64-native-bsdapp-gcc
@ -> /usr/src/sys
machine -> /usr/src/sys/amd64/include
x86 -> /usr/src/sys/x86/include
awk -f @/tools/makeobjops.awk @/kern/device_if.m -h
awk -f @/tools/makeobjops.awk @/kern/bus_if.m -h
cc -Winline -Wall -Werror -include /tmp/FreeBSD_K10.3_GCC4.8.5/x86_64-native-bsdapp-gcc/f1b73b77d718441789db6ff0afc2f02c/dpdk/x86_64-native-bsdapp-gcc/include/rte_config.h  -Werror -D_KERNEL -DKLD_MODULE -nostdinc  -I/tmp/FreeBSD_K10.3_GCC4.8.5/x86_64-native-bsdapp-gcc/f1b73b77d718441789db6ff0afc2f02c/dpdk/kernel/freebsd/contigmem -I/tmp/FreeBSD_K10.3_GCC4.8.5/x86_64-native-bsdapp-gcc/f1b73b77d718441789db6ff0afc2f02c/dpdk/x86_64-native-bsdapp-gcc/include -I. -I@ -I@/contrib/altq -fno-common  -fno-omit-frame-pointer -mno-omit-leaf-frame-pointer  -mno-aes -mno-avx -mcmodel=kernel -mno-red-zone -mno-mmx -mno-sse -msoft-float  -fno-asynchronous-unwind-tables -ffreestanding -fstack-protector -std=iso9899:1999 -Qunused-arguments  -fstack-protector -Wall -Wredundant-decls -Wnested-externs -Wstrict-prototypes  -Wmissing-prototypes -Wpointer-arith -Winline -Wcast-qual  -Wundef -Wno-pointer-sign -fformat-extensions  -Wmissing-include-dirs -fdiagnostics-show-option  -Wno-error-tautological-compare -Wno-error-empty-body  -Wno-error-parentheses-equality -Wno-error-unused-function    -c contigmem.c -o contigmem.o
ld      -L/tmp/FreeBSD_K10.3_GCC4.8.5/x86_64-native-bsdapp-gcc/f1b73b77d718441789db6ff0afc2f02c/dpdk/x86_64-native-bsdapp-gcc/lib -d -warn-common -r -d -o contigmem.ko contigmem.o
:> export_syms
awk -f /sys/conf/kmod_syms.awk contigmem.ko  export_syms | xargs -J% objcopy % contigmem.ko
objcopy --strip-debug contigmem.ko
INSTALL-MODULE contigmem.ko
--
machine -> /usr/src/sys/amd64/include
x86 -> /usr/src/sys/x86/include
awk -f @/tools/makeobjops.awk @/kern/device_if.m -h
awk -f @/tools/makeobjops.awk @/kern/bus_if.m -h
awk -f @/tools/makeobjops.awk @/dev/pci/pci_if.m -h
cc -Winline -Wall -Werror -include /tmp/FreeBSD_K10.3_GCC4.8.5/x86_64-native-bsdapp-gcc/f1b73b77d718441789db6ff0afc2f02c/dpdk/x86_64-native-bsdapp-gcc/include/rte_config.h  -Werror -D_KERNEL -DKLD_MODULE -nostdinc  -I/tmp/FreeBSD_K10.3_GCC4.8.5/x86_64-native-bsdapp-gcc/f1b73b77d718441789db6ff0afc2f02c/dpdk/kernel/freebsd/nic_uio -I/tmp/FreeBSD_K10.3_GCC4.8.5/x86_64-native-bsdapp-gcc/f1b73b77d718441789db6ff0afc2f02c/dpdk/x86_64-native-bsdapp-gcc/include -I. -I@ -I@/contrib/altq -fno-common  -fno-omit-frame-pointer -mno-omit-leaf-frame-pointer  -mno-aes -mno-avx -mcmodel=kernel -mno-red-zone -mno-mmx -mno-sse -msoft-float  -fno-asynchronous-unwind-tables -ffreestanding -fstack-protector -std=iso9899:1999 -Qunused-arguments  -fstack-protector -Wall -Wredundant-decls -Wnested-externs -Wstrict-prototypes  -Wmissing-prototypes -Wpointer-arith -Winline -Wcast-qual  -Wundef -Wno-pointer-sign -fformat-extensions  -Wmissing-include-dirs -fdiagnostics-show-option  -Wno-error-tautological-compare -Wno-error-empty-body  -Wno-error-parentheses-equality -Wno-error-unused-function    -c nic_uio.c -o nic_uio.o
ld      -L/tmp/FreeBSD_K10.3_GCC4.8.5/x86_64-native-bsdapp-gcc/f1b73b77d718441789db6ff0afc2f02c/dpdk/x86_64-native-bsdapp-gcc/lib -d -warn-common -r -d -o nic_uio.ko nic_uio.o
:> export_syms
awk -f /sys/conf/kmod_syms.awk nic_uio.ko  export_syms | xargs -J% objcopy % nic_uio.ko
objcopy --strip-debug nic_uio.ko
INSTALL-MODULE nic_uio.ko
--
  CC /tmp/FreeBSD_K10.3_GCC4.8.5/x86_64-native-bsdapp-gcc/f1b73b77d718441789db6ff0afc2f02c/dpdk/drivers/compress/qat/qat_comp.o
  AR librte_pmd_bond.a
  INSTALL-LIB librte_pmd_bond.a
== Build drivers/net/cxgbe
  CC /tmp/FreeBSD_K10.3_GCC4.8.5/x86_64-native-bsdapp-gcc/f1b73b77d718441789db6ff0afc2f02c/dpdk/drivers/compress/qat/qat_comp_pmd.o
/tmp/FreeBSD_K10.3_GCC4.8.5/x86_64-native-bsdapp-gcc/f1b73b77d718441789db6ff0afc2f02c/dpdk/drivers/compress/qat/qat_comp_pmd.c:13:11: error: 'RTE_COMP_FF_HUFFMAN_FIXED' undeclared here (not in a function)
           RTE_COMP_FF_HUFFMAN_FIXED,
           ^
/tmp/FreeBSD_K10.3_GCC4.8.5/x86_64-native-bsdapp-gcc/f1b73b77d718441789db6ff0afc2f02c/dpdk/drivers/compress/qat/qat_comp_pmd.c:15:2: warning: missing initializer for field 'window_size' of 'const struct rte_compressdev_capabilities' [-Wmissing-field-initializers]
  {RTE_COMP_ALGO_LIST_END, 0, {0, 0, 0} } };
  ^
In file included from /tmp/FreeBSD_K10.3_GCC4.8.5/x86_64-native-bsdapp-gcc/f1b73b77d718441789db6ff0afc2f02c/dpdk/drivers/compress/qat/qat_comp.h:10:0,
                 from /tmp/FreeBSD_K10.3_GCC4.8.5/x86_64-native-bsdapp-gcc/f1b73b77d718441789db6ff0afc2f02c/dpdk/drivers/compress/qat/qat_comp_pmd.c:5:
/tmp/FreeBSD_K10.3_GCC4.8.5/x86_64-native-bsdapp-gcc/f1b73b77d718441789db6ff0afc2f02c/dpdk/x86_64-native-bsdapp-gcc/include/rte_compressdev.h:45:30: note: 'window_size' declared here
  struct rte_param_log2_range window_size;
                              ^
/tmp/FreeBSD_K10.3_GCC4.8.5/x86_64-native-bsdapp-gcc/f1b73b77d718441789db6ff0afc2f02c/dpdk/mk/internal/rte.compile-pre.mk:114: recipe for target '/tmp/FreeBSD_K10.3_GCC4.8.5/x86_64-native-bsdapp-gcc/f1b73b77d718441789db6ff0afc2f02c/dpdk/drivers/compress/qat/qat_comp_pmd.o' failed
gmake[5]: *** [/tmp/FreeBSD_K10.3_GCC4.8.5/x86_64-native-bsdapp-gcc/f1b73b77d718441789db6ff0afc2f02c/dpdk/drivers/compress/qat/qat_comp_pmd.o] Error 1
/tmp/FreeBSD_K10.3_GCC4.8.5/x86_64-native-bsdapp-gcc/f1b73b77d718441789db6ff0afc2f02c/dpdk/mk/rte.subdir.mk:35: recipe for target 'common/qat' failed
gmake[4]: *** [common/qat] Error 2
gmake[4]: *** Waiting for unfinished jobs....
== Build drivers/net/e1000
  CC cxgbe_ethdev.o
  CC e1000_80003es2lan.o
--
  PMDINFO rte_eth_softnic.o.pmd.c
  CC rte_eth_softnic.o.pmd.o
  LD rte_eth_softnic.o
  AR librte_pmd_softnic.a
  INSTALL-LIB librte_pmd_softnic.a
/tmp/FreeBSD_K10.3_GCC4.8.5/x86_64-native-bsdapp-gcc/f1b73b77d718441789db6ff0afc2f02c/dpdk/mk/rte.sdkbuild.mk:49: recipe for target 'drivers' failed
gmake[3]: *** [drivers] Error 2
/tmp/FreeBSD_K10.3_GCC4.8.5/x86_64-native-bsdapp-gcc/f1b73b77d718441789db6ff0afc2f02c/dpdk/mk/rte.sdkroot.mk:100: recipe for target 'all' failed
gmake[2]: *** [all] Error 2
/tmp/FreeBSD_K10.3_GCC4.8.5/x86_64-native-bsdapp-gcc/f1b73b77d718441789db6ff0afc2f02c/dpdk/mk/rte.sdkinstall.mk:57: recipe for target 'pre_install' failed
gmake[1]: *** [pre_install] Error 2
/tmp/FreeBSD_K10.3_GCC4.8.5/x86_64-native-bsdapp-gcc/f1b73b77d718441789db6ff0afc2f02c/dpdk/mk/rte.sdkroot.mk:79: recipe for target 'install' failed
gmake: *** [install] Error 2

*Failed Build #12:
OS: FC25
Target: x86_64-native-linuxapp-gcc-debug
  CC axgbe_rxtx.o
== Build drivers/common/qat
  CC /tmp/FC25_K4.8.6_GCC6.3.1/x86_64-native-linuxapp-gcc-debug/f1b73b77d718441789db6ff0afc2f02c/dpdk/drivers/compress/qat/qat_comp.o
  CC axgbe_rxtx_vec_sse.o
  CC /tmp/FC25_K4.8.6_GCC6.3.1/x86_64-native-linuxapp-gcc-debug/f1b73b77d718441789db6ff0afc2f02c/dpdk/drivers/compress/qat/qat_comp_pmd.o
/tmp/FC25_K4.8.6_GCC6.3.1/x86_64-native-linuxapp-gcc-debug/f1b73b77d718441789db6ff0afc2f02c/dpdk/drivers/compress/qat/qat_comp_pmd.c:13:11: error: ‘RTE_COMP_FF_HUFFMAN_FIXED’ undeclared here (not in a function)
           RTE_COMP_FF_HUFFMAN_FIXED,
           ^~~~~~~~~~~~~~~~~~~~~~~~~
/tmp/FC25_K4.8.6_GCC6.3.1/x86_64-native-linuxapp-gcc-debug/f1b73b77d718441789db6ff0afc2f02c/dpdk/drivers/compress/qat/qat_comp_pmd.c:15:2: warning: missing initializer for field ‘window_size’ of ‘const struct rte_compressdev_capabilities’ [-Wmissing-field-initializers]
  {RTE_COMP_ALGO_LIST_END, 0, {0, 0, 0} } };
  ^
In file included from /tmp/FC25_K4.8.6_GCC6.3.1/x86_64-native-linuxapp-gcc-debug/f1b73b77d718441789db6ff0afc2f02c/dpdk/drivers/compress/qat/qat_comp.h:10:0,
                 from /tmp/FC25_K4.8.6_GCC6.3.1/x86_64-native-linuxapp-gcc-debug/f1b73b77d718441789db6ff0afc2f02c/dpdk/drivers/compress/qat/qat_comp_pmd.c:5:
/tmp/FC25_K4.8.6_GCC6.3.1/x86_64-native-linuxapp-gcc-debug/f1b73b77d718441789db6ff0afc2f02c/dpdk/x86_64-native-linuxapp-gcc/include/rte_compressdev.h:45:30: note: ‘window_size’ declared here
  struct rte_param_log2_range window_size;
                              ^~~~~~~~~~~
/tmp/FC25_K4.8.6_GCC6.3.1/x86_64-native-linuxapp-gcc-debug/f1b73b77d718441789db6ff0afc2f02c/dpdk/mk/internal/rte.compile-pre.mk:114: recipe for target '/tmp/FC25_K4.8.6_GCC6.3.1/x86_64-native-linuxapp-gcc-debug/f1b73b77d718441789db6ff0afc2f02c/dpdk/drivers/compress/qat/qat_comp_pmd.o' failed
make[5]: *** [/tmp/FC25_K4.8.6_GCC6.3.1/x86_64-native-linuxapp-gcc-debug/f1b73b77d718441789db6ff0afc2f02c/dpdk/drivers/compress/qat/qat_comp_pmd.o] Error 1
/tmp/FC25_K4.8.6_GCC6.3.1/x86_64-native-linuxapp-gcc-debug/f1b73b77d718441789db6ff0afc2f02c/dpdk/mk/rte.subdir.mk:35: recipe for target 'common/qat' failed
make[4]: *** [common/qat] Error 2
make[4]: *** Waiting for unfinished jobs....
== Build drivers/net/bonding
  AR librte_pmd_axgbe.a
  INSTALL-LIB librte_pmd_axgbe.a
--
  PMDINFO rte_eth_vhost.o.pmd.c
  CC rte_eth_vhost.o.pmd.o
  LD rte_eth_vhost.o
  AR librte_pmd_vhost.a
  INSTALL-LIB librte_pmd_vhost.a
/tmp/FC25_K4.8.6_GCC6.3.1/x86_64-native-linuxapp-gcc-debug/f1b73b77d718441789db6ff0afc2f02c/dpdk/mk/rte.sdkbuild.mk:49: recipe for target 'drivers' failed
make[3]: *** [drivers] Error 2
/tmp/FC25_K4.8.6_GCC6.3.1/x86_64-native-linuxapp-gcc-debug/f1b73b77d718441789db6ff0afc2f02c/dpdk/mk/rte.sdkroot.mk:100: recipe for target 'all' failed
make[2]: *** [all] Error 2
/tmp/FC25_K4.8.6_GCC6.3.1/x86_64-native-linuxapp-gcc-debug/f1b73b77d718441789db6ff0afc2f02c/dpdk/mk/rte.sdkinstall.mk:57: recipe for target 'pre_install' failed
make[1]: *** [pre_install] Error 2
/tmp/FC25_K4.8.6_GCC6.3.1/x86_64-native-linuxapp-gcc-debug/f1b73b77d718441789db6ff0afc2f02c/dpdk/mk/rte.sdkroot.mk:79: recipe for target 'install' failed
make: *** [install] Error 2

*Failed Build #13:
OS: FC24
Target: i686-native-linuxapp-gcc
  CC /tmp/FC24_K4.5.5_GCC6.1.1/i686-native-linuxapp-gcc/f1b73b77d718441789db6ff0afc2f02c/dpdk/drivers/compress/qat/qat_comp.o
  SYMLINK-FILE include/rte_eth_bond.h
  SYMLINK-FILE include/rte_eth_bond_8023ad.h
  CC rte_eth_bond_api.o
  CC /tmp/FC24_K4.5.5_GCC6.1.1/i686-native-linuxapp-gcc/f1b73b77d718441789db6ff0afc2f02c/dpdk/drivers/compress/qat/qat_comp_pmd.o
/tmp/FC24_K4.5.5_GCC6.1.1/i686-native-linuxapp-gcc/f1b73b77d718441789db6ff0afc2f02c/dpdk/drivers/compress/qat/qat_comp_pmd.c:13:11: error: ‘RTE_COMP_FF_HUFFMAN_FIXED’ undeclared here (not in a function)
           RTE_COMP_FF_HUFFMAN_FIXED,
           ^~~~~~~~~~~~~~~~~~~~~~~~~
/tmp/FC24_K4.5.5_GCC6.1.1/i686-native-linuxapp-gcc/f1b73b77d718441789db6ff0afc2f02c/dpdk/drivers/compress/qat/qat_comp_pmd.c:15:2: warning: missing initializer for field ‘window_size’ of ‘const struct rte_compressdev_capabilities’ [-Wmissing-field-initializers]
  {RTE_COMP_ALGO_LIST_END, 0, {0, 0, 0} } };
  ^
In file included from /tmp/FC24_K4.5.5_GCC6.1.1/i686-native-linuxapp-gcc/f1b73b77d718441789db6ff0afc2f02c/dpdk/drivers/compress/qat/qat_comp.h:10:0,
                 from /tmp/FC24_K4.5.5_GCC6.1.1/i686-native-linuxapp-gcc/f1b73b77d718441789db6ff0afc2f02c/dpdk/drivers/compress/qat/qat_comp_pmd.c:5:
/tmp/FC24_K4.5.5_GCC6.1.1/i686-native-linuxapp-gcc/f1b73b77d718441789db6ff0afc2f02c/dpdk/i686-native-linuxapp-gcc/include/rte_compressdev.h:45:30: note: ‘window_size’ declared here
  struct rte_param_log2_range window_size;
                              ^~~~~~~~~~~
/tmp/FC24_K4.5.5_GCC6.1.1/i686-native-linuxapp-gcc/f1b73b77d718441789db6ff0afc2f02c/dpdk/mk/internal/rte.compile-pre.mk:114: recipe for target '/tmp/FC24_K4.5.5_GCC6.1.1/i686-native-linuxapp-gcc/f1b73b77d718441789db6ff0afc2f02c/dpdk/drivers/compress/qat/qat_comp_pmd.o' failed
make[5]: *** [/tmp/FC24_K4.5.5_GCC6.1.1/i686-native-linuxapp-gcc/f1b73b77d718441789db6ff0afc2f02c/dpdk/drivers/compress/qat/qat_comp_pmd.o] Error 1
/tmp/FC24_K4.5.5_GCC6.1.1/i686-native-linuxapp-gcc/f1b73b77d718441789db6ff0afc2f02c/dpdk/mk/rte.subdir.mk:35: recipe for target 'common/qat' failed
make[4]: *** [common/qat] Error 2
make[4]: *** Waiting for unfinished jobs....
  CC rte_eth_bond_pmd.o
  CC rte_eth_bond_args.o
  CC rte_eth_bond_8023ad.o
--
  LD rte_eth_vhost.o
  AR librte_pmd_vhost.a
  INSTALL-LIB librte_pmd_vhost.a
  AR librte_pmd_ifc.a
  INSTALL-LIB librte_pmd_ifc.a
/tmp/FC24_K4.5.5_GCC6.1.1/i686-native-linuxapp-gcc/f1b73b77d718441789db6ff0afc2f02c/dpdk/mk/rte.sdkbuild.mk:49: recipe for target 'drivers' failed
make[3]: *** [drivers] Error 2
/tmp/FC24_K4.5.5_GCC6.1.1/i686-native-linuxapp-gcc/f1b73b77d718441789db6ff0afc2f02c/dpdk/mk/rte.sdkroot.mk:100: recipe for target 'all' failed
make[2]: *** [all] Error 2
/tmp/FC24_K4.5.5_GCC6.1.1/i686-native-linuxapp-gcc/f1b73b77d718441789db6ff0afc2f02c/dpdk/mk/rte.sdkinstall.mk:57: recipe for target 'pre_install' failed
make[1]: *** [pre_install] Error 2
/tmp/FC24_K4.5.5_GCC6.1.1/i686-native-linuxapp-gcc/f1b73b77d718441789db6ff0afc2f02c/dpdk/mk/rte.sdkroot.mk:79: recipe for target 'install' failed
make: *** [install] Error 2

*Failed Build #14:
OS: FC24
Target: x86_64-native-linuxapp-gcc-shared
== Build drivers/common/qat
  CC /tmp/FC24_K4.9.13_GCC6.2.1/x86_64-native-linuxapp-gcc-shared/f1b73b77d718441789db6ff0afc2f02c/dpdk/drivers/compress/qat/qat_comp.o
  CC axgbe_i2c.o
  CC /tmp/FC24_K4.9.13_GCC6.2.1/x86_64-native-linuxapp-gcc-shared/f1b73b77d718441789db6ff0afc2f02c/dpdk/drivers/compress/qat/qat_comp_pmd.o
  CC axgbe_rxtx.o
/tmp/FC24_K4.9.13_GCC6.2.1/x86_64-native-linuxapp-gcc-shared/f1b73b77d718441789db6ff0afc2f02c/dpdk/drivers/compress/qat/qat_comp_pmd.c:13:11: error: ‘RTE_COMP_FF_HUFFMAN_FIXED’ undeclared here (not in a function)
           RTE_COMP_FF_HUFFMAN_FIXED,
           ^~~~~~~~~~~~~~~~~~~~~~~~~
/tmp/FC24_K4.9.13_GCC6.2.1/x86_64-native-linuxapp-gcc-shared/f1b73b77d718441789db6ff0afc2f02c/dpdk/drivers/compress/qat/qat_comp_pmd.c:15:2: warning: missing initializer for field ‘window_size’ of ‘const struct rte_compressdev_capabilities’ [-Wmissing-field-initializers]
  {RTE_COMP_ALGO_LIST_END, 0, {0, 0, 0} } };
  ^
In file included from /tmp/FC24_K4.9.13_GCC6.2.1/x86_64-native-linuxapp-gcc-shared/f1b73b77d718441789db6ff0afc2f02c/dpdk/drivers/compress/qat/qat_comp.h:10:0,
                 from /tmp/FC24_K4.9.13_GCC6.2.1/x86_64-native-linuxapp-gcc-shared/f1b73b77d718441789db6ff0afc2f02c/dpdk/drivers/compress/qat/qat_comp_pmd.c:5:
/tmp/FC24_K4.9.13_GCC6.2.1/x86_64-native-linuxapp-gcc-shared/f1b73b77d718441789db6ff0afc2f02c/dpdk/x86_64-native-linuxapp-gcc/include/rte_compressdev.h:45:30: note: ‘window_size’ declared here
  struct rte_param_log2_range window_size;
                              ^~~~~~~~~~~
/tmp/FC24_K4.9.13_GCC6.2.1/x86_64-native-linuxapp-gcc-shared/f1b73b77d718441789db6ff0afc2f02c/dpdk/mk/internal/rte.compile-pre.mk:114: recipe for target '/tmp/FC24_K4.9.13_GCC6.2.1/x86_64-native-linuxapp-gcc-shared/f1b73b77d718441789db6ff0afc2f02c/dpdk/drivers/compress/qat/qat_comp_pmd.o' failed
make[5]: *** [/tmp/FC24_K4.9.13_GCC6.2.1/x86_64-native-linuxapp-gcc-shared/f1b73b77d718441789db6ff0afc2f02c/dpdk/drivers/compress/qat/qat_comp_pmd.o] Error 1
/tmp/FC24_K4.9.13_GCC6.2.1/x86_64-native-linuxapp-gcc-shared/f1b73b77d718441789db6ff0afc2f02c/dpdk/mk/rte.subdir.mk:35: recipe for target 'common/qat' failed
make[4]: *** [common/qat] Error 2
make[4]: *** Waiting for unfinished jobs....
== Build drivers/net/bonding
  SYMLINK-FILE include/rte_eth_bond.h
  SYMLINK-FILE include/rte_eth_bond_8023ad.h
--
  PMDINFO ifcvf_vdpa.o.pmd.c
  CC ifcvf_vdpa.o.pmd.o
  LD ifcvf_vdpa.o
  LD librte_pmd_ifc.so.1.1
  INSTALL-LIB librte_pmd_ifc.so.1.1
/tmp/FC24_K4.9.13_GCC6.2.1/x86_64-native-linuxapp-gcc-shared/f1b73b77d718441789db6ff0afc2f02c/dpdk/mk/rte.sdkbuild.mk:49: recipe for target 'drivers' failed
make[3]: *** [drivers] Error 2
/tmp/FC24_K4.9.13_GCC6.2.1/x86_64-native-linuxapp-gcc-shared/f1b73b77d718441789db6ff0afc2f02c/dpdk/mk/rte.sdkroot.mk:100: recipe for target 'all' failed
make[2]: *** [all] Error 2
/tmp/FC24_K4.9.13_GCC6.2.1/x86_64-native-linuxapp-gcc-shared/f1b73b77d718441789db6ff0afc2f02c/dpdk/mk/rte.sdkinstall.mk:57: recipe for target 'pre_install' failed
make[1]: *** [pre_install] Error 2
/tmp/FC24_K4.9.13_GCC6.2.1/x86_64-native-linuxapp-gcc-shared/f1b73b77d718441789db6ff0afc2f02c/dpdk/mk/rte.sdkroot.mk:79: recipe for target 'install' failed
make: *** [install] Error 2

*Failed Build #15:
OS: FC24
Target: x86_64-native-linuxapp-clang
  INSTALL-LIB librte_pmd_virtio_crypto.a
== Build drivers/common/qat
  CC /tmp/FC24_K4.9.13_GCC6.2.1/x86_64-native-linuxapp-clang/f1b73b77d718441789db6ff0afc2f02c/dpdk/drivers/compress/qat/qat_comp.o
  CC i40e_flow.o
  CC /tmp/FC24_K4.9.13_GCC6.2.1/x86_64-native-linuxapp-clang/f1b73b77d718441789db6ff0afc2f02c/dpdk/drivers/compress/qat/qat_comp_pmd.o
/tmp/FC24_K4.9.13_GCC6.2.1/x86_64-native-linuxapp-clang/f1b73b77d718441789db6ff0afc2f02c/dpdk/drivers/compress/qat/qat_comp_pmd.c:13:11: error: use of undeclared identifier 'RTE_COMP_FF_HUFFMAN_FIXED'; did you mean 'RTE_COMP_HUFFMAN_FIXED'?
                               RTE_COMP_FF_HUFFMAN_FIXED,
                               ^~~~~~~~~~~~~~~~~~~~~~~~~
                               RTE_COMP_HUFFMAN_FIXED
/tmp/FC24_K4.9.13_GCC6.2.1/x86_64-native-linuxapp-clang/f1b73b77d718441789db6ff0afc2f02c/dpdk/x86_64-native-linuxapp-clang/include/rte_comp.h:144:2: note: 'RTE_COMP_HUFFMAN_FIXED' declared here
        RTE_COMP_HUFFMAN_FIXED,
        ^
1 error generated.
/tmp/FC24_K4.9.13_GCC6.2.1/x86_64-native-linuxapp-clang/f1b73b77d718441789db6ff0afc2f02c/dpdk/mk/internal/rte.compile-pre.mk:114: recipe for target '/tmp/FC24_K4.9.13_GCC6.2.1/x86_64-native-linuxapp-clang/f1b73b77d718441789db6ff0afc2f02c/dpdk/drivers/compress/qat/qat_comp_pmd.o' failed
make[5]: *** [/tmp/FC24_K4.9.13_GCC6.2.1/x86_64-native-linuxapp-clang/f1b73b77d718441789db6ff0afc2f02c/dpdk/drivers/compress/qat/qat_comp_pmd.o] Error 1
/tmp/FC24_K4.9.13_GCC6.2.1/x86_64-native-linuxapp-clang/f1b73b77d718441789db6ff0afc2f02c/dpdk/mk/rte.subdir.mk:35: recipe for target 'common/qat' failed
make[4]: *** [common/qat] Error 2
make[4]: *** Waiting for unfinished jobs....
  CC rte_pmd_i40e.o
== Build drivers/net/ixgbe
  SYMLINK-FILE include/rte_pmd_ixgbe.h
--
  PMDINFO ifcvf_vdpa.o.pmd.c
  CC ifcvf_vdpa.o.pmd.o
  LD ifcvf_vdpa.o
  AR librte_pmd_ifc.a
  INSTALL-LIB librte_pmd_ifc.a
/tmp/FC24_K4.9.13_GCC6.2.1/x86_64-native-linuxapp-clang/f1b73b77d718441789db6ff0afc2f02c/dpdk/mk/rte.sdkbuild.mk:49: recipe for target 'drivers' failed
make[3]: *** [drivers] Error 2
/tmp/FC24_K4.9.13_GCC6.2.1/x86_64-native-linuxapp-clang/f1b73b77d718441789db6ff0afc2f02c/dpdk/mk/rte.sdkroot.mk:100: recipe for target 'all' failed
make[2]: *** [all] Error 2
/tmp/FC24_K4.9.13_GCC6.2.1/x86_64-native-linuxapp-clang/f1b73b77d718441789db6ff0afc2f02c/dpdk/mk/rte.sdkinstall.mk:57: recipe for target 'pre_install' failed
make[1]: *** [pre_install] Error 2
/tmp/FC24_K4.9.13_GCC6.2.1/x86_64-native-linuxapp-clang/f1b73b77d718441789db6ff0afc2f02c/dpdk/mk/rte.sdkroot.mk:79: recipe for target 'install' failed
make: *** [install] Error 2

DPDK STV team


More information about the test-report mailing list