[dpdk-test-report] |FAILURE| pw42618[v3, 2/4] net/ixgbe: enable hotplug detect in ixgbe

sys_stv at intel.com sys_stv at intel.com
Mon Jul 9 13:56:10 CEST 2018


Test-Label: Intel-compilation
Test-Status: FAILURE
http://dpdk.org/patch/42618

_Compilation issues_

Submitter: Jeff Guo <jia.guo at intel.com>
Date: 2018-07-09 11:46:15
DPDK git baseline: Repo:dpdk-master, CommitID: 05e0eee0001cb19671eb7e8d3dd68680a695fea2

Build Summary: 15 Builds Done, 12 Successful, 3 Failures

Test environment and configuration as below:

OS: FC25
	Kernel Version: 4.9.13-100.fc24.x86_64
	CPU info: Intel(R) Xeon(R) CPU E5-2699 v3 @ 2.30GHz
	GCC Version: gcc (GCC) 6.2.1 20160916 (Red Hat 6.2.1-2)
	Clang Version: 3.8.0 (tags/RELEASE_380/final)
	x86_64-native-linuxapp-gcc
	x86_64-native-linuxapp-gcc-debug

OS: FC24
	Kernel Version: 4.9.13-100.fc24.x86_64
	CPU info: Intel(R) Xeon(R) CPU E5-2699 v3 @ 2.30GHz
	GCC Version: gcc (GCC) 6.2.1 20160916 (Red Hat 6.2.1-2)
	Clang Version: 3.8.0 (tags/RELEASE_380/final)
	x86_64-native-linuxapp-gcc-shared
	i686-native-linuxapp-gcc
	x86_64-native-linuxapp-clang

OS: CENTOS
	Kernel Version: 3.10.0-514.10.2.el7.x86_64
	CPU info: Intel(R) Xeon(R) CPU E5-2699 v3 @ 2.30GHz
	GCC Version: gcc (GCC) 4.8.5 20150623 (Red Hat 4.8.5-4)
	Clang Version: 3.4.2 (tags/RELEASE_34/dot2-final)
	x86_64-native-linuxapp-clang
	x86_64-native-linuxapp-gcc-shared
	i686-native-linuxapp-gcc
	x86_64-native-linuxapp-gcc

OS: UB1604
	Kernel Version: 4.4.0-78-generic
	CPU info: Intel(R) Xeon(R) CPU E5-2699 v3 @ 2.30GHz
	GCC Version: gcc (Ubuntu 5.4.0-6ubuntu1~16.04.10) 5.4.0 20160609
	Clang Version: 3.8.0-2ubuntu4 (tags/RELEASE_380/final)
	x86_64-native-linuxapp-gcc
	x86_64-native-linuxapp-gcc-shared
	x86_64-native-linuxapp-clang
	i686-native-linuxapp-gcc

OS: FreeBSD
	Kernel Version: 10.3-RELEASE
	CPU info: Intel(R) Xeon(R) CPU E5-2699 v3 @ 2.30GHz (2294.76-MHz K8-class CPU)
	GCC Version: gcc (FreeBSD Ports Collection) 4.8.5
	Clang Version: 3.4.1 (tags/RELEASE_34/dot1-final 208032) 20140512
	x86_64-native-bsdapp-clang
	x86_64-native-bsdapp-gcc

*Failed Build #1:
OS: UB1604
Target: x86_64-native-linuxapp-gcc-shared
  CC i40e_rxtx_vec_avx2.o
  CC ixgbe_vf_representor.o
  LD librte_pmd_ixgbe.so.2.1
ixgbe_ethdev.o: In function `eth_ixgbevf_dev_init':
ixgbe_ethdev.c:(.text+0x7be6): undefined reference to `rte_eth_dev_event_callback'
collect2: error: ld returned 1 exit status
/tmp/UB1604_K4.4.0_GCC5.4.0/x86_64-native-linuxapp-gcc-shared/e66be6df4a5648abb6c64cb92568571e/dpdk/mk/rte.lib.mk:98: recipe for target 'librte_pmd_ixgbe.so.2.1' failed
make[6]: *** [librte_pmd_ixgbe.so.2.1] Error 1
/tmp/UB1604_K4.4.0_GCC5.4.0/x86_64-native-linuxapp-gcc-shared/e66be6df4a5648abb6c64cb92568571e/dpdk/mk/rte.subdir.mk:35: recipe for target 'ixgbe' failed
make[5]: *** [ixgbe] Error 2
make[5]: *** Waiting for unfinished jobs....
  LD librte_pmd_i40e.so.2.1
i40e_ethdev.o: In function `eth_i40e_dev_init':
i40e_ethdev.c:(.text+0x1412f): undefined reference to `rte_eth_dev_event_callback'
collect2: error: ld returned 1 exit status
/tmp/UB1604_K4.4.0_GCC5.4.0/x86_64-native-linuxapp-gcc-shared/e66be6df4a5648abb6c64cb92568571e/dpdk/mk/rte.lib.mk:98: recipe for target 'librte_pmd_i40e.so.2.1' failed
make[6]: *** [librte_pmd_i40e.so.2.1] Error 1
/tmp/UB1604_K4.4.0_GCC5.4.0/x86_64-native-linuxapp-gcc-shared/e66be6df4a5648abb6c64cb92568571e/dpdk/mk/rte.subdir.mk:35: recipe for target 'i40e' failed
make[5]: *** [i40e] Error 2
/tmp/UB1604_K4.4.0_GCC5.4.0/x86_64-native-linuxapp-gcc-shared/e66be6df4a5648abb6c64cb92568571e/dpdk/mk/rte.subdir.mk:35: recipe for target 'net' failed
make[4]: *** [net] Error 2
/tmp/UB1604_K4.4.0_GCC5.4.0/x86_64-native-linuxapp-gcc-shared/e66be6df4a5648abb6c64cb92568571e/dpdk/mk/rte.sdkbuild.mk:49: recipe for target 'drivers' failed
make[3]: *** [drivers] Error 2
/tmp/UB1604_K4.4.0_GCC5.4.0/x86_64-native-linuxapp-gcc-shared/e66be6df4a5648abb6c64cb92568571e/dpdk/mk/rte.sdkroot.mk:100: recipe for target 'all' failed
make[2]: *** [all] Error 2
/tmp/UB1604_K4.4.0_GCC5.4.0/x86_64-native-linuxapp-gcc-shared/e66be6df4a5648abb6c64cb92568571e/dpdk/mk/rte.sdkinstall.mk:57: recipe for target 'pre_install' failed
make[1]: *** [pre_install] Error 2
/tmp/UB1604_K4.4.0_GCC5.4.0/x86_64-native-linuxapp-gcc-shared/e66be6df4a5648abb6c64cb92568571e/dpdk/mk/rte.sdkroot.mk:79: recipe for target 'install' failed
make: *** [install] Error 2

*Failed Build #2:
OS: CENTOS
Target: x86_64-native-linuxapp-gcc-shared
  CC i40e_vf_representor.o
  CC i40e_rxtx_vec_avx2.o
  LD librte_pmd_i40e.so.2.1
i40e_ethdev.o: In function `eth_i40e_dev_init':
i40e_ethdev.c:(.text+0x15a25): undefined reference to `rte_eth_dev_event_callback'
collect2: error: ld returned 1 exit status
make[6]: *** [librte_pmd_i40e.so.2.1] Error 1
make[5]: *** [i40e] Error 2
make[5]: *** Waiting for unfinished jobs....
  CC ixgbe_fdir.o
  CC ixgbe_pf.o
--
  CC ixgbe_tm.o
  CC ixgbe_vf_representor.o
  LD librte_pmd_ixgbe.so.2.1
ixgbe_ethdev.o: In function `eth_ixgbevf_dev_init':
ixgbe_ethdev.c:(.text+0x50f1): undefined reference to `rte_eth_dev_event_callback'
collect2: error: ld returned 1 exit status
make[6]: *** [librte_pmd_ixgbe.so.2.1] Error 1
make[5]: *** [ixgbe] Error 2
make[4]: *** [net] Error 2
make[3]: *** [drivers] Error 2
make[2]: *** [all] Error 2

*Failed Build #3:
OS: FC24
Target: x86_64-native-linuxapp-gcc-shared
  CC i40e_rxtx_vec_avx2.o
  CC ixgbe_rxtx_vec_sse.o
  LD librte_pmd_i40e.so.2.1
i40e_ethdev.o: In function `eth_i40e_dev_init':
i40e_ethdev.c:(.text+0x13ee7): undefined reference to `rte_eth_dev_event_callback'
collect2: error: ld returned 1 exit status
/tmp/FC24_K4.9.13_GCC6.2.1/x86_64-native-linuxapp-gcc-shared/e66be6df4a5648abb6c64cb92568571e/dpdk/mk/rte.lib.mk:98: recipe for target 'librte_pmd_i40e.so.2.1' failed
make[6]: *** [librte_pmd_i40e.so.2.1] Error 1
/tmp/FC24_K4.9.13_GCC6.2.1/x86_64-native-linuxapp-gcc-shared/e66be6df4a5648abb6c64cb92568571e/dpdk/mk/rte.subdir.mk:35: recipe for target 'i40e' failed
make[5]: *** [i40e] Error 2
make[5]: *** Waiting for unfinished jobs....
  CC ixgbe_ipsec.o
  CC rte_pmd_ixgbe.o
  CC ixgbe_tm.o
  CC ixgbe_vf_representor.o
  LD librte_pmd_ixgbe.so.2.1
ixgbe_ethdev.o: In function `eth_ixgbevf_dev_init':
ixgbe_ethdev.c:(.text+0x7464): undefined reference to `rte_eth_dev_event_callback'
collect2: error: ld returned 1 exit status
/tmp/FC24_K4.9.13_GCC6.2.1/x86_64-native-linuxapp-gcc-shared/e66be6df4a5648abb6c64cb92568571e/dpdk/mk/rte.lib.mk:98: recipe for target 'librte_pmd_ixgbe.so.2.1' failed
make[6]: *** [librte_pmd_ixgbe.so.2.1] Error 1
/tmp/FC24_K4.9.13_GCC6.2.1/x86_64-native-linuxapp-gcc-shared/e66be6df4a5648abb6c64cb92568571e/dpdk/mk/rte.subdir.mk:35: recipe for target 'ixgbe' failed
make[5]: *** [ixgbe] Error 2
/tmp/FC24_K4.9.13_GCC6.2.1/x86_64-native-linuxapp-gcc-shared/e66be6df4a5648abb6c64cb92568571e/dpdk/mk/rte.subdir.mk:35: recipe for target 'net' failed
make[4]: *** [net] Error 2
/tmp/FC24_K4.9.13_GCC6.2.1/x86_64-native-linuxapp-gcc-shared/e66be6df4a5648abb6c64cb92568571e/dpdk/mk/rte.sdkbuild.mk:49: recipe for target 'drivers' failed
make[3]: *** [drivers] Error 2
/tmp/FC24_K4.9.13_GCC6.2.1/x86_64-native-linuxapp-gcc-shared/e66be6df4a5648abb6c64cb92568571e/dpdk/mk/rte.sdkroot.mk:100: recipe for target 'all' failed
make[2]: *** [all] Error 2
/tmp/FC24_K4.9.13_GCC6.2.1/x86_64-native-linuxapp-gcc-shared/e66be6df4a5648abb6c64cb92568571e/dpdk/mk/rte.sdkinstall.mk:57: recipe for target 'pre_install' failed
make[1]: *** [pre_install] Error 2
/tmp/FC24_K4.9.13_GCC6.2.1/x86_64-native-linuxapp-gcc-shared/e66be6df4a5648abb6c64cb92568571e/dpdk/mk/rte.sdkroot.mk:79: recipe for target 'install' failed
make: *** [install] Error 2

DPDK STV team


More information about the test-report mailing list