[dpdk-test-report] |FAILURE| pw42887[v3, 2/2] librte_lpm: Improve performance of the delete and add functions

sys_stv at intel.com sys_stv at intel.com
Wed Jul 11 20:01:15 CEST 2018


Test-Label: Intel-compilation
Test-Status: FAILURE
http://dpdk.org/patch/42887

_Compilation issues_

Submitter: Alex Kiselev <alex at therouter.net>
Date: 2018-07-11 17:53:51
DPDK git baseline: Repo:dpdk-master, CommitID: 26fd4b73125ca77690f7a97423e6b031ea98835d

Build Summary: 15 Builds Done, 12 Successful, 3 Failures

Test environment and configuration as below:

OS: FC25
	Kernel Version: 4.9.13-100.fc24.x86_64
	CPU info: Intel(R) Xeon(R) CPU E5-2699 v3 @ 2.30GHz
	GCC Version: gcc (GCC) 6.2.1 20160916 (Red Hat 6.2.1-2)
	Clang Version: 3.8.0 (tags/RELEASE_380/final)
	x86_64-native-linuxapp-gcc
	x86_64-native-linuxapp-gcc-debug

OS: FC24
	Kernel Version: 4.9.13-100.fc24.x86_64
	CPU info: Intel(R) Xeon(R) CPU E5-2699 v3 @ 2.30GHz
	GCC Version: gcc (GCC) 6.2.1 20160916 (Red Hat 6.2.1-2)
	Clang Version: 3.8.0 (tags/RELEASE_380/final)
	x86_64-native-linuxapp-gcc-shared
	i686-native-linuxapp-gcc
	x86_64-native-linuxapp-clang

OS: CENTOS
	Kernel Version: 3.10.0-514.10.2.el7.x86_64
	CPU info: Intel(R) Xeon(R) CPU E5-2699 v3 @ 2.30GHz
	GCC Version: gcc (GCC) 4.8.5 20150623 (Red Hat 4.8.5-4)
	Clang Version: 3.4.2 (tags/RELEASE_34/dot2-final)
	x86_64-native-linuxapp-gcc-shared
	x86_64-native-linuxapp-clang
	i686-native-linuxapp-gcc
	x86_64-native-linuxapp-gcc

OS: UB1604
	Kernel Version: 4.4.0-78-generic
	CPU info: Intel(R) Xeon(R) CPU E5-2699 v3 @ 2.30GHz
	GCC Version: gcc (Ubuntu 5.4.0-6ubuntu1~16.04.10) 5.4.0 20160609
	Clang Version: 3.8.0-2ubuntu4 (tags/RELEASE_380/final)
	x86_64-native-linuxapp-gcc
	x86_64-native-linuxapp-gcc-shared
	x86_64-native-linuxapp-clang
	i686-native-linuxapp-gcc

OS: FreeBSD
	Kernel Version: 10.3-RELEASE
	CPU info: Intel(R) Xeon(R) CPU E5-2699 v3 @ 2.30GHz (2294.76-MHz K8-class CPU)
	GCC Version: gcc (FreeBSD Ports Collection) 4.8.5
	Clang Version: 3.4.1 (tags/RELEASE_34/dot1-final 208032) 20140512
	x86_64-native-bsdapp-clang
	x86_64-native-bsdapp-gcc

*Failed Build #1:
OS: CENTOS
Target: x86_64-native-linuxapp-gcc-shared
rte_lpm6.o: In function `rte_lpm6_delete':
rte_lpm6.c:(.text+0x258d): undefined reference to `rte_hash_lookup_data'
rte_lpm6.c:(.text+0x25a2): undefined reference to `rte_hash_del_key'
rte_lpm6.c:(.text+0x277c): undefined reference to `rte_hash_lookup_data'
rte_lpm6.c:(.text+0x297b): undefined reference to `rte_mempool_ops_table'
collect2: error: ld returned 1 exit status
make[5]: *** [librte_lpm.so.2.1] Error 1
make[4]: *** [librte_lpm] Error 2
make[4]: *** Waiting for unfinished jobs....
  SYMLINK-FILE include/rte_icmp.h
  SYMLINK-FILE include/rte_arp.h

*Failed Build #2:
OS: UB1604
Target: x86_64-native-linuxapp-gcc-shared
rte_lpm6.c:(.text+0x3147): undefined reference to `rte_hash_lookup_data'
rte_lpm6.c:(.text+0x315b): undefined reference to `rte_hash_del_key'
rte_lpm6.c:(.text+0x3323): undefined reference to `rte_hash_lookup_data'
rte_lpm6.c:(.text+0x37d9): undefined reference to `rte_mempool_ops_table'
rte_lpm6.c:(.text+0x38aa): undefined reference to `rte_mempool_ops_table'
collect2: error: ld returned 1 exit status
/tmp/UB1604_K4.4.0_GCC5.4.0/x86_64-native-linuxapp-gcc-shared/82770aadb0ea4309be4b1cb0d69e2d56/dpdk/mk/rte.lib.mk:98: recipe for target 'librte_lpm.so.2.1' failed
make[5]: *** [librte_lpm.so.2.1] Error 1
/tmp/UB1604_K4.4.0_GCC5.4.0/x86_64-native-linuxapp-gcc-shared/82770aadb0ea4309be4b1cb0d69e2d56/dpdk/mk/rte.subdir.mk:35: recipe for target 'librte_lpm' failed
make[4]: *** [librte_lpm] Error 2
make[4]: *** Waiting for unfinished jobs....
  CC rte_net_crc.o
  CC rte_arp.o
  LD librte_net.so.1.1
  INSTALL-LIB librte_net.so.1.1
/tmp/UB1604_K4.4.0_GCC5.4.0/x86_64-native-linuxapp-gcc-shared/82770aadb0ea4309be4b1cb0d69e2d56/dpdk/mk/rte.sdkbuild.mk:49: recipe for target 'lib' failed
make[3]: *** [lib] Error 2
/tmp/UB1604_K4.4.0_GCC5.4.0/x86_64-native-linuxapp-gcc-shared/82770aadb0ea4309be4b1cb0d69e2d56/dpdk/mk/rte.sdkroot.mk:100: recipe for target 'all' failed
make[2]: *** [all] Error 2
/tmp/UB1604_K4.4.0_GCC5.4.0/x86_64-native-linuxapp-gcc-shared/82770aadb0ea4309be4b1cb0d69e2d56/dpdk/mk/rte.sdkinstall.mk:57: recipe for target 'pre_install' failed
make[1]: *** [pre_install] Error 2
/tmp/UB1604_K4.4.0_GCC5.4.0/x86_64-native-linuxapp-gcc-shared/82770aadb0ea4309be4b1cb0d69e2d56/dpdk/mk/rte.sdkroot.mk:79: recipe for target 'install' failed
make: *** [install] Error 2

*Failed Build #3:
OS: FC24
Target: x86_64-native-linuxapp-gcc-shared
rte_lpm6.c:(.text+0x3034): undefined reference to `rte_hash_lookup_data'
rte_lpm6.c:(.text+0x3048): undefined reference to `rte_hash_del_key'
rte_lpm6.c:(.text+0x3425): undefined reference to `rte_hash_lookup_data'
rte_lpm6.c:(.text+0x3888): undefined reference to `rte_mempool_ops_table'
rte_lpm6.c:(.text+0x395c): undefined reference to `rte_mempool_ops_table'
collect2: error: ld returned 1 exit status
/tmp/FC24_K4.9.13_GCC6.2.1/x86_64-native-linuxapp-gcc-shared/82770aadb0ea4309be4b1cb0d69e2d56/dpdk/mk/rte.lib.mk:98: recipe for target 'librte_lpm.so.2.1' failed
make[5]: *** [librte_lpm.so.2.1] Error 1
/tmp/FC24_K4.9.13_GCC6.2.1/x86_64-native-linuxapp-gcc-shared/82770aadb0ea4309be4b1cb0d69e2d56/dpdk/mk/rte.subdir.mk:35: recipe for target 'librte_lpm' failed
make[4]: *** [librte_lpm] Error 2
make[4]: *** Waiting for unfinished jobs....
  CC rte_net_crc.o
  CC rte_arp.o
  LD librte_net.so.1.1
  INSTALL-LIB librte_net.so.1.1
/tmp/FC24_K4.9.13_GCC6.2.1/x86_64-native-linuxapp-gcc-shared/82770aadb0ea4309be4b1cb0d69e2d56/dpdk/mk/rte.sdkbuild.mk:49: recipe for target 'lib' failed
make[3]: *** [lib] Error 2
/tmp/FC24_K4.9.13_GCC6.2.1/x86_64-native-linuxapp-gcc-shared/82770aadb0ea4309be4b1cb0d69e2d56/dpdk/mk/rte.sdkroot.mk:100: recipe for target 'all' failed
make[2]: *** [all] Error 2
/tmp/FC24_K4.9.13_GCC6.2.1/x86_64-native-linuxapp-gcc-shared/82770aadb0ea4309be4b1cb0d69e2d56/dpdk/mk/rte.sdkinstall.mk:57: recipe for target 'pre_install' failed
make[1]: *** [pre_install] Error 2
/tmp/FC24_K4.9.13_GCC6.2.1/x86_64-native-linuxapp-gcc-shared/82770aadb0ea4309be4b1cb0d69e2d56/dpdk/mk/rte.sdkroot.mk:79: recipe for target 'install' failed
make: *** [install] Error 2

DPDK STV team


More information about the test-report mailing list