[dpdk-test-report] |FAILURE| pw44640[04/10] crypto/caam_jr: add device configuration routines

sys_stv at intel.com sys_stv at intel.com
Thu Sep 13 08:23:01 CEST 2018


Test-Label: Intel-compilation
Test-Status: FAILURE
http://dpdk.org/patch/44640

_Compilation issues_

Submitter: Gagandeep Singh <g.singh at nxp.com>
Date: 2018-09-13 06:08:40
DPDK git baseline: Repo:dpdk-master, CommitID: 3605968c2fa783674624562a7dfab256eb9044ea

Build Summary: 15 Builds Done, 2 Successful, 13 Failures

Test environment and configuration as below:

OS: FC25
	Kernel Version: 4.9.13-100.fc24.x86_64
	CPU info: Intel(R) Xeon(R) CPU E5-2699 v3 @ 2.30GHz
	GCC Version: gcc (GCC) 6.2.1 20160916 (Red Hat 6.2.1-2)
	Clang Version: 3.8.0 (tags/RELEASE_380/final)
	x86_64-native-linuxapp-gcc
	x86_64-native-linuxapp-gcc-debug

OS: FC24
	Kernel Version: 4.9.13-100.fc24.x86_64
	CPU info: Intel(R) Xeon(R) CPU E5-2699 v3 @ 2.30GHz
	GCC Version: gcc (GCC) 6.2.1 20160916 (Red Hat 6.2.1-2)
	Clang Version: 3.8.0 (tags/RELEASE_380/final)
	i686-native-linuxapp-gcc
	x86_64-native-linuxapp-clang
	x86_64-native-linuxapp-gcc-shared

OS: CENTOS
	Kernel Version: 3.10.0-327.el7.x86_64
	CPU info: Intel(R) Xeon(R) CPU E5-2699 v3 @ 2.30GHz
	GCC Version: gcc (GCC) 4.8.5 20150623 (Red Hat 4.8.5-28)
	Clang Version: NA
	x86_64-native-linuxapp-gcc
	x86_64-native-linuxapp-clang
	x86_64-native-linuxapp-gcc-shared
	i686-native-linuxapp-gcc

OS: UB1604
	Kernel Version: 4.4.0-128-generic
	CPU info: Intel(R) Xeon(R) CPU E5-2699 v3 @ 2.30GHz
	GCC Version: gcc (Ubuntu 5.4.0-6ubuntu1~16.04.10) 5.4.0 20160609
	Clang Version: 3.8.0-2ubuntu4 (tags/RELEASE_380/final)
	x86_64-native-linuxapp-gcc
	x86_64-native-linuxapp-clang
	i686-native-linuxapp-gcc
	x86_64-native-linuxapp-gcc-shared

OS: FreeBSD
	Kernel Version: 10.3-RELEASE
	CPU info: Intel(R) Xeon(R) CPU E5-2699 v3 @ 2.30GHz (2294.76-MHz K8-class CPU)
	GCC Version: gcc (FreeBSD Ports Collection) 4.8.5
	Clang Version: 3.4.1 (tags/RELEASE_34/dot1-final 208032) 20140512
	x86_64-native-bsdapp-clang
	x86_64-native-bsdapp-gcc

*Failed Build #1:
OS: FC25
Target: x86_64-native-linuxapp-gcc
  LD ark_ethdev.o
  CC ark_ethdev_rx.o
  CC caam_jr.o
In file included from /tmp/FC25_K4.8.6_GCC6.3.1/x86_64-native-linuxapp-gcc/74427493f7bc49f9bc980a9c1db12576/dpdk/drivers/bus/dpaa/include/of.h:11:0,
                 from /tmp/FC25_K4.8.6_GCC6.3.1/x86_64-native-linuxapp-gcc/74427493f7bc49f9bc980a9c1db12576/dpdk/drivers/crypto/caam_jr/caam_jr.c:25:
/tmp/FC25_K4.8.6_GCC6.3.1/x86_64-native-linuxapp-gcc/74427493f7bc49f9bc980a9c1db12576/dpdk/drivers/bus/dpaa/include/compat.h:80:0: warning: "pr_err" redefined
 #define pr_err(fmt, args...)  prflush("ERR:" fmt, ##args)
 
In file included from /tmp/FC25_K4.8.6_GCC6.3.1/x86_64-native-linuxapp-gcc/74427493f7bc49f9bc980a9c1db12576/dpdk/drivers/crypto/dpaa2_sec/hw/desc.h:18:0,
                 from /tmp/FC25_K4.8.6_GCC6.3.1/x86_64-native-linuxapp-gcc/74427493f7bc49f9bc980a9c1db12576/dpdk/drivers/crypto/dpaa2_sec/hw/rta/sec_run_time_asm.h:11,
                 from /tmp/FC25_K4.8.6_GCC6.3.1/x86_64-native-linuxapp-gcc/74427493f7bc49f9bc980a9c1db12576/dpdk/drivers/crypto/dpaa2_sec/hw/rta.h:11,
--
/tmp/FC25_K4.8.6_GCC6.3.1/x86_64-native-linuxapp-gcc/74427493f7bc49f9bc980a9c1db12576/dpdk/drivers/crypto/dpaa2_sec/hw/compat.h:54:0: note: this is the location of the previous definition
 #define pr_err(fmt, ...) \
 
In file included from /tmp/FC25_K4.8.6_GCC6.3.1/x86_64-native-linuxapp-gcc/74427493f7bc49f9bc980a9c1db12576/dpdk/drivers/bus/dpaa/include/of.h:11:0,
                 from /tmp/FC25_K4.8.6_GCC6.3.1/x86_64-native-linuxapp-gcc/74427493f7bc49f9bc980a9c1db12576/dpdk/drivers/crypto/caam_jr/caam_jr.c:25:
/tmp/FC25_K4.8.6_GCC6.3.1/x86_64-native-linuxapp-gcc/74427493f7bc49f9bc980a9c1db12576/dpdk/drivers/bus/dpaa/include/compat.h:81:0: warning: "pr_warn" redefined
 #define pr_warn(fmt, args...)  prflush("WARN:" fmt, ##args)
 
In file included from /tmp/FC25_K4.8.6_GCC6.3.1/x86_64-native-linuxapp-gcc/74427493f7bc49f9bc980a9c1db12576/dpdk/drivers/crypto/dpaa2_sec/hw/desc.h:18:0,
                 from /tmp/FC25_K4.8.6_GCC6.3.1/x86_64-native-linuxapp-gcc/74427493f7bc49f9bc980a9c1db12576/dpdk/drivers/crypto/dpaa2_sec/hw/rta/sec_run_time_asm.h:11,
                 from /tmp/FC25_K4.8.6_GCC6.3.1/x86_64-native-linuxapp-gcc/74427493f7bc49f9bc980a9c1db12576/dpdk/drivers/crypto/dpaa2_sec/hw/rta.h:11,
--
/tmp/FC25_K4.8.6_GCC6.3.1/x86_64-native-linuxapp-gcc/74427493f7bc49f9bc980a9c1db12576/dpdk/drivers/crypto/dpaa2_sec/hw/compat.h:63:0: note: this is the location of the previous definition
 #define pr_warn(fmt, ...) \
 
In file included from /tmp/FC25_K4.8.6_GCC6.3.1/x86_64-native-linuxapp-gcc/74427493f7bc49f9bc980a9c1db12576/dpdk/drivers/bus/dpaa/include/of.h:11:0,
                 from /tmp/FC25_K4.8.6_GCC6.3.1/x86_64-native-linuxapp-gcc/74427493f7bc49f9bc980a9c1db12576/dpdk/drivers/crypto/caam_jr/caam_jr.c:25:
/tmp/FC25_K4.8.6_GCC6.3.1/x86_64-native-linuxapp-gcc/74427493f7bc49f9bc980a9c1db12576/dpdk/drivers/bus/dpaa/include/compat.h:90:0: warning: "pr_debug" redefined
 #define pr_debug(fmt, args...) {}
 
In file included from /tmp/FC25_K4.8.6_GCC6.3.1/x86_64-native-linuxapp-gcc/74427493f7bc49f9bc980a9c1db12576/dpdk/drivers/crypto/dpaa2_sec/hw/desc.h:18:0,
                 from /tmp/FC25_K4.8.6_GCC6.3.1/x86_64-native-linuxapp-gcc/74427493f7bc49f9bc980a9c1db12576/dpdk/drivers/crypto/dpaa2_sec/hw/rta/sec_run_time_asm.h:11,
                 from /tmp/FC25_K4.8.6_GCC6.3.1/x86_64-native-linuxapp-gcc/74427493f7bc49f9bc980a9c1db12576/dpdk/drivers/crypto/dpaa2_sec/hw/rta.h:11,
--
/tmp/FC25_K4.8.6_GCC6.3.1/x86_64-native-linuxapp-gcc/74427493f7bc49f9bc980a9c1db12576/dpdk/drivers/crypto/dpaa2_sec/hw/compat.h:48:0: note: this is the location of the previous definition
 #define pr_debug(fmt, ...)     do { } while (0)
 
In file included from /tmp/FC25_K4.8.6_GCC6.3.1/x86_64-native-linuxapp-gcc/74427493f7bc49f9bc980a9c1db12576/dpdk/drivers/bus/dpaa/include/of.h:11:0,
                 from /tmp/FC25_K4.8.6_GCC6.3.1/x86_64-native-linuxapp-gcc/74427493f7bc49f9bc980a9c1db12576/dpdk/drivers/crypto/caam_jr/caam_jr.c:25:
/tmp/FC25_K4.8.6_GCC6.3.1/x86_64-native-linuxapp-gcc/74427493f7bc49f9bc980a9c1db12576/dpdk/drivers/bus/dpaa/include/compat.h:259:0: warning: "cpu_to_be32" redefined
 #define cpu_to_be32(x) rte_cpu_to_be_32(x)
 
In file included from /tmp/FC25_K4.8.6_GCC6.3.1/x86_64-native-linuxapp-gcc/74427493f7bc49f9bc980a9c1db12576/dpdk/drivers/crypto/dpaa2_sec/hw/desc.h:18:0,
                 from /tmp/FC25_K4.8.6_GCC6.3.1/x86_64-native-linuxapp-gcc/74427493f7bc49f9bc980a9c1db12576/dpdk/drivers/crypto/dpaa2_sec/hw/rta/sec_run_time_asm.h:11,
                 from /tmp/FC25_K4.8.6_GCC6.3.1/x86_64-native-linuxapp-gcc/74427493f7bc49f9bc980a9c1db12576/dpdk/drivers/crypto/dpaa2_sec/hw/rta.h:11,
--
                 from /tmp/FC25_K4.8.6_GCC6.3.1/x86_64-native-linuxapp-gcc/74427493f7bc49f9bc980a9c1db12576/dpdk/drivers/crypto/caam_jr/caam_jr.c:22:
/tmp/FC25_K4.8.6_GCC6.3.1/x86_64-native-linuxapp-gcc/74427493f7bc49f9bc980a9c1db12576/dpdk/drivers/crypto/dpaa2_sec/hw/compat.h:113:0: note: this is the location of the previous definition
    #define cpu_to_be32(x) swab32(x)
 
/tmp/FC25_K4.8.6_GCC6.3.1/x86_64-native-linuxapp-gcc/74427493f7bc49f9bc980a9c1db12576/dpdk/drivers/crypto/caam_jr/caam_jr.c: In function ‘caam_jr_prep_cdb’:
/tmp/FC25_K4.8.6_GCC6.3.1/x86_64-native-linuxapp-gcc/74427493f7bc49f9bc980a9c1db12576/dpdk/drivers/crypto/caam_jr/caam_jr.c:431:19: warning: passing argument 4 of ‘cnstr_shdsc_ipsec_new_encap’ makes pointer from integer without a cast [-Wint-conversion]
       true, swap, SHR_SERIAL,
                   ^~~~~~~~~~
In file included from /tmp/FC25_K4.8.6_GCC6.3.1/x86_64-native-linuxapp-gcc/74427493f7bc49f9bc980a9c1db12576/dpdk/drivers/crypto/caam_jr/caam_jr.c:24:0:
/tmp/FC25_K4.8.6_GCC6.3.1/x86_64-native-linuxapp-gcc/74427493f7bc49f9bc980a9c1db12576/dpdk/drivers/crypto/dpaa2_sec/hw/desc/ipsec.h:1086:1: note: expected ‘struct ipsec_encap_pdb *’ but argument is of type ‘int’
 cnstr_shdsc_ipsec_new_encap(uint32_t *descbuf, bool ps,
 ^~~~~~~~~~~~~~~~~~~~~~~~~~~
/tmp/FC25_K4.8.6_GCC6.3.1/x86_64-native-linuxapp-gcc/74427493f7bc49f9bc980a9c1db12576/dpdk/drivers/crypto/caam_jr/caam_jr.c:432:7: warning: passing argument 5 of ‘cnstr_shdsc_ipsec_new_encap’ from incompatible pointer type [-Wincompatible-pointer-types]
       &ses->encap_pdb,
       ^
In file included from /tmp/FC25_K4.8.6_GCC6.3.1/x86_64-native-linuxapp-gcc/74427493f7bc49f9bc980a9c1db12576/dpdk/drivers/crypto/caam_jr/caam_jr.c:24:0:
/tmp/FC25_K4.8.6_GCC6.3.1/x86_64-native-linuxapp-gcc/74427493f7bc49f9bc980a9c1db12576/dpdk/drivers/crypto/dpaa2_sec/hw/desc/ipsec.h:1086:1: note: expected ‘uint8_t * {aka unsigned char *}’ but argument is of type ‘struct ipsec_encap_pdb *’
 cnstr_shdsc_ipsec_new_encap(uint32_t *descbuf, bool ps,
 ^~~~~~~~~~~~~~~~~~~~~~~~~~~
/tmp/FC25_K4.8.6_GCC6.3.1/x86_64-native-linuxapp-gcc/74427493f7bc49f9bc980a9c1db12576/dpdk/drivers/crypto/caam_jr/caam_jr.c:433:7: warning: passing argument 6 of ‘cnstr_shdsc_ipsec_new_encap’ from incompatible pointer type [-Wincompatible-pointer-types]
       (uint8_t *)&ses->ip4_hdr,
       ^
In file included from /tmp/FC25_K4.8.6_GCC6.3.1/x86_64-native-linuxapp-gcc/74427493f7bc49f9bc980a9c1db12576/dpdk/drivers/crypto/caam_jr/caam_jr.c:24:0:
/tmp/FC25_K4.8.6_GCC6.3.1/x86_64-native-linuxapp-gcc/74427493f7bc49f9bc980a9c1db12576/dpdk/drivers/crypto/dpaa2_sec/hw/desc/ipsec.h:1086:1: note: expected ‘struct alginfo *’ but argument is of type ‘uint8_t * {aka unsigned char *}’
 cnstr_shdsc_ipsec_new_encap(uint32_t *descbuf, bool ps,
 ^~~~~~~~~~~~~~~~~~~~~~~~~~~
/tmp/FC25_K4.8.6_GCC6.3.1/x86_64-native-linuxapp-gcc/74427493f7bc49f9bc980a9c1db12576/dpdk/drivers/crypto/caam_jr/caam_jr.c:429:23: error: too many arguments to function ‘cnstr_shdsc_ipsec_new_encap’
     shared_desc_len = cnstr_shdsc_ipsec_new_encap(
                       ^~~~~~~~~~~~~~~~~~~~~~~~~~~
In file included from /tmp/FC25_K4.8.6_GCC6.3.1/x86_64-native-linuxapp-gcc/74427493f7bc49f9bc980a9c1db12576/dpdk/drivers/crypto/caam_jr/caam_jr.c:24:0:
/tmp/FC25_K4.8.6_GCC6.3.1/x86_64-native-linuxapp-gcc/74427493f7bc49f9bc980a9c1db12576/dpdk/drivers/crypto/dpaa2_sec/hw/desc/ipsec.h:1086:1: note: declared here
 cnstr_shdsc_ipsec_new_encap(uint32_t *descbuf, bool ps,
 ^~~~~~~~~~~~~~~~~~~~~~~~~~~
/tmp/FC25_K4.8.6_GCC6.3.1/x86_64-native-linuxapp-gcc/74427493f7bc49f9bc980a9c1db12576/dpdk/drivers/crypto/caam_jr/caam_jr.c:438:19: warning: passing argument 4 of ‘cnstr_shdsc_ipsec_new_decap’ makes pointer from integer without a cast [-Wint-conversion]
       true, swap, SHR_SERIAL,
                   ^~~~~~~~~~
In file included from /tmp/FC25_K4.8.6_GCC6.3.1/x86_64-native-linuxapp-gcc/74427493f7bc49f9bc980a9c1db12576/dpdk/drivers/crypto/caam_jr/caam_jr.c:24:0:
/tmp/FC25_K4.8.6_GCC6.3.1/x86_64-native-linuxapp-gcc/74427493f7bc49f9bc980a9c1db12576/dpdk/drivers/crypto/dpaa2_sec/hw/desc/ipsec.h:1189:1: note: expected ‘struct ipsec_decap_pdb *’ but argument is of type ‘int’
 cnstr_shdsc_ipsec_new_decap(uint32_t *descbuf, bool ps,
 ^~~~~~~~~~~~~~~~~~~~~~~~~~~
/tmp/FC25_K4.8.6_GCC6.3.1/x86_64-native-linuxapp-gcc/74427493f7bc49f9bc980a9c1db12576/dpdk/drivers/crypto/caam_jr/caam_jr.c:439:7: warning: passing argument 5 of ‘cnstr_shdsc_ipsec_new_decap’ from incompatible pointer type [-Wincompatible-pointer-types]
       &ses->decap_pdb,
       ^
In file included from /tmp/FC25_K4.8.6_GCC6.3.1/x86_64-native-linuxapp-gcc/74427493f7bc49f9bc980a9c1db12576/dpdk/drivers/crypto/caam_jr/caam_jr.c:24:0:
/tmp/FC25_K4.8.6_GCC6.3.1/x86_64-native-linuxapp-gcc/74427493f7bc49f9bc980a9c1db12576/dpdk/drivers/crypto/dpaa2_sec/hw/desc/ipsec.h:1189:1: note: expected ‘struct alginfo *’ but argument is of type ‘struct ipsec_decap_pdb *’
 cnstr_shdsc_ipsec_new_decap(uint32_t *descbuf, bool ps,
 ^~~~~~~~~~~~~~~~~~~~~~~~~~~
/tmp/FC25_K4.8.6_GCC6.3.1/x86_64-native-linuxapp-gcc/74427493f7bc49f9bc980a9c1db12576/dpdk/drivers/crypto/caam_jr/caam_jr.c:436:23: error: too many arguments to function ‘cnstr_shdsc_ipsec_new_decap’
     shared_desc_len = cnstr_shdsc_ipsec_new_decap(
                       ^~~~~~~~~~~~~~~~~~~~~~~~~~~
In file included from /tmp/FC25_K4.8.6_GCC6.3.1/x86_64-native-linuxapp-gcc/74427493f7bc49f9bc980a9c1db12576/dpdk/drivers/crypto/caam_jr/caam_jr.c:24:0:
/tmp/FC25_K4.8.6_GCC6.3.1/x86_64-native-linuxapp-gcc/74427493f7bc49f9bc980a9c1db12576/dpdk/drivers/crypto/dpaa2_sec/hw/desc/ipsec.h:1189:1: note: declared here
 cnstr_shdsc_ipsec_new_decap(uint32_t *descbuf, bool ps,
 ^~~~~~~~~~~~~~~~~~~~~~~~~~~
/tmp/FC25_K4.8.6_GCC6.3.1/x86_64-native-linuxapp-gcc/74427493f7bc49f9bc980a9c1db12576/dpdk/mk/internal/rte.compile-pre.mk:114: recipe for target 'caam_jr.o' failed
make[6]: *** [caam_jr.o] Error 1
/tmp/FC25_K4.8.6_GCC6.3.1/x86_64-native-linuxapp-gcc/74427493f7bc49f9bc980a9c1db12576/dpdk/mk/rte.subdir.mk:35: recipe for target 'caam_jr' failed
make[5]: *** [caam_jr] Error 2
/tmp/FC25_K4.8.6_GCC6.3.1/x86_64-native-linuxapp-gcc/74427493f7bc49f9bc980a9c1db12576/dpdk/mk/rte.subdir.mk:35: recipe for target 'crypto' failed
make[4]: *** [crypto] Error 2
make[4]: *** Waiting for unfinished jobs....
  CC ark_ethdev_tx.o
  CC ark_mpu.o
  CC ark_pktchkr.o
--
  CC rte_eth_softnic_cli.o
  CC parser.o
  CC conn.o
  AR librte_pmd_softnic.a
  INSTALL-LIB librte_pmd_softnic.a
/tmp/FC25_K4.8.6_GCC6.3.1/x86_64-native-linuxapp-gcc/74427493f7bc49f9bc980a9c1db12576/dpdk/mk/rte.sdkbuild.mk:49: recipe for target 'drivers' failed
make[3]: *** [drivers] Error 2
/tmp/FC25_K4.8.6_GCC6.3.1/x86_64-native-linuxapp-gcc/74427493f7bc49f9bc980a9c1db12576/dpdk/mk/rte.sdkroot.mk:100: recipe for target 'all' failed
make[2]: *** [all] Error 2
/tmp/FC25_K4.8.6_GCC6.3.1/x86_64-native-linuxapp-gcc/74427493f7bc49f9bc980a9c1db12576/dpdk/mk/rte.sdkinstall.mk:57: recipe for target 'pre_install' failed
make[1]: *** [pre_install] Error 2
/tmp/FC25_K4.8.6_GCC6.3.1/x86_64-native-linuxapp-gcc/74427493f7bc49f9bc980a9c1db12576/dpdk/mk/rte.sdkroot.mk:79: recipe for target 'install' failed
make: *** [install] Error 2

*Failed Build #2:
OS: UB1604
Target: x86_64-native-linuxapp-gcc
  CC caam_jr.o
  LD ark_ethdev.o
  CC ark_ethdev_rx.o
In file included from /tmp/UB1604_K4.8.0_GCC6.2.0/x86_64-native-linuxapp-gcc/74427493f7bc49f9bc980a9c1db12576/dpdk/drivers/bus/dpaa/include/of.h:11:0,
                 from /tmp/UB1604_K4.8.0_GCC6.2.0/x86_64-native-linuxapp-gcc/74427493f7bc49f9bc980a9c1db12576/dpdk/drivers/crypto/caam_jr/caam_jr.c:25:
/tmp/UB1604_K4.8.0_GCC6.2.0/x86_64-native-linuxapp-gcc/74427493f7bc49f9bc980a9c1db12576/dpdk/drivers/bus/dpaa/include/compat.h:80:0: warning: "pr_err" redefined
 #define pr_err(fmt, args...)  prflush("ERR:" fmt, ##args)
 
In file included from /tmp/UB1604_K4.8.0_GCC6.2.0/x86_64-native-linuxapp-gcc/74427493f7bc49f9bc980a9c1db12576/dpdk/drivers/crypto/dpaa2_sec/hw/desc.h:18:0,
                 from /tmp/UB1604_K4.8.0_GCC6.2.0/x86_64-native-linuxapp-gcc/74427493f7bc49f9bc980a9c1db12576/dpdk/drivers/crypto/dpaa2_sec/hw/rta/sec_run_time_asm.h:11,
                 from /tmp/UB1604_K4.8.0_GCC6.2.0/x86_64-native-linuxapp-gcc/74427493f7bc49f9bc980a9c1db12576/dpdk/drivers/crypto/dpaa2_sec/hw/rta.h:11,
--
/tmp/UB1604_K4.8.0_GCC6.2.0/x86_64-native-linuxapp-gcc/74427493f7bc49f9bc980a9c1db12576/dpdk/drivers/crypto/dpaa2_sec/hw/compat.h:54:0: note: this is the location of the previous definition
 #define pr_err(fmt, ...) \
 
In file included from /tmp/UB1604_K4.8.0_GCC6.2.0/x86_64-native-linuxapp-gcc/74427493f7bc49f9bc980a9c1db12576/dpdk/drivers/bus/dpaa/include/of.h:11:0,
                 from /tmp/UB1604_K4.8.0_GCC6.2.0/x86_64-native-linuxapp-gcc/74427493f7bc49f9bc980a9c1db12576/dpdk/drivers/crypto/caam_jr/caam_jr.c:25:
/tmp/UB1604_K4.8.0_GCC6.2.0/x86_64-native-linuxapp-gcc/74427493f7bc49f9bc980a9c1db12576/dpdk/drivers/bus/dpaa/include/compat.h:81:0: warning: "pr_warn" redefined
 #define pr_warn(fmt, args...)  prflush("WARN:" fmt, ##args)
 
In file included from /tmp/UB1604_K4.8.0_GCC6.2.0/x86_64-native-linuxapp-gcc/74427493f7bc49f9bc980a9c1db12576/dpdk/drivers/crypto/dpaa2_sec/hw/desc.h:18:0,
                 from /tmp/UB1604_K4.8.0_GCC6.2.0/x86_64-native-linuxapp-gcc/74427493f7bc49f9bc980a9c1db12576/dpdk/drivers/crypto/dpaa2_sec/hw/rta/sec_run_time_asm.h:11,
                 from /tmp/UB1604_K4.8.0_GCC6.2.0/x86_64-native-linuxapp-gcc/74427493f7bc49f9bc980a9c1db12576/dpdk/drivers/crypto/dpaa2_sec/hw/rta.h:11,
--
/tmp/UB1604_K4.8.0_GCC6.2.0/x86_64-native-linuxapp-gcc/74427493f7bc49f9bc980a9c1db12576/dpdk/drivers/crypto/dpaa2_sec/hw/compat.h:63:0: note: this is the location of the previous definition
 #define pr_warn(fmt, ...) \
 
In file included from /tmp/UB1604_K4.8.0_GCC6.2.0/x86_64-native-linuxapp-gcc/74427493f7bc49f9bc980a9c1db12576/dpdk/drivers/bus/dpaa/include/of.h:11:0,
                 from /tmp/UB1604_K4.8.0_GCC6.2.0/x86_64-native-linuxapp-gcc/74427493f7bc49f9bc980a9c1db12576/dpdk/drivers/crypto/caam_jr/caam_jr.c:25:
/tmp/UB1604_K4.8.0_GCC6.2.0/x86_64-native-linuxapp-gcc/74427493f7bc49f9bc980a9c1db12576/dpdk/drivers/bus/dpaa/include/compat.h:90:0: warning: "pr_debug" redefined
 #define pr_debug(fmt, args...) {}
 
In file included from /tmp/UB1604_K4.8.0_GCC6.2.0/x86_64-native-linuxapp-gcc/74427493f7bc49f9bc980a9c1db12576/dpdk/drivers/crypto/dpaa2_sec/hw/desc.h:18:0,
                 from /tmp/UB1604_K4.8.0_GCC6.2.0/x86_64-native-linuxapp-gcc/74427493f7bc49f9bc980a9c1db12576/dpdk/drivers/crypto/dpaa2_sec/hw/rta/sec_run_time_asm.h:11,
                 from /tmp/UB1604_K4.8.0_GCC6.2.0/x86_64-native-linuxapp-gcc/74427493f7bc49f9bc980a9c1db12576/dpdk/drivers/crypto/dpaa2_sec/hw/rta.h:11,
--
/tmp/UB1604_K4.8.0_GCC6.2.0/x86_64-native-linuxapp-gcc/74427493f7bc49f9bc980a9c1db12576/dpdk/drivers/crypto/dpaa2_sec/hw/compat.h:48:0: note: this is the location of the previous definition
 #define pr_debug(fmt, ...)     do { } while (0)
 
In file included from /tmp/UB1604_K4.8.0_GCC6.2.0/x86_64-native-linuxapp-gcc/74427493f7bc49f9bc980a9c1db12576/dpdk/drivers/bus/dpaa/include/of.h:11:0,
                 from /tmp/UB1604_K4.8.0_GCC6.2.0/x86_64-native-linuxapp-gcc/74427493f7bc49f9bc980a9c1db12576/dpdk/drivers/crypto/caam_jr/caam_jr.c:25:
/tmp/UB1604_K4.8.0_GCC6.2.0/x86_64-native-linuxapp-gcc/74427493f7bc49f9bc980a9c1db12576/dpdk/drivers/bus/dpaa/include/compat.h:259:0: warning: "cpu_to_be32" redefined
 #define cpu_to_be32(x) rte_cpu_to_be_32(x)
 
In file included from /tmp/UB1604_K4.8.0_GCC6.2.0/x86_64-native-linuxapp-gcc/74427493f7bc49f9bc980a9c1db12576/dpdk/drivers/crypto/dpaa2_sec/hw/desc.h:18:0,
                 from /tmp/UB1604_K4.8.0_GCC6.2.0/x86_64-native-linuxapp-gcc/74427493f7bc49f9bc980a9c1db12576/dpdk/drivers/crypto/dpaa2_sec/hw/rta/sec_run_time_asm.h:11,
                 from /tmp/UB1604_K4.8.0_GCC6.2.0/x86_64-native-linuxapp-gcc/74427493f7bc49f9bc980a9c1db12576/dpdk/drivers/crypto/dpaa2_sec/hw/rta.h:11,
--
                 from /tmp/UB1604_K4.8.0_GCC6.2.0/x86_64-native-linuxapp-gcc/74427493f7bc49f9bc980a9c1db12576/dpdk/drivers/crypto/caam_jr/caam_jr.c:22:
/tmp/UB1604_K4.8.0_GCC6.2.0/x86_64-native-linuxapp-gcc/74427493f7bc49f9bc980a9c1db12576/dpdk/drivers/crypto/dpaa2_sec/hw/compat.h:113:0: note: this is the location of the previous definition
    #define cpu_to_be32(x) swab32(x)
 
/tmp/UB1604_K4.8.0_GCC6.2.0/x86_64-native-linuxapp-gcc/74427493f7bc49f9bc980a9c1db12576/dpdk/drivers/crypto/caam_jr/caam_jr.c: In function ‘caam_jr_prep_cdb’:
/tmp/UB1604_K4.8.0_GCC6.2.0/x86_64-native-linuxapp-gcc/74427493f7bc49f9bc980a9c1db12576/dpdk/drivers/crypto/caam_jr/caam_jr.c:431:19: warning: passing argument 4 of ‘cnstr_shdsc_ipsec_new_encap’ makes pointer from integer without a cast [-Wint-conversion]
       true, swap, SHR_SERIAL,
                   ^~~~~~~~~~
In file included from /tmp/UB1604_K4.8.0_GCC6.2.0/x86_64-native-linuxapp-gcc/74427493f7bc49f9bc980a9c1db12576/dpdk/drivers/crypto/caam_jr/caam_jr.c:24:0:
/tmp/UB1604_K4.8.0_GCC6.2.0/x86_64-native-linuxapp-gcc/74427493f7bc49f9bc980a9c1db12576/dpdk/drivers/crypto/dpaa2_sec/hw/desc/ipsec.h:1086:1: note: expected ‘struct ipsec_encap_pdb *’ but argument is of type ‘int’
 cnstr_shdsc_ipsec_new_encap(uint32_t *descbuf, bool ps,
 ^~~~~~~~~~~~~~~~~~~~~~~~~~~
/tmp/UB1604_K4.8.0_GCC6.2.0/x86_64-native-linuxapp-gcc/74427493f7bc49f9bc980a9c1db12576/dpdk/drivers/crypto/caam_jr/caam_jr.c:432:7: warning: passing argument 5 of ‘cnstr_shdsc_ipsec_new_encap’ from incompatible pointer type [-Wincompatible-pointer-types]
       &ses->encap_pdb,
       ^
In file included from /tmp/UB1604_K4.8.0_GCC6.2.0/x86_64-native-linuxapp-gcc/74427493f7bc49f9bc980a9c1db12576/dpdk/drivers/crypto/caam_jr/caam_jr.c:24:0:
/tmp/UB1604_K4.8.0_GCC6.2.0/x86_64-native-linuxapp-gcc/74427493f7bc49f9bc980a9c1db12576/dpdk/drivers/crypto/dpaa2_sec/hw/desc/ipsec.h:1086:1: note: expected ‘uint8_t * {aka unsigned char *}’ but argument is of type ‘struct ipsec_encap_pdb *’
 cnstr_shdsc_ipsec_new_encap(uint32_t *descbuf, bool ps,
 ^~~~~~~~~~~~~~~~~~~~~~~~~~~
/tmp/UB1604_K4.8.0_GCC6.2.0/x86_64-native-linuxapp-gcc/74427493f7bc49f9bc980a9c1db12576/dpdk/drivers/crypto/caam_jr/caam_jr.c:433:7: warning: passing argument 6 of ‘cnstr_shdsc_ipsec_new_encap’ from incompatible pointer type [-Wincompatible-pointer-types]
       (uint8_t *)&ses->ip4_hdr,
       ^
In file included from /tmp/UB1604_K4.8.0_GCC6.2.0/x86_64-native-linuxapp-gcc/74427493f7bc49f9bc980a9c1db12576/dpdk/drivers/crypto/caam_jr/caam_jr.c:24:0:
/tmp/UB1604_K4.8.0_GCC6.2.0/x86_64-native-linuxapp-gcc/74427493f7bc49f9bc980a9c1db12576/dpdk/drivers/crypto/dpaa2_sec/hw/desc/ipsec.h:1086:1: note: expected ‘struct alginfo *’ but argument is of type ‘uint8_t * {aka unsigned char *}’
 cnstr_shdsc_ipsec_new_encap(uint32_t *descbuf, bool ps,
 ^~~~~~~~~~~~~~~~~~~~~~~~~~~
/tmp/UB1604_K4.8.0_GCC6.2.0/x86_64-native-linuxapp-gcc/74427493f7bc49f9bc980a9c1db12576/dpdk/drivers/crypto/caam_jr/caam_jr.c:429:23: error: too many arguments to function ‘cnstr_shdsc_ipsec_new_encap’
     shared_desc_len = cnstr_shdsc_ipsec_new_encap(
                       ^~~~~~~~~~~~~~~~~~~~~~~~~~~
In file included from /tmp/UB1604_K4.8.0_GCC6.2.0/x86_64-native-linuxapp-gcc/74427493f7bc49f9bc980a9c1db12576/dpdk/drivers/crypto/caam_jr/caam_jr.c:24:0:
/tmp/UB1604_K4.8.0_GCC6.2.0/x86_64-native-linuxapp-gcc/74427493f7bc49f9bc980a9c1db12576/dpdk/drivers/crypto/dpaa2_sec/hw/desc/ipsec.h:1086:1: note: declared here
 cnstr_shdsc_ipsec_new_encap(uint32_t *descbuf, bool ps,
 ^~~~~~~~~~~~~~~~~~~~~~~~~~~
/tmp/UB1604_K4.8.0_GCC6.2.0/x86_64-native-linuxapp-gcc/74427493f7bc49f9bc980a9c1db12576/dpdk/drivers/crypto/caam_jr/caam_jr.c:438:19: warning: passing argument 4 of ‘cnstr_shdsc_ipsec_new_decap’ makes pointer from integer without a cast [-Wint-conversion]
       true, swap, SHR_SERIAL,
                   ^~~~~~~~~~
In file included from /tmp/UB1604_K4.8.0_GCC6.2.0/x86_64-native-linuxapp-gcc/74427493f7bc49f9bc980a9c1db12576/dpdk/drivers/crypto/caam_jr/caam_jr.c:24:0:
/tmp/UB1604_K4.8.0_GCC6.2.0/x86_64-native-linuxapp-gcc/74427493f7bc49f9bc980a9c1db12576/dpdk/drivers/crypto/dpaa2_sec/hw/desc/ipsec.h:1189:1: note: expected ‘struct ipsec_decap_pdb *’ but argument is of type ‘int’
 cnstr_shdsc_ipsec_new_decap(uint32_t *descbuf, bool ps,
 ^~~~~~~~~~~~~~~~~~~~~~~~~~~
/tmp/UB1604_K4.8.0_GCC6.2.0/x86_64-native-linuxapp-gcc/74427493f7bc49f9bc980a9c1db12576/dpdk/drivers/crypto/caam_jr/caam_jr.c:439:7: warning: passing argument 5 of ‘cnstr_shdsc_ipsec_new_decap’ from incompatible pointer type [-Wincompatible-pointer-types]
       &ses->decap_pdb,
       ^
In file included from /tmp/UB1604_K4.8.0_GCC6.2.0/x86_64-native-linuxapp-gcc/74427493f7bc49f9bc980a9c1db12576/dpdk/drivers/crypto/caam_jr/caam_jr.c:24:0:
/tmp/UB1604_K4.8.0_GCC6.2.0/x86_64-native-linuxapp-gcc/74427493f7bc49f9bc980a9c1db12576/dpdk/drivers/crypto/dpaa2_sec/hw/desc/ipsec.h:1189:1: note: expected ‘struct alginfo *’ but argument is of type ‘struct ipsec_decap_pdb *’
 cnstr_shdsc_ipsec_new_decap(uint32_t *descbuf, bool ps,
 ^~~~~~~~~~~~~~~~~~~~~~~~~~~
/tmp/UB1604_K4.8.0_GCC6.2.0/x86_64-native-linuxapp-gcc/74427493f7bc49f9bc980a9c1db12576/dpdk/drivers/crypto/caam_jr/caam_jr.c:436:23: error: too many arguments to function ‘cnstr_shdsc_ipsec_new_decap’
     shared_desc_len = cnstr_shdsc_ipsec_new_decap(
                       ^~~~~~~~~~~~~~~~~~~~~~~~~~~
In file included from /tmp/UB1604_K4.8.0_GCC6.2.0/x86_64-native-linuxapp-gcc/74427493f7bc49f9bc980a9c1db12576/dpdk/drivers/crypto/caam_jr/caam_jr.c:24:0:
/tmp/UB1604_K4.8.0_GCC6.2.0/x86_64-native-linuxapp-gcc/74427493f7bc49f9bc980a9c1db12576/dpdk/drivers/crypto/dpaa2_sec/hw/desc/ipsec.h:1189:1: note: declared here
 cnstr_shdsc_ipsec_new_decap(uint32_t *descbuf, bool ps,
 ^~~~~~~~~~~~~~~~~~~~~~~~~~~
/tmp/UB1604_K4.8.0_GCC6.2.0/x86_64-native-linuxapp-gcc/74427493f7bc49f9bc980a9c1db12576/dpdk/mk/internal/rte.compile-pre.mk:114: recipe for target 'caam_jr.o' failed
make[6]: *** [caam_jr.o] Error 1
/tmp/UB1604_K4.8.0_GCC6.2.0/x86_64-native-linuxapp-gcc/74427493f7bc49f9bc980a9c1db12576/dpdk/mk/rte.subdir.mk:35: recipe for target 'caam_jr' failed
make[5]: *** [caam_jr] Error 2
/tmp/UB1604_K4.8.0_GCC6.2.0/x86_64-native-linuxapp-gcc/74427493f7bc49f9bc980a9c1db12576/dpdk/mk/rte.subdir.mk:35: recipe for target 'crypto' failed
make[4]: *** [crypto] Error 2
make[4]: *** Waiting for unfinished jobs....
  CC ark_ethdev_tx.o
  CC ark_mpu.o
  CC ark_pktchkr.o
--
  PMDINFO ifcvf_vdpa.o.pmd.c
  CC ifcvf_vdpa.o.pmd.o
  LD ifcvf_vdpa.o
  AR librte_pmd_ifc.a
  INSTALL-LIB librte_pmd_ifc.a
/tmp/UB1604_K4.8.0_GCC6.2.0/x86_64-native-linuxapp-gcc/74427493f7bc49f9bc980a9c1db12576/dpdk/mk/rte.sdkbuild.mk:49: recipe for target 'drivers' failed
make[3]: *** [drivers] Error 2
/tmp/UB1604_K4.8.0_GCC6.2.0/x86_64-native-linuxapp-gcc/74427493f7bc49f9bc980a9c1db12576/dpdk/mk/rte.sdkroot.mk:100: recipe for target 'all' failed
make[2]: *** [all] Error 2
/tmp/UB1604_K4.8.0_GCC6.2.0/x86_64-native-linuxapp-gcc/74427493f7bc49f9bc980a9c1db12576/dpdk/mk/rte.sdkinstall.mk:57: recipe for target 'pre_install' failed
make[1]: *** [pre_install] Error 2
/tmp/UB1604_K4.8.0_GCC6.2.0/x86_64-native-linuxapp-gcc/74427493f7bc49f9bc980a9c1db12576/dpdk/mk/rte.sdkroot.mk:79: recipe for target 'install' failed
make: *** [install] Error 2

*Failed Build #3:
OS: UB1604
Target: x86_64-native-linuxapp-clang
  CC ark_ethdev_rx.o
  CC caam_jr.o
  CC ark_ethdev_tx.o
In file included from /tmp/UB1604_K4.4.0_GCC5.4.0/x86_64-native-linuxapp-clang/74427493f7bc49f9bc980a9c1db12576/dpdk/drivers/crypto/caam_jr/caam_jr.c:25:
In file included from /tmp/UB1604_K4.4.0_GCC5.4.0/x86_64-native-linuxapp-clang/74427493f7bc49f9bc980a9c1db12576/dpdk/drivers/bus/dpaa/include/of.h:11:
/tmp/UB1604_K4.4.0_GCC5.4.0/x86_64-native-linuxapp-clang/74427493f7bc49f9bc980a9c1db12576/dpdk/drivers/bus/dpaa/include/compat.h:80:9: warning: 'pr_err' macro redefined [-Wmacro-redefined]
#define pr_err(fmt, args...)     prflush("ERR:" fmt, ##args)
        ^
/tmp/UB1604_K4.4.0_GCC5.4.0/x86_64-native-linuxapp-clang/74427493f7bc49f9bc980a9c1db12576/dpdk/drivers/crypto/dpaa2_sec/hw/compat.h:54:9: note: previous definition is here
#define pr_err(fmt, ...) \
        ^
In file included from /tmp/UB1604_K4.4.0_GCC5.4.0/x86_64-native-linuxapp-clang/74427493f7bc49f9bc980a9c1db12576/dpdk/drivers/crypto/caam_jr/caam_jr.c:25:
In file included from /tmp/UB1604_K4.4.0_GCC5.4.0/x86_64-native-linuxapp-clang/74427493f7bc49f9bc980a9c1db12576/dpdk/drivers/bus/dpaa/include/of.h:11:
/tmp/UB1604_K4.4.0_GCC5.4.0/x86_64-native-linuxapp-clang/74427493f7bc49f9bc980a9c1db12576/dpdk/drivers/bus/dpaa/include/compat.h:81:9: warning: 'pr_warn' macro redefined [-Wmacro-redefined]
#define pr_warn(fmt, args...)    prflush("WARN:" fmt, ##args)
        ^
/tmp/UB1604_K4.4.0_GCC5.4.0/x86_64-native-linuxapp-clang/74427493f7bc49f9bc980a9c1db12576/dpdk/drivers/crypto/dpaa2_sec/hw/compat.h:63:9: note: previous definition is here
#define pr_warn(fmt, ...) \
        ^
In file included from /tmp/UB1604_K4.4.0_GCC5.4.0/x86_64-native-linuxapp-clang/74427493f7bc49f9bc980a9c1db12576/dpdk/drivers/crypto/caam_jr/caam_jr.c:25:
In file included from /tmp/UB1604_K4.4.0_GCC5.4.0/x86_64-native-linuxapp-clang/74427493f7bc49f9bc980a9c1db12576/dpdk/drivers/bus/dpaa/include/of.h:11:
/tmp/UB1604_K4.4.0_GCC5.4.0/x86_64-native-linuxapp-clang/74427493f7bc49f9bc980a9c1db12576/dpdk/drivers/bus/dpaa/include/compat.h:90:9: warning: 'pr_debug' macro redefined [-Wmacro-redefined]
#define pr_debug(fmt, args...) {}
        ^
/tmp/UB1604_K4.4.0_GCC5.4.0/x86_64-native-linuxapp-clang/74427493f7bc49f9bc980a9c1db12576/dpdk/drivers/crypto/dpaa2_sec/hw/compat.h:48:9: note: previous definition is here
#define pr_debug(fmt, ...)     do { } while (0)
        ^
In file included from /tmp/UB1604_K4.4.0_GCC5.4.0/x86_64-native-linuxapp-clang/74427493f7bc49f9bc980a9c1db12576/dpdk/drivers/crypto/caam_jr/caam_jr.c:25:
In file included from /tmp/UB1604_K4.4.0_GCC5.4.0/x86_64-native-linuxapp-clang/74427493f7bc49f9bc980a9c1db12576/dpdk/drivers/bus/dpaa/include/of.h:11:
/tmp/UB1604_K4.4.0_GCC5.4.0/x86_64-native-linuxapp-clang/74427493f7bc49f9bc980a9c1db12576/dpdk/drivers/bus/dpaa/include/compat.h:259:9: warning: 'cpu_to_be32' macro redefined [-Wmacro-redefined]
#define cpu_to_be32(x) rte_cpu_to_be_32(x)
        ^
/tmp/UB1604_K4.4.0_GCC5.4.0/x86_64-native-linuxapp-clang/74427493f7bc49f9bc980a9c1db12576/dpdk/drivers/crypto/dpaa2_sec/hw/compat.h:113:12: note: previous definition is here
                        #define cpu_to_be32(x)  swab32(x)
                                ^
/tmp/UB1604_K4.4.0_GCC5.4.0/x86_64-native-linuxapp-clang/74427493f7bc49f9bc980a9c1db12576/dpdk/drivers/crypto/caam_jr/caam_jr.c:434:19: error: too many arguments to function call, expected 7, have 8
                                                &alginfo_c, &alginfo_a);
                                                            ^~~~~~~~~~
/tmp/UB1604_K4.4.0_GCC5.4.0/x86_64-native-linuxapp-clang/74427493f7bc49f9bc980a9c1db12576/dpdk/drivers/crypto/dpaa2_sec/hw/desc/ipsec.h:1085:1: note: 'cnstr_shdsc_ipsec_new_encap' declared here
static inline int
^
/tmp/UB1604_K4.4.0_GCC5.4.0/x86_64-native-linuxapp-clang/74427493f7bc49f9bc980a9c1db12576/dpdk/drivers/crypto/caam_jr/caam_jr.c:440:19: error: too many arguments to function call, expected 6, have 7
                                                &alginfo_c, &alginfo_a);
                                                            ^~~~~~~~~~
/tmp/UB1604_K4.4.0_GCC5.4.0/x86_64-native-linuxapp-clang/74427493f7bc49f9bc980a9c1db12576/dpdk/drivers/crypto/dpaa2_sec/hw/desc/ipsec.h:1188:1: note: 'cnstr_shdsc_ipsec_new_decap' declared here
static inline int
^
4 warnings and 2 errors generated.
/tmp/UB1604_K4.4.0_GCC5.4.0/x86_64-native-linuxapp-clang/74427493f7bc49f9bc980a9c1db12576/dpdk/mk/internal/rte.compile-pre.mk:114: recipe for target 'caam_jr.o' failed
make[6]: *** [caam_jr.o] Error 1
/tmp/UB1604_K4.4.0_GCC5.4.0/x86_64-native-linuxapp-clang/74427493f7bc49f9bc980a9c1db12576/dpdk/mk/rte.subdir.mk:35: recipe for target 'caam_jr' failed
make[5]: *** [caam_jr] Error 2
/tmp/UB1604_K4.4.0_GCC5.4.0/x86_64-native-linuxapp-clang/74427493f7bc49f9bc980a9c1db12576/dpdk/mk/rte.subdir.mk:35: recipe for target 'crypto' failed
make[4]: *** [crypto] Error 2
make[4]: *** Waiting for unfinished jobs....
  CC ark_mpu.o
  CC ark_pktchkr.o
  CC ark_pktdir.o
--
  CC rte_eth_softnic_cli.o
  CC parser.o
  CC conn.o
  AR librte_pmd_softnic.a
  INSTALL-LIB librte_pmd_softnic.a
/tmp/UB1604_K4.4.0_GCC5.4.0/x86_64-native-linuxapp-clang/74427493f7bc49f9bc980a9c1db12576/dpdk/mk/rte.sdkbuild.mk:49: recipe for target 'drivers' failed
make[3]: *** [drivers] Error 2
/tmp/UB1604_K4.4.0_GCC5.4.0/x86_64-native-linuxapp-clang/74427493f7bc49f9bc980a9c1db12576/dpdk/mk/rte.sdkroot.mk:100: recipe for target 'all' failed
make[2]: *** [all] Error 2
/tmp/UB1604_K4.4.0_GCC5.4.0/x86_64-native-linuxapp-clang/74427493f7bc49f9bc980a9c1db12576/dpdk/mk/rte.sdkinstall.mk:57: recipe for target 'pre_install' failed
make[1]: *** [pre_install] Error 2
/tmp/UB1604_K4.4.0_GCC5.4.0/x86_64-native-linuxapp-clang/74427493f7bc49f9bc980a9c1db12576/dpdk/mk/rte.sdkroot.mk:79: recipe for target 'install' failed
make: *** [install] Error 2

*Failed Build #4:
OS: CENTOS
Target: x86_64-native-linuxapp-gcc
  CC ark_ethdev.o.pmd.o
  LD ark_ethdev.o
  CC ark_ethdev_rx.o
In file included from /tmp/CENTOS_K3.10.0_GCC4.8.5/x86_64-native-linuxapp-gcc/74427493f7bc49f9bc980a9c1db12576/dpdk/drivers/bus/dpaa/include/of.h:11:0,
                 from /tmp/CENTOS_K3.10.0_GCC4.8.5/x86_64-native-linuxapp-gcc/74427493f7bc49f9bc980a9c1db12576/dpdk/drivers/crypto/caam_jr/caam_jr.c:25:
/tmp/CENTOS_K3.10.0_GCC4.8.5/x86_64-native-linuxapp-gcc/74427493f7bc49f9bc980a9c1db12576/dpdk/drivers/bus/dpaa/include/compat.h:80:0: warning: "pr_err" redefined [enabled by default]
 #define pr_err(fmt, args...)  prflush("ERR:" fmt, ##args)
 ^
In file included from /tmp/CENTOS_K3.10.0_GCC4.8.5/x86_64-native-linuxapp-gcc/74427493f7bc49f9bc980a9c1db12576/dpdk/drivers/crypto/dpaa2_sec/hw/desc.h:18:0,
                 from /tmp/CENTOS_K3.10.0_GCC4.8.5/x86_64-native-linuxapp-gcc/74427493f7bc49f9bc980a9c1db12576/dpdk/drivers/crypto/dpaa2_sec/hw/rta/sec_run_time_asm.h:11,
                 from /tmp/CENTOS_K3.10.0_GCC4.8.5/x86_64-native-linuxapp-gcc/74427493f7bc49f9bc980a9c1db12576/dpdk/drivers/crypto/dpaa2_sec/hw/rta.h:11,
--
/tmp/CENTOS_K3.10.0_GCC4.8.5/x86_64-native-linuxapp-gcc/74427493f7bc49f9bc980a9c1db12576/dpdk/drivers/crypto/dpaa2_sec/hw/compat.h:54:0: note: this is the location of the previous definition
 #define pr_err(fmt, ...) \
 ^
In file included from /tmp/CENTOS_K3.10.0_GCC4.8.5/x86_64-native-linuxapp-gcc/74427493f7bc49f9bc980a9c1db12576/dpdk/drivers/bus/dpaa/include/of.h:11:0,
                 from /tmp/CENTOS_K3.10.0_GCC4.8.5/x86_64-native-linuxapp-gcc/74427493f7bc49f9bc980a9c1db12576/dpdk/drivers/crypto/caam_jr/caam_jr.c:25:
/tmp/CENTOS_K3.10.0_GCC4.8.5/x86_64-native-linuxapp-gcc/74427493f7bc49f9bc980a9c1db12576/dpdk/drivers/bus/dpaa/include/compat.h:81:0: warning: "pr_warn" redefined [enabled by default]
 #define pr_warn(fmt, args...)  prflush("WARN:" fmt, ##args)
 ^
In file included from /tmp/CENTOS_K3.10.0_GCC4.8.5/x86_64-native-linuxapp-gcc/74427493f7bc49f9bc980a9c1db12576/dpdk/drivers/crypto/dpaa2_sec/hw/desc.h:18:0,
                 from /tmp/CENTOS_K3.10.0_GCC4.8.5/x86_64-native-linuxapp-gcc/74427493f7bc49f9bc980a9c1db12576/dpdk/drivers/crypto/dpaa2_sec/hw/rta/sec_run_time_asm.h:11,
                 from /tmp/CENTOS_K3.10.0_GCC4.8.5/x86_64-native-linuxapp-gcc/74427493f7bc49f9bc980a9c1db12576/dpdk/drivers/crypto/dpaa2_sec/hw/rta.h:11,
--
/tmp/CENTOS_K3.10.0_GCC4.8.5/x86_64-native-linuxapp-gcc/74427493f7bc49f9bc980a9c1db12576/dpdk/drivers/crypto/dpaa2_sec/hw/compat.h:63:0: note: this is the location of the previous definition
 #define pr_warn(fmt, ...) \
 ^
In file included from /tmp/CENTOS_K3.10.0_GCC4.8.5/x86_64-native-linuxapp-gcc/74427493f7bc49f9bc980a9c1db12576/dpdk/drivers/bus/dpaa/include/of.h:11:0,
                 from /tmp/CENTOS_K3.10.0_GCC4.8.5/x86_64-native-linuxapp-gcc/74427493f7bc49f9bc980a9c1db12576/dpdk/drivers/crypto/caam_jr/caam_jr.c:25:
/tmp/CENTOS_K3.10.0_GCC4.8.5/x86_64-native-linuxapp-gcc/74427493f7bc49f9bc980a9c1db12576/dpdk/drivers/bus/dpaa/include/compat.h:90:0: warning: "pr_debug" redefined [enabled by default]
 #define pr_debug(fmt, args...) {}
 ^
In file included from /tmp/CENTOS_K3.10.0_GCC4.8.5/x86_64-native-linuxapp-gcc/74427493f7bc49f9bc980a9c1db12576/dpdk/drivers/crypto/dpaa2_sec/hw/desc.h:18:0,
                 from /tmp/CENTOS_K3.10.0_GCC4.8.5/x86_64-native-linuxapp-gcc/74427493f7bc49f9bc980a9c1db12576/dpdk/drivers/crypto/dpaa2_sec/hw/rta/sec_run_time_asm.h:11,
                 from /tmp/CENTOS_K3.10.0_GCC4.8.5/x86_64-native-linuxapp-gcc/74427493f7bc49f9bc980a9c1db12576/dpdk/drivers/crypto/dpaa2_sec/hw/rta.h:11,
--
/tmp/CENTOS_K3.10.0_GCC4.8.5/x86_64-native-linuxapp-gcc/74427493f7bc49f9bc980a9c1db12576/dpdk/drivers/crypto/dpaa2_sec/hw/compat.h:48:0: note: this is the location of the previous definition
 #define pr_debug(fmt, ...)     do { } while (0)
 ^
In file included from /tmp/CENTOS_K3.10.0_GCC4.8.5/x86_64-native-linuxapp-gcc/74427493f7bc49f9bc980a9c1db12576/dpdk/drivers/bus/dpaa/include/of.h:11:0,
                 from /tmp/CENTOS_K3.10.0_GCC4.8.5/x86_64-native-linuxapp-gcc/74427493f7bc49f9bc980a9c1db12576/dpdk/drivers/crypto/caam_jr/caam_jr.c:25:
/tmp/CENTOS_K3.10.0_GCC4.8.5/x86_64-native-linuxapp-gcc/74427493f7bc49f9bc980a9c1db12576/dpdk/drivers/bus/dpaa/include/compat.h:259:0: warning: "cpu_to_be32" redefined [enabled by default]
 #define cpu_to_be32(x) rte_cpu_to_be_32(x)
 ^
In file included from /tmp/CENTOS_K3.10.0_GCC4.8.5/x86_64-native-linuxapp-gcc/74427493f7bc49f9bc980a9c1db12576/dpdk/drivers/crypto/dpaa2_sec/hw/desc.h:18:0,
                 from /tmp/CENTOS_K3.10.0_GCC4.8.5/x86_64-native-linuxapp-gcc/74427493f7bc49f9bc980a9c1db12576/dpdk/drivers/crypto/dpaa2_sec/hw/rta/sec_run_time_asm.h:11,
                 from /tmp/CENTOS_K3.10.0_GCC4.8.5/x86_64-native-linuxapp-gcc/74427493f7bc49f9bc980a9c1db12576/dpdk/drivers/crypto/dpaa2_sec/hw/rta.h:11,
--
                 from /tmp/CENTOS_K3.10.0_GCC4.8.5/x86_64-native-linuxapp-gcc/74427493f7bc49f9bc980a9c1db12576/dpdk/drivers/crypto/caam_jr/caam_jr.c:22:
/tmp/CENTOS_K3.10.0_GCC4.8.5/x86_64-native-linuxapp-gcc/74427493f7bc49f9bc980a9c1db12576/dpdk/drivers/crypto/dpaa2_sec/hw/compat.h:113:0: note: this is the location of the previous definition
    #define cpu_to_be32(x) swab32(x)
 ^
/tmp/CENTOS_K3.10.0_GCC4.8.5/x86_64-native-linuxapp-gcc/74427493f7bc49f9bc980a9c1db12576/dpdk/drivers/crypto/caam_jr/caam_jr.c: In function ‘caam_jr_prep_cdb’:
/tmp/CENTOS_K3.10.0_GCC4.8.5/x86_64-native-linuxapp-gcc/74427493f7bc49f9bc980a9c1db12576/dpdk/drivers/crypto/caam_jr/caam_jr.c:434:7: warning: passing argument 4 of ‘cnstr_shdsc_ipsec_new_encap’ makes pointer from integer without a cast [enabled by default]
       &alginfo_c, &alginfo_a);
       ^
In file included from /tmp/CENTOS_K3.10.0_GCC4.8.5/x86_64-native-linuxapp-gcc/74427493f7bc49f9bc980a9c1db12576/dpdk/drivers/crypto/caam_jr/caam_jr.c:24:0:
/tmp/CENTOS_K3.10.0_GCC4.8.5/x86_64-native-linuxapp-gcc/74427493f7bc49f9bc980a9c1db12576/dpdk/drivers/crypto/dpaa2_sec/hw/desc/ipsec.h:1086:1: note: expected ‘struct ipsec_encap_pdb *’ but argument is of type ‘int’
 cnstr_shdsc_ipsec_new_encap(uint32_t *descbuf, bool ps,
 ^
/tmp/CENTOS_K3.10.0_GCC4.8.5/x86_64-native-linuxapp-gcc/74427493f7bc49f9bc980a9c1db12576/dpdk/drivers/crypto/caam_jr/caam_jr.c:434:7: warning: passing argument 5 of ‘cnstr_shdsc_ipsec_new_encap’ from incompatible pointer type [enabled by default]
       &alginfo_c, &alginfo_a);
       ^
In file included from /tmp/CENTOS_K3.10.0_GCC4.8.5/x86_64-native-linuxapp-gcc/74427493f7bc49f9bc980a9c1db12576/dpdk/drivers/crypto/caam_jr/caam_jr.c:24:0:
/tmp/CENTOS_K3.10.0_GCC4.8.5/x86_64-native-linuxapp-gcc/74427493f7bc49f9bc980a9c1db12576/dpdk/drivers/crypto/dpaa2_sec/hw/desc/ipsec.h:1086:1: note: expected ‘uint8_t *’ but argument is of type ‘struct ipsec_encap_pdb *’
 cnstr_shdsc_ipsec_new_encap(uint32_t *descbuf, bool ps,
 ^
/tmp/CENTOS_K3.10.0_GCC4.8.5/x86_64-native-linuxapp-gcc/74427493f7bc49f9bc980a9c1db12576/dpdk/drivers/crypto/caam_jr/caam_jr.c:434:7: warning: passing argument 6 of ‘cnstr_shdsc_ipsec_new_encap’ from incompatible pointer type [enabled by default]
       &alginfo_c, &alginfo_a);
       ^
In file included from /tmp/CENTOS_K3.10.0_GCC4.8.5/x86_64-native-linuxapp-gcc/74427493f7bc49f9bc980a9c1db12576/dpdk/drivers/crypto/caam_jr/caam_jr.c:24:0:
/tmp/CENTOS_K3.10.0_GCC4.8.5/x86_64-native-linuxapp-gcc/74427493f7bc49f9bc980a9c1db12576/dpdk/drivers/crypto/dpaa2_sec/hw/desc/ipsec.h:1086:1: note: expected ‘struct alginfo *’ but argument is of type ‘uint8_t *’
 cnstr_shdsc_ipsec_new_encap(uint32_t *descbuf, bool ps,
 ^
/tmp/CENTOS_K3.10.0_GCC4.8.5/x86_64-native-linuxapp-gcc/74427493f7bc49f9bc980a9c1db12576/dpdk/drivers/crypto/caam_jr/caam_jr.c:434:7: error: too many arguments to function ‘cnstr_shdsc_ipsec_new_encap’
       &alginfo_c, &alginfo_a);
       ^
In file included from /tmp/CENTOS_K3.10.0_GCC4.8.5/x86_64-native-linuxapp-gcc/74427493f7bc49f9bc980a9c1db12576/dpdk/drivers/crypto/caam_jr/caam_jr.c:24:0:
/tmp/CENTOS_K3.10.0_GCC4.8.5/x86_64-native-linuxapp-gcc/74427493f7bc49f9bc980a9c1db12576/dpdk/drivers/crypto/dpaa2_sec/hw/desc/ipsec.h:1086:1: note: declared here
 cnstr_shdsc_ipsec_new_encap(uint32_t *descbuf, bool ps,
 ^
/tmp/CENTOS_K3.10.0_GCC4.8.5/x86_64-native-linuxapp-gcc/74427493f7bc49f9bc980a9c1db12576/dpdk/drivers/crypto/caam_jr/caam_jr.c:440:7: warning: passing argument 4 of ‘cnstr_shdsc_ipsec_new_decap’ makes pointer from integer without a cast [enabled by default]
       &alginfo_c, &alginfo_a);
       ^
In file included from /tmp/CENTOS_K3.10.0_GCC4.8.5/x86_64-native-linuxapp-gcc/74427493f7bc49f9bc980a9c1db12576/dpdk/drivers/crypto/caam_jr/caam_jr.c:24:0:
/tmp/CENTOS_K3.10.0_GCC4.8.5/x86_64-native-linuxapp-gcc/74427493f7bc49f9bc980a9c1db12576/dpdk/drivers/crypto/dpaa2_sec/hw/desc/ipsec.h:1189:1: note: expected ‘struct ipsec_decap_pdb *’ but argument is of type ‘int’
 cnstr_shdsc_ipsec_new_decap(uint32_t *descbuf, bool ps,
 ^
/tmp/CENTOS_K3.10.0_GCC4.8.5/x86_64-native-linuxapp-gcc/74427493f7bc49f9bc980a9c1db12576/dpdk/drivers/crypto/caam_jr/caam_jr.c:440:7: warning: passing argument 5 of ‘cnstr_shdsc_ipsec_new_decap’ from incompatible pointer type [enabled by default]
       &alginfo_c, &alginfo_a);
       ^
In file included from /tmp/CENTOS_K3.10.0_GCC4.8.5/x86_64-native-linuxapp-gcc/74427493f7bc49f9bc980a9c1db12576/dpdk/drivers/crypto/caam_jr/caam_jr.c:24:0:
/tmp/CENTOS_K3.10.0_GCC4.8.5/x86_64-native-linuxapp-gcc/74427493f7bc49f9bc980a9c1db12576/dpdk/drivers/crypto/dpaa2_sec/hw/desc/ipsec.h:1189:1: note: expected ‘struct alginfo *’ but argument is of type ‘struct ipsec_decap_pdb *’
 cnstr_shdsc_ipsec_new_decap(uint32_t *descbuf, bool ps,
 ^
/tmp/CENTOS_K3.10.0_GCC4.8.5/x86_64-native-linuxapp-gcc/74427493f7bc49f9bc980a9c1db12576/dpdk/drivers/crypto/caam_jr/caam_jr.c:440:7: error: too many arguments to function ‘cnstr_shdsc_ipsec_new_decap’
       &alginfo_c, &alginfo_a);
       ^
In file included from /tmp/CENTOS_K3.10.0_GCC4.8.5/x86_64-native-linuxapp-gcc/74427493f7bc49f9bc980a9c1db12576/dpdk/drivers/crypto/caam_jr/caam_jr.c:24:0:
/tmp/CENTOS_K3.10.0_GCC4.8.5/x86_64-native-linuxapp-gcc/74427493f7bc49f9bc980a9c1db12576/dpdk/drivers/crypto/dpaa2_sec/hw/desc/ipsec.h:1189:1: note: declared here
 cnstr_shdsc_ipsec_new_decap(uint32_t *descbuf, bool ps,

*Failed Build #5:
OS: UB1604
Target: i686-native-linuxapp-gcc
  LD ark_ethdev.o
  CC ark_ethdev_rx.o
  CC caam_jr.o
In file included from /tmp/UB1604_K4.4.0_GCC5.4.0/i686-native-linuxapp-gcc/74427493f7bc49f9bc980a9c1db12576/dpdk/drivers/bus/dpaa/include/of.h:11:0,
                 from /tmp/UB1604_K4.4.0_GCC5.4.0/i686-native-linuxapp-gcc/74427493f7bc49f9bc980a9c1db12576/dpdk/drivers/crypto/caam_jr/caam_jr.c:25:
/tmp/UB1604_K4.4.0_GCC5.4.0/i686-native-linuxapp-gcc/74427493f7bc49f9bc980a9c1db12576/dpdk/drivers/bus/dpaa/include/compat.h:80:0: warning: "pr_err" redefined
 #define pr_err(fmt, args...)  prflush("ERR:" fmt, ##args)
 ^
In file included from /tmp/UB1604_K4.4.0_GCC5.4.0/i686-native-linuxapp-gcc/74427493f7bc49f9bc980a9c1db12576/dpdk/drivers/crypto/dpaa2_sec/hw/desc.h:18:0,
                 from /tmp/UB1604_K4.4.0_GCC5.4.0/i686-native-linuxapp-gcc/74427493f7bc49f9bc980a9c1db12576/dpdk/drivers/crypto/dpaa2_sec/hw/rta/sec_run_time_asm.h:11,
                 from /tmp/UB1604_K4.4.0_GCC5.4.0/i686-native-linuxapp-gcc/74427493f7bc49f9bc980a9c1db12576/dpdk/drivers/crypto/dpaa2_sec/hw/rta.h:11,
--
/tmp/UB1604_K4.4.0_GCC5.4.0/i686-native-linuxapp-gcc/74427493f7bc49f9bc980a9c1db12576/dpdk/drivers/crypto/dpaa2_sec/hw/compat.h:54:0: note: this is the location of the previous definition
 #define pr_err(fmt, ...) \
 ^
In file included from /tmp/UB1604_K4.4.0_GCC5.4.0/i686-native-linuxapp-gcc/74427493f7bc49f9bc980a9c1db12576/dpdk/drivers/bus/dpaa/include/of.h:11:0,
                 from /tmp/UB1604_K4.4.0_GCC5.4.0/i686-native-linuxapp-gcc/74427493f7bc49f9bc980a9c1db12576/dpdk/drivers/crypto/caam_jr/caam_jr.c:25:
/tmp/UB1604_K4.4.0_GCC5.4.0/i686-native-linuxapp-gcc/74427493f7bc49f9bc980a9c1db12576/dpdk/drivers/bus/dpaa/include/compat.h:81:0: warning: "pr_warn" redefined
 #define pr_warn(fmt, args...)  prflush("WARN:" fmt, ##args)
 ^
In file included from /tmp/UB1604_K4.4.0_GCC5.4.0/i686-native-linuxapp-gcc/74427493f7bc49f9bc980a9c1db12576/dpdk/drivers/crypto/dpaa2_sec/hw/desc.h:18:0,
                 from /tmp/UB1604_K4.4.0_GCC5.4.0/i686-native-linuxapp-gcc/74427493f7bc49f9bc980a9c1db12576/dpdk/drivers/crypto/dpaa2_sec/hw/rta/sec_run_time_asm.h:11,
                 from /tmp/UB1604_K4.4.0_GCC5.4.0/i686-native-linuxapp-gcc/74427493f7bc49f9bc980a9c1db12576/dpdk/drivers/crypto/dpaa2_sec/hw/rta.h:11,
--
/tmp/UB1604_K4.4.0_GCC5.4.0/i686-native-linuxapp-gcc/74427493f7bc49f9bc980a9c1db12576/dpdk/drivers/crypto/dpaa2_sec/hw/compat.h:63:0: note: this is the location of the previous definition
 #define pr_warn(fmt, ...) \
 ^
In file included from /tmp/UB1604_K4.4.0_GCC5.4.0/i686-native-linuxapp-gcc/74427493f7bc49f9bc980a9c1db12576/dpdk/drivers/bus/dpaa/include/of.h:11:0,
                 from /tmp/UB1604_K4.4.0_GCC5.4.0/i686-native-linuxapp-gcc/74427493f7bc49f9bc980a9c1db12576/dpdk/drivers/crypto/caam_jr/caam_jr.c:25:
/tmp/UB1604_K4.4.0_GCC5.4.0/i686-native-linuxapp-gcc/74427493f7bc49f9bc980a9c1db12576/dpdk/drivers/bus/dpaa/include/compat.h:90:0: warning: "pr_debug" redefined
 #define pr_debug(fmt, args...) {}
 ^
In file included from /tmp/UB1604_K4.4.0_GCC5.4.0/i686-native-linuxapp-gcc/74427493f7bc49f9bc980a9c1db12576/dpdk/drivers/crypto/dpaa2_sec/hw/desc.h:18:0,
                 from /tmp/UB1604_K4.4.0_GCC5.4.0/i686-native-linuxapp-gcc/74427493f7bc49f9bc980a9c1db12576/dpdk/drivers/crypto/dpaa2_sec/hw/rta/sec_run_time_asm.h:11,
                 from /tmp/UB1604_K4.4.0_GCC5.4.0/i686-native-linuxapp-gcc/74427493f7bc49f9bc980a9c1db12576/dpdk/drivers/crypto/dpaa2_sec/hw/rta.h:11,
--
/tmp/UB1604_K4.4.0_GCC5.4.0/i686-native-linuxapp-gcc/74427493f7bc49f9bc980a9c1db12576/dpdk/drivers/crypto/dpaa2_sec/hw/compat.h:48:0: note: this is the location of the previous definition
 #define pr_debug(fmt, ...)     do { } while (0)
 ^
In file included from /tmp/UB1604_K4.4.0_GCC5.4.0/i686-native-linuxapp-gcc/74427493f7bc49f9bc980a9c1db12576/dpdk/drivers/bus/dpaa/include/of.h:11:0,
                 from /tmp/UB1604_K4.4.0_GCC5.4.0/i686-native-linuxapp-gcc/74427493f7bc49f9bc980a9c1db12576/dpdk/drivers/crypto/caam_jr/caam_jr.c:25:
/tmp/UB1604_K4.4.0_GCC5.4.0/i686-native-linuxapp-gcc/74427493f7bc49f9bc980a9c1db12576/dpdk/drivers/bus/dpaa/include/compat.h:259:0: warning: "cpu_to_be32" redefined
 #define cpu_to_be32(x) rte_cpu_to_be_32(x)
 ^
In file included from /tmp/UB1604_K4.4.0_GCC5.4.0/i686-native-linuxapp-gcc/74427493f7bc49f9bc980a9c1db12576/dpdk/drivers/crypto/dpaa2_sec/hw/desc.h:18:0,
                 from /tmp/UB1604_K4.4.0_GCC5.4.0/i686-native-linuxapp-gcc/74427493f7bc49f9bc980a9c1db12576/dpdk/drivers/crypto/dpaa2_sec/hw/rta/sec_run_time_asm.h:11,
                 from /tmp/UB1604_K4.4.0_GCC5.4.0/i686-native-linuxapp-gcc/74427493f7bc49f9bc980a9c1db12576/dpdk/drivers/crypto/dpaa2_sec/hw/rta.h:11,
--
                 from /tmp/UB1604_K4.4.0_GCC5.4.0/i686-native-linuxapp-gcc/74427493f7bc49f9bc980a9c1db12576/dpdk/drivers/crypto/caam_jr/caam_jr.c:22:
/tmp/UB1604_K4.4.0_GCC5.4.0/i686-native-linuxapp-gcc/74427493f7bc49f9bc980a9c1db12576/dpdk/drivers/crypto/dpaa2_sec/hw/compat.h:113:0: note: this is the location of the previous definition
    #define cpu_to_be32(x) swab32(x)
 ^
/tmp/UB1604_K4.4.0_GCC5.4.0/i686-native-linuxapp-gcc/74427493f7bc49f9bc980a9c1db12576/dpdk/drivers/crypto/caam_jr/caam_jr.c: In function ‘caam_jr_prep_cdb’:
/tmp/UB1604_K4.4.0_GCC5.4.0/i686-native-linuxapp-gcc/74427493f7bc49f9bc980a9c1db12576/dpdk/drivers/crypto/caam_jr/caam_jr.c:431:19: warning: passing argument 4 of ‘cnstr_shdsc_ipsec_new_encap’ makes pointer from integer without a cast [-Wint-conversion]
       true, swap, SHR_SERIAL,
                   ^
In file included from /tmp/UB1604_K4.4.0_GCC5.4.0/i686-native-linuxapp-gcc/74427493f7bc49f9bc980a9c1db12576/dpdk/drivers/crypto/caam_jr/caam_jr.c:24:0:
/tmp/UB1604_K4.4.0_GCC5.4.0/i686-native-linuxapp-gcc/74427493f7bc49f9bc980a9c1db12576/dpdk/drivers/crypto/dpaa2_sec/hw/desc/ipsec.h:1086:1: note: expected ‘struct ipsec_encap_pdb *’ but argument is of type ‘int’
 cnstr_shdsc_ipsec_new_encap(uint32_t *descbuf, bool ps,
 ^
/tmp/UB1604_K4.4.0_GCC5.4.0/i686-native-linuxapp-gcc/74427493f7bc49f9bc980a9c1db12576/dpdk/drivers/crypto/caam_jr/caam_jr.c:432:7: warning: passing argument 5 of ‘cnstr_shdsc_ipsec_new_encap’ from incompatible pointer type [-Wincompatible-pointer-types]
       &ses->encap_pdb,
       ^
In file included from /tmp/UB1604_K4.4.0_GCC5.4.0/i686-native-linuxapp-gcc/74427493f7bc49f9bc980a9c1db12576/dpdk/drivers/crypto/caam_jr/caam_jr.c:24:0:
/tmp/UB1604_K4.4.0_GCC5.4.0/i686-native-linuxapp-gcc/74427493f7bc49f9bc980a9c1db12576/dpdk/drivers/crypto/dpaa2_sec/hw/desc/ipsec.h:1086:1: note: expected ‘uint8_t * {aka unsigned char *}’ but argument is of type ‘struct ipsec_encap_pdb *’
 cnstr_shdsc_ipsec_new_encap(uint32_t *descbuf, bool ps,
 ^
/tmp/UB1604_K4.4.0_GCC5.4.0/i686-native-linuxapp-gcc/74427493f7bc49f9bc980a9c1db12576/dpdk/drivers/crypto/caam_jr/caam_jr.c:433:7: warning: passing argument 6 of ‘cnstr_shdsc_ipsec_new_encap’ from incompatible pointer type [-Wincompatible-pointer-types]
       (uint8_t *)&ses->ip4_hdr,
       ^
In file included from /tmp/UB1604_K4.4.0_GCC5.4.0/i686-native-linuxapp-gcc/74427493f7bc49f9bc980a9c1db12576/dpdk/drivers/crypto/caam_jr/caam_jr.c:24:0:
/tmp/UB1604_K4.4.0_GCC5.4.0/i686-native-linuxapp-gcc/74427493f7bc49f9bc980a9c1db12576/dpdk/drivers/crypto/dpaa2_sec/hw/desc/ipsec.h:1086:1: note: expected ‘struct alginfo *’ but argument is of type ‘uint8_t * {aka unsigned char *}’
 cnstr_shdsc_ipsec_new_encap(uint32_t *descbuf, bool ps,
 ^
/tmp/UB1604_K4.4.0_GCC5.4.0/i686-native-linuxapp-gcc/74427493f7bc49f9bc980a9c1db12576/dpdk/drivers/crypto/caam_jr/caam_jr.c:429:23: error: too many arguments to function ‘cnstr_shdsc_ipsec_new_encap’
     shared_desc_len = cnstr_shdsc_ipsec_new_encap(
                       ^
In file included from /tmp/UB1604_K4.4.0_GCC5.4.0/i686-native-linuxapp-gcc/74427493f7bc49f9bc980a9c1db12576/dpdk/drivers/crypto/caam_jr/caam_jr.c:24:0:
/tmp/UB1604_K4.4.0_GCC5.4.0/i686-native-linuxapp-gcc/74427493f7bc49f9bc980a9c1db12576/dpdk/drivers/crypto/dpaa2_sec/hw/desc/ipsec.h:1086:1: note: declared here
 cnstr_shdsc_ipsec_new_encap(uint32_t *descbuf, bool ps,
 ^
/tmp/UB1604_K4.4.0_GCC5.4.0/i686-native-linuxapp-gcc/74427493f7bc49f9bc980a9c1db12576/dpdk/drivers/crypto/caam_jr/caam_jr.c:438:19: warning: passing argument 4 of ‘cnstr_shdsc_ipsec_new_decap’ makes pointer from integer without a cast [-Wint-conversion]
       true, swap, SHR_SERIAL,
                   ^
In file included from /tmp/UB1604_K4.4.0_GCC5.4.0/i686-native-linuxapp-gcc/74427493f7bc49f9bc980a9c1db12576/dpdk/drivers/crypto/caam_jr/caam_jr.c:24:0:
/tmp/UB1604_K4.4.0_GCC5.4.0/i686-native-linuxapp-gcc/74427493f7bc49f9bc980a9c1db12576/dpdk/drivers/crypto/dpaa2_sec/hw/desc/ipsec.h:1189:1: note: expected ‘struct ipsec_decap_pdb *’ but argument is of type ‘int’
 cnstr_shdsc_ipsec_new_decap(uint32_t *descbuf, bool ps,
 ^
/tmp/UB1604_K4.4.0_GCC5.4.0/i686-native-linuxapp-gcc/74427493f7bc49f9bc980a9c1db12576/dpdk/drivers/crypto/caam_jr/caam_jr.c:439:7: warning: passing argument 5 of ‘cnstr_shdsc_ipsec_new_decap’ from incompatible pointer type [-Wincompatible-pointer-types]
       &ses->decap_pdb,
       ^
In file included from /tmp/UB1604_K4.4.0_GCC5.4.0/i686-native-linuxapp-gcc/74427493f7bc49f9bc980a9c1db12576/dpdk/drivers/crypto/caam_jr/caam_jr.c:24:0:
/tmp/UB1604_K4.4.0_GCC5.4.0/i686-native-linuxapp-gcc/74427493f7bc49f9bc980a9c1db12576/dpdk/drivers/crypto/dpaa2_sec/hw/desc/ipsec.h:1189:1: note: expected ‘struct alginfo *’ but argument is of type ‘struct ipsec_decap_pdb *’
 cnstr_shdsc_ipsec_new_decap(uint32_t *descbuf, bool ps,
 ^
/tmp/UB1604_K4.4.0_GCC5.4.0/i686-native-linuxapp-gcc/74427493f7bc49f9bc980a9c1db12576/dpdk/drivers/crypto/caam_jr/caam_jr.c:436:23: error: too many arguments to function ‘cnstr_shdsc_ipsec_new_decap’
     shared_desc_len = cnstr_shdsc_ipsec_new_decap(
                       ^
In file included from /tmp/UB1604_K4.4.0_GCC5.4.0/i686-native-linuxapp-gcc/74427493f7bc49f9bc980a9c1db12576/dpdk/drivers/crypto/caam_jr/caam_jr.c:24:0:
/tmp/UB1604_K4.4.0_GCC5.4.0/i686-native-linuxapp-gcc/74427493f7bc49f9bc980a9c1db12576/dpdk/drivers/crypto/dpaa2_sec/hw/desc/ipsec.h:1189:1: note: declared here
 cnstr_shdsc_ipsec_new_decap(uint32_t *descbuf, bool ps,
 ^
/tmp/UB1604_K4.4.0_GCC5.4.0/i686-native-linuxapp-gcc/74427493f7bc49f9bc980a9c1db12576/dpdk/mk/internal/rte.compile-pre.mk:114: recipe for target 'caam_jr.o' failed
make[6]: *** [caam_jr.o] Error 1
/tmp/UB1604_K4.4.0_GCC5.4.0/i686-native-linuxapp-gcc/74427493f7bc49f9bc980a9c1db12576/dpdk/mk/rte.subdir.mk:35: recipe for target 'caam_jr' failed
make[5]: *** [caam_jr] Error 2
/tmp/UB1604_K4.4.0_GCC5.4.0/i686-native-linuxapp-gcc/74427493f7bc49f9bc980a9c1db12576/dpdk/mk/rte.subdir.mk:35: recipe for target 'crypto' failed
make[4]: *** [crypto] Error 2
make[4]: *** Waiting for unfinished jobs....
  CC ark_ethdev_tx.o
== Build drivers/net/avf
  CC avf_adminq.o
--
  CC rte_eth_softnic_cli.o
  CC parser.o
  CC conn.o
  AR librte_pmd_softnic.a
  INSTALL-LIB librte_pmd_softnic.a
/tmp/UB1604_K4.4.0_GCC5.4.0/i686-native-linuxapp-gcc/74427493f7bc49f9bc980a9c1db12576/dpdk/mk/rte.sdkbuild.mk:49: recipe for target 'drivers' failed
make[3]: *** [drivers] Error 2
/tmp/UB1604_K4.4.0_GCC5.4.0/i686-native-linuxapp-gcc/74427493f7bc49f9bc980a9c1db12576/dpdk/mk/rte.sdkroot.mk:100: recipe for target 'all' failed
make[2]: *** [all] Error 2
/tmp/UB1604_K4.4.0_GCC5.4.0/i686-native-linuxapp-gcc/74427493f7bc49f9bc980a9c1db12576/dpdk/mk/rte.sdkinstall.mk:57: recipe for target 'pre_install' failed
make[1]: *** [pre_install] Error 2
/tmp/UB1604_K4.4.0_GCC5.4.0/i686-native-linuxapp-gcc/74427493f7bc49f9bc980a9c1db12576/dpdk/mk/rte.sdkroot.mk:79: recipe for target 'install' failed
make: *** [install] Error 2

*Failed Build #6:
OS: CENTOS
Target: x86_64-native-linuxapp-clang
  CC failsafe_args.o
  CC caam_jr.o
  CC failsafe_eal.o
In file included from /tmp/CENTOS_K3.10.0_GCC4.8.5/x86_64-native-linuxapp-clang/74427493f7bc49f9bc980a9c1db12576/dpdk/drivers/crypto/caam_jr/caam_jr.c:25:
In file included from /tmp/CENTOS_K3.10.0_GCC4.8.5/x86_64-native-linuxapp-clang/74427493f7bc49f9bc980a9c1db12576/dpdk/drivers/bus/dpaa/include/of.h:11:
/tmp/CENTOS_K3.10.0_GCC4.8.5/x86_64-native-linuxapp-clang/74427493f7bc49f9bc980a9c1db12576/dpdk/drivers/bus/dpaa/include/compat.h:80:9: warning: 'pr_err' macro redefined
  CC failsafe_ops.o
#define pr_err(fmt, args...)     prflush("ERR:" fmt, ##args)
        ^
/tmp/CENTOS_K3.10.0_GCC4.8.5/x86_64-native-linuxapp-clang/74427493f7bc49f9bc980a9c1db12576/dpdk/drivers/crypto/dpaa2_sec/hw/compat.h:54:9: note: previous definition is here
#define pr_err(fmt, ...) \
        ^
In file included from /tmp/CENTOS_K3.10.0_GCC4.8.5/x86_64-native-linuxapp-clang/74427493f7bc49f9bc980a9c1db12576/dpdk/drivers/crypto/caam_jr/caam_jr.c:25:
In file included from /tmp/CENTOS_K3.10.0_GCC4.8.5/x86_64-native-linuxapp-clang/74427493f7bc49f9bc980a9c1db12576/dpdk/drivers/bus/dpaa/include/of.h:11:
/tmp/CENTOS_K3.10.0_GCC4.8.5/x86_64-native-linuxapp-clang/74427493f7bc49f9bc980a9c1db12576/dpdk/drivers/bus/dpaa/include/compat.h:81:9: warning: 'pr_warn' macro redefined
#define pr_warn(fmt, args...)    prflush("WARN:" fmt, ##args)
        ^
/tmp/CENTOS_K3.10.0_GCC4.8.5/x86_64-native-linuxapp-clang/74427493f7bc49f9bc980a9c1db12576/dpdk/drivers/crypto/dpaa2_sec/hw/compat.h:63:9: note: previous definition is here
#define pr_warn(fmt, ...) \
        ^
In file included from /tmp/CENTOS_K3.10.0_GCC4.8.5/x86_64-native-linuxapp-clang/74427493f7bc49f9bc980a9c1db12576/dpdk/drivers/crypto/caam_jr/caam_jr.c:25:
In file included from /tmp/CENTOS_K3.10.0_GCC4.8.5/x86_64-native-linuxapp-clang/74427493f7bc49f9bc980a9c1db12576/dpdk/drivers/bus/dpaa/include/of.h:11:
/tmp/CENTOS_K3.10.0_GCC4.8.5/x86_64-native-linuxapp-clang/74427493f7bc49f9bc980a9c1db12576/dpdk/drivers/bus/dpaa/include/compat.h:90:9: warning: 'pr_debug' macro redefined
#define pr_debug(fmt, args...) {}
        ^
/tmp/CENTOS_K3.10.0_GCC4.8.5/x86_64-native-linuxapp-clang/74427493f7bc49f9bc980a9c1db12576/dpdk/drivers/crypto/dpaa2_sec/hw/compat.h:48:9: note: previous definition is here
#define pr_debug(fmt, ...)     do { } while (0)
        ^
--
  LD fm10k_ethdev.o
  CC fm10k_rxtx.o
  CC fm10k_pf.o
In file included from /tmp/CENTOS_K3.10.0_GCC4.8.5/x86_64-native-linuxapp-clang/74427493f7bc49f9bc980a9c1db12576/dpdk/drivers/crypto/caam_jr/caam_jr.c:25:
In file included from /tmp/CENTOS_K3.10.0_GCC4.8.5/x86_64-native-linuxapp-clang/74427493f7bc49f9bc980a9c1db12576/dpdk/drivers/bus/dpaa/include/of.h:11:
/tmp/CENTOS_K3.10.0_GCC4.8.5/x86_64-native-linuxapp-clang/74427493f7bc49f9bc980a9c1db12576/dpdk/drivers/bus/dpaa/include/compat.h:100:18: warning: redefinition of typedef 'dma_addr_t' is a C11 feature [-Wtypedef-redefinition]
typedef uint64_t        dma_addr_t;
                        ^
/tmp/CENTOS_K3.10.0_GCC4.8.5/x86_64-native-linuxapp-clang/74427493f7bc49f9bc980a9c1db12576/dpdk/drivers/crypto/caam_jr/caam_jr_config.h:22:18: note: previous definition is here
typedef uint64_t        dma_addr_t;
                        ^
In file included from /tmp/CENTOS_K3.10.0_GCC4.8.5/x86_64-native-linuxapp-clang/74427493f7bc49f9bc980a9c1db12576/dpdk/drivers/crypto/caam_jr/caam_jr.c:25:
In file included from /tmp/CENTOS_K3.10.0_GCC4.8.5/x86_64-native-linuxapp-clang/74427493f7bc49f9bc980a9c1db12576/dpdk/drivers/bus/dpaa/include/of.h:11:
/tmp/CENTOS_K3.10.0_GCC4.8.5/x86_64-native-linuxapp-clang/74427493f7bc49f9bc980a9c1db12576/dpdk/drivers/bus/dpaa/include/compat.h:259:9: warning: 'cpu_to_be32' macro redefined
#define cpu_to_be32(x) rte_cpu_to_be_32(x)
        ^
/tmp/CENTOS_K3.10.0_GCC4.8.5/x86_64-native-linuxapp-clang/74427493f7bc49f9bc980a9c1db12576/dpdk/drivers/crypto/dpaa2_sec/hw/compat.h:113:12: note: previous definition is here
                        #define cpu_to_be32(x)  swab32(x)
                                ^
  CC fm10k_tlv.o
  CC fm10k_common.o
/tmp/CENTOS_K3.10.0_GCC4.8.5/x86_64-native-linuxapp-clang/74427493f7bc49f9bc980a9c1db12576/dpdk/drivers/crypto/caam_jr/caam_jr.c:434:19: error: too many arguments to function call, expected 7, have 8
                                                &alginfo_c, &alginfo_a);
                                                            ^~~~~~~~~~
/tmp/CENTOS_K3.10.0_GCC4.8.5/x86_64-native-linuxapp-clang/74427493f7bc49f9bc980a9c1db12576/dpdk/drivers/crypto/dpaa2_sec/hw/desc/ipsec.h:1085:1: note: 'cnstr_shdsc_ipsec_new_encap' declared here
static inline int
^
/tmp/CENTOS_K3.10.0_GCC4.8.5/x86_64-native-linuxapp-clang/74427493f7bc49f9bc980a9c1db12576/dpdk/drivers/crypto/caam_jr/caam_jr.c:440:19: error: too many arguments to function call, expected 6, have 7
                                                &alginfo_c, &alginfo_a);
                                                            ^~~~~~~~~~
/tmp/CENTOS_K3.10.0_GCC4.8.5/x86_64-native-linuxapp-clang/74427493f7bc49f9bc980a9c1db12576/dpdk/drivers/crypto/dpaa2_sec/hw/desc/ipsec.h:1188:1: note: 'cnstr_shdsc_ipsec_new_decap' declared here
static inline int
^
5 warnings and 2 errors generated.
make[6]: *** [caam_jr.o] Error 1
make[5]: *** [caam_jr] Error 2
make[4]: *** [crypto] Error 2
make[4]: *** Waiting for unfinished jobs....
  CC fm10k_mbx.o

*Failed Build #7:
OS: CENTOS
Target: x86_64-native-linuxapp-gcc-shared
  CC caam_jr_uio.o
  CC ark_ethdev_tx.o
  CC caam_jr.o
In file included from /tmp/CENTOS_K3.10.0_GCC4.8.5/x86_64-native-linuxapp-gcc-shared/74427493f7bc49f9bc980a9c1db12576/dpdk/drivers/bus/dpaa/include/of.h:11:0,
                 from /tmp/CENTOS_K3.10.0_GCC4.8.5/x86_64-native-linuxapp-gcc-shared/74427493f7bc49f9bc980a9c1db12576/dpdk/drivers/crypto/caam_jr/caam_jr.c:25:
/tmp/CENTOS_K3.10.0_GCC4.8.5/x86_64-native-linuxapp-gcc-shared/74427493f7bc49f9bc980a9c1db12576/dpdk/drivers/bus/dpaa/include/compat.h:80:0: warning: "pr_err" redefined [enabled by default]
 #define pr_err(fmt, args...)  prflush("ERR:" fmt, ##args)
 ^
In file included from /tmp/CENTOS_K3.10.0_GCC4.8.5/x86_64-native-linuxapp-gcc-shared/74427493f7bc49f9bc980a9c1db12576/dpdk/drivers/crypto/dpaa2_sec/hw/desc.h:18:0,
                 from /tmp/CENTOS_K3.10.0_GCC4.8.5/x86_64-native-linuxapp-gcc-shared/74427493f7bc49f9bc980a9c1db12576/dpdk/drivers/crypto/dpaa2_sec/hw/rta/sec_run_time_asm.h:11,
                 from /tmp/CENTOS_K3.10.0_GCC4.8.5/x86_64-native-linuxapp-gcc-shared/74427493f7bc49f9bc980a9c1db12576/dpdk/drivers/crypto/dpaa2_sec/hw/rta.h:11,
--
/tmp/CENTOS_K3.10.0_GCC4.8.5/x86_64-native-linuxapp-gcc-shared/74427493f7bc49f9bc980a9c1db12576/dpdk/drivers/crypto/dpaa2_sec/hw/compat.h:54:0: note: this is the location of the previous definition
 #define pr_err(fmt, ...) \
 ^
In file included from /tmp/CENTOS_K3.10.0_GCC4.8.5/x86_64-native-linuxapp-gcc-shared/74427493f7bc49f9bc980a9c1db12576/dpdk/drivers/bus/dpaa/include/of.h:11:0,
                 from /tmp/CENTOS_K3.10.0_GCC4.8.5/x86_64-native-linuxapp-gcc-shared/74427493f7bc49f9bc980a9c1db12576/dpdk/drivers/crypto/caam_jr/caam_jr.c:25:
/tmp/CENTOS_K3.10.0_GCC4.8.5/x86_64-native-linuxapp-gcc-shared/74427493f7bc49f9bc980a9c1db12576/dpdk/drivers/bus/dpaa/include/compat.h:81:0: warning: "pr_warn" redefined [enabled by default]
 #define pr_warn(fmt, args...)  prflush("WARN:" fmt, ##args)
 ^
In file included from /tmp/CENTOS_K3.10.0_GCC4.8.5/x86_64-native-linuxapp-gcc-shared/74427493f7bc49f9bc980a9c1db12576/dpdk/drivers/crypto/dpaa2_sec/hw/desc.h:18:0,
                 from /tmp/CENTOS_K3.10.0_GCC4.8.5/x86_64-native-linuxapp-gcc-shared/74427493f7bc49f9bc980a9c1db12576/dpdk/drivers/crypto/dpaa2_sec/hw/rta/sec_run_time_asm.h:11,
                 from /tmp/CENTOS_K3.10.0_GCC4.8.5/x86_64-native-linuxapp-gcc-shared/74427493f7bc49f9bc980a9c1db12576/dpdk/drivers/crypto/dpaa2_sec/hw/rta.h:11,
--
/tmp/CENTOS_K3.10.0_GCC4.8.5/x86_64-native-linuxapp-gcc-shared/74427493f7bc49f9bc980a9c1db12576/dpdk/drivers/crypto/dpaa2_sec/hw/compat.h:63:0: note: this is the location of the previous definition
 #define pr_warn(fmt, ...) \
 ^
In file included from /tmp/CENTOS_K3.10.0_GCC4.8.5/x86_64-native-linuxapp-gcc-shared/74427493f7bc49f9bc980a9c1db12576/dpdk/drivers/bus/dpaa/include/of.h:11:0,
                 from /tmp/CENTOS_K3.10.0_GCC4.8.5/x86_64-native-linuxapp-gcc-shared/74427493f7bc49f9bc980a9c1db12576/dpdk/drivers/crypto/caam_jr/caam_jr.c:25:
/tmp/CENTOS_K3.10.0_GCC4.8.5/x86_64-native-linuxapp-gcc-shared/74427493f7bc49f9bc980a9c1db12576/dpdk/drivers/bus/dpaa/include/compat.h:90:0: warning: "pr_debug" redefined [enabled by default]
 #define pr_debug(fmt, args...) {}
 ^
In file included from /tmp/CENTOS_K3.10.0_GCC4.8.5/x86_64-native-linuxapp-gcc-shared/74427493f7bc49f9bc980a9c1db12576/dpdk/drivers/crypto/dpaa2_sec/hw/desc.h:18:0,
                 from /tmp/CENTOS_K3.10.0_GCC4.8.5/x86_64-native-linuxapp-gcc-shared/74427493f7bc49f9bc980a9c1db12576/dpdk/drivers/crypto/dpaa2_sec/hw/rta/sec_run_time_asm.h:11,
                 from /tmp/CENTOS_K3.10.0_GCC4.8.5/x86_64-native-linuxapp-gcc-shared/74427493f7bc49f9bc980a9c1db12576/dpdk/drivers/crypto/dpaa2_sec/hw/rta.h:11,
--
/tmp/CENTOS_K3.10.0_GCC4.8.5/x86_64-native-linuxapp-gcc-shared/74427493f7bc49f9bc980a9c1db12576/dpdk/drivers/crypto/dpaa2_sec/hw/compat.h:48:0: note: this is the location of the previous definition
 #define pr_debug(fmt, ...)     do { } while (0)
 ^
In file included from /tmp/CENTOS_K3.10.0_GCC4.8.5/x86_64-native-linuxapp-gcc-shared/74427493f7bc49f9bc980a9c1db12576/dpdk/drivers/bus/dpaa/include/of.h:11:0,
                 from /tmp/CENTOS_K3.10.0_GCC4.8.5/x86_64-native-linuxapp-gcc-shared/74427493f7bc49f9bc980a9c1db12576/dpdk/drivers/crypto/caam_jr/caam_jr.c:25:
/tmp/CENTOS_K3.10.0_GCC4.8.5/x86_64-native-linuxapp-gcc-shared/74427493f7bc49f9bc980a9c1db12576/dpdk/drivers/bus/dpaa/include/compat.h:259:0: warning: "cpu_to_be32" redefined [enabled by default]
 #define cpu_to_be32(x) rte_cpu_to_be_32(x)
 ^
In file included from /tmp/CENTOS_K3.10.0_GCC4.8.5/x86_64-native-linuxapp-gcc-shared/74427493f7bc49f9bc980a9c1db12576/dpdk/drivers/crypto/dpaa2_sec/hw/desc.h:18:0,
                 from /tmp/CENTOS_K3.10.0_GCC4.8.5/x86_64-native-linuxapp-gcc-shared/74427493f7bc49f9bc980a9c1db12576/dpdk/drivers/crypto/dpaa2_sec/hw/rta/sec_run_time_asm.h:11,
                 from /tmp/CENTOS_K3.10.0_GCC4.8.5/x86_64-native-linuxapp-gcc-shared/74427493f7bc49f9bc980a9c1db12576/dpdk/drivers/crypto/dpaa2_sec/hw/rta.h:11,
--
                 from /tmp/CENTOS_K3.10.0_GCC4.8.5/x86_64-native-linuxapp-gcc-shared/74427493f7bc49f9bc980a9c1db12576/dpdk/drivers/crypto/caam_jr/caam_jr.c:22:
/tmp/CENTOS_K3.10.0_GCC4.8.5/x86_64-native-linuxapp-gcc-shared/74427493f7bc49f9bc980a9c1db12576/dpdk/drivers/crypto/dpaa2_sec/hw/compat.h:113:0: note: this is the location of the previous definition
    #define cpu_to_be32(x) swab32(x)
 ^
/tmp/CENTOS_K3.10.0_GCC4.8.5/x86_64-native-linuxapp-gcc-shared/74427493f7bc49f9bc980a9c1db12576/dpdk/drivers/crypto/caam_jr/caam_jr.c: In function ‘caam_jr_prep_cdb’:
/tmp/CENTOS_K3.10.0_GCC4.8.5/x86_64-native-linuxapp-gcc-shared/74427493f7bc49f9bc980a9c1db12576/dpdk/drivers/crypto/caam_jr/caam_jr.c:434:7: warning: passing argument 4 of ‘cnstr_shdsc_ipsec_new_encap’ makes pointer from integer without a cast [enabled by default]
       &alginfo_c, &alginfo_a);
       ^
In file included from /tmp/CENTOS_K3.10.0_GCC4.8.5/x86_64-native-linuxapp-gcc-shared/74427493f7bc49f9bc980a9c1db12576/dpdk/drivers/crypto/caam_jr/caam_jr.c:24:0:
/tmp/CENTOS_K3.10.0_GCC4.8.5/x86_64-native-linuxapp-gcc-shared/74427493f7bc49f9bc980a9c1db12576/dpdk/drivers/crypto/dpaa2_sec/hw/desc/ipsec.h:1086:1: note: expected ‘struct ipsec_encap_pdb *’ but argument is of type ‘int’
 cnstr_shdsc_ipsec_new_encap(uint32_t *descbuf, bool ps,
 ^
/tmp/CENTOS_K3.10.0_GCC4.8.5/x86_64-native-linuxapp-gcc-shared/74427493f7bc49f9bc980a9c1db12576/dpdk/drivers/crypto/caam_jr/caam_jr.c:434:7: warning: passing argument 5 of ‘cnstr_shdsc_ipsec_new_encap’ from incompatible pointer type [enabled by default]
       &alginfo_c, &alginfo_a);
       ^
In file included from /tmp/CENTOS_K3.10.0_GCC4.8.5/x86_64-native-linuxapp-gcc-shared/74427493f7bc49f9bc980a9c1db12576/dpdk/drivers/crypto/caam_jr/caam_jr.c:24:0:
/tmp/CENTOS_K3.10.0_GCC4.8.5/x86_64-native-linuxapp-gcc-shared/74427493f7bc49f9bc980a9c1db12576/dpdk/drivers/crypto/dpaa2_sec/hw/desc/ipsec.h:1086:1: note: expected ‘uint8_t *’ but argument is of type ‘struct ipsec_encap_pdb *’
 cnstr_shdsc_ipsec_new_encap(uint32_t *descbuf, bool ps,
 ^
/tmp/CENTOS_K3.10.0_GCC4.8.5/x86_64-native-linuxapp-gcc-shared/74427493f7bc49f9bc980a9c1db12576/dpdk/drivers/crypto/caam_jr/caam_jr.c:434:7: warning: passing argument 6 of ‘cnstr_shdsc_ipsec_new_encap’ from incompatible pointer type [enabled by default]
       &alginfo_c, &alginfo_a);
       ^
In file included from /tmp/CENTOS_K3.10.0_GCC4.8.5/x86_64-native-linuxapp-gcc-shared/74427493f7bc49f9bc980a9c1db12576/dpdk/drivers/crypto/caam_jr/caam_jr.c:24:0:
/tmp/CENTOS_K3.10.0_GCC4.8.5/x86_64-native-linuxapp-gcc-shared/74427493f7bc49f9bc980a9c1db12576/dpdk/drivers/crypto/dpaa2_sec/hw/desc/ipsec.h:1086:1: note: expected ‘struct alginfo *’ but argument is of type ‘uint8_t *’
 cnstr_shdsc_ipsec_new_encap(uint32_t *descbuf, bool ps,
 ^
/tmp/CENTOS_K3.10.0_GCC4.8.5/x86_64-native-linuxapp-gcc-shared/74427493f7bc49f9bc980a9c1db12576/dpdk/drivers/crypto/caam_jr/caam_jr.c:434:7: error: too many arguments to function ‘cnstr_shdsc_ipsec_new_encap’
       &alginfo_c, &alginfo_a);
       ^
In file included from /tmp/CENTOS_K3.10.0_GCC4.8.5/x86_64-native-linuxapp-gcc-shared/74427493f7bc49f9bc980a9c1db12576/dpdk/drivers/crypto/caam_jr/caam_jr.c:24:0:
/tmp/CENTOS_K3.10.0_GCC4.8.5/x86_64-native-linuxapp-gcc-shared/74427493f7bc49f9bc980a9c1db12576/dpdk/drivers/crypto/dpaa2_sec/hw/desc/ipsec.h:1086:1: note: declared here
 cnstr_shdsc_ipsec_new_encap(uint32_t *descbuf, bool ps,
 ^
/tmp/CENTOS_K3.10.0_GCC4.8.5/x86_64-native-linuxapp-gcc-shared/74427493f7bc49f9bc980a9c1db12576/dpdk/drivers/crypto/caam_jr/caam_jr.c:440:7: warning: passing argument 4 of ‘cnstr_shdsc_ipsec_new_decap’ makes pointer from integer without a cast [enabled by default]
       &alginfo_c, &alginfo_a);
       ^
In file included from /tmp/CENTOS_K3.10.0_GCC4.8.5/x86_64-native-linuxapp-gcc-shared/74427493f7bc49f9bc980a9c1db12576/dpdk/drivers/crypto/caam_jr/caam_jr.c:24:0:
/tmp/CENTOS_K3.10.0_GCC4.8.5/x86_64-native-linuxapp-gcc-shared/74427493f7bc49f9bc980a9c1db12576/dpdk/drivers/crypto/dpaa2_sec/hw/desc/ipsec.h:1189:1: note: expected ‘struct ipsec_decap_pdb *’ but argument is of type ‘int’
 cnstr_shdsc_ipsec_new_decap(uint32_t *descbuf, bool ps,
 ^
/tmp/CENTOS_K3.10.0_GCC4.8.5/x86_64-native-linuxapp-gcc-shared/74427493f7bc49f9bc980a9c1db12576/dpdk/drivers/crypto/caam_jr/caam_jr.c:440:7: warning: passing argument 5 of ‘cnstr_shdsc_ipsec_new_decap’ from incompatible pointer type [enabled by default]
       &alginfo_c, &alginfo_a);
       ^
In file included from /tmp/CENTOS_K3.10.0_GCC4.8.5/x86_64-native-linuxapp-gcc-shared/74427493f7bc49f9bc980a9c1db12576/dpdk/drivers/crypto/caam_jr/caam_jr.c:24:0:
/tmp/CENTOS_K3.10.0_GCC4.8.5/x86_64-native-linuxapp-gcc-shared/74427493f7bc49f9bc980a9c1db12576/dpdk/drivers/crypto/dpaa2_sec/hw/desc/ipsec.h:1189:1: note: expected ‘struct alginfo *’ but argument is of type ‘struct ipsec_decap_pdb *’
 cnstr_shdsc_ipsec_new_decap(uint32_t *descbuf, bool ps,
 ^
/tmp/CENTOS_K3.10.0_GCC4.8.5/x86_64-native-linuxapp-gcc-shared/74427493f7bc49f9bc980a9c1db12576/dpdk/drivers/crypto/caam_jr/caam_jr.c:440:7: error: too many arguments to function ‘cnstr_shdsc_ipsec_new_decap’
       &alginfo_c, &alginfo_a);
       ^
In file included from /tmp/CENTOS_K3.10.0_GCC4.8.5/x86_64-native-linuxapp-gcc-shared/74427493f7bc49f9bc980a9c1db12576/dpdk/drivers/crypto/caam_jr/caam_jr.c:24:0:
/tmp/CENTOS_K3.10.0_GCC4.8.5/x86_64-native-linuxapp-gcc-shared/74427493f7bc49f9bc980a9c1db12576/dpdk/drivers/crypto/dpaa2_sec/hw/desc/ipsec.h:1189:1: note: declared here
 cnstr_shdsc_ipsec_new_decap(uint32_t *descbuf, bool ps,

*Failed Build #8:
OS: CENTOS
Target: i686-native-linuxapp-gcc
  CC ark_ethdev_rx.o
  CC caam_jr_uio.o
  CC caam_jr.o
In file included from /tmp/CENTOS_K3.10.0_GCC4.8.5/i686-native-linuxapp-gcc/74427493f7bc49f9bc980a9c1db12576/dpdk/drivers/bus/dpaa/include/of.h:11:0,
                 from /tmp/CENTOS_K3.10.0_GCC4.8.5/i686-native-linuxapp-gcc/74427493f7bc49f9bc980a9c1db12576/dpdk/drivers/crypto/caam_jr/caam_jr.c:25:
/tmp/CENTOS_K3.10.0_GCC4.8.5/i686-native-linuxapp-gcc/74427493f7bc49f9bc980a9c1db12576/dpdk/drivers/bus/dpaa/include/compat.h:80:0: warning: "pr_err" redefined [enabled by default]
 #define pr_err(fmt, args...)  prflush("ERR:" fmt, ##args)
 ^
In file included from /tmp/CENTOS_K3.10.0_GCC4.8.5/i686-native-linuxapp-gcc/74427493f7bc49f9bc980a9c1db12576/dpdk/drivers/crypto/dpaa2_sec/hw/desc.h:18:0,
                 from /tmp/CENTOS_K3.10.0_GCC4.8.5/i686-native-linuxapp-gcc/74427493f7bc49f9bc980a9c1db12576/dpdk/drivers/crypto/dpaa2_sec/hw/rta/sec_run_time_asm.h:11,
                 from /tmp/CENTOS_K3.10.0_GCC4.8.5/i686-native-linuxapp-gcc/74427493f7bc49f9bc980a9c1db12576/dpdk/drivers/crypto/dpaa2_sec/hw/rta.h:11,
--
/tmp/CENTOS_K3.10.0_GCC4.8.5/i686-native-linuxapp-gcc/74427493f7bc49f9bc980a9c1db12576/dpdk/drivers/crypto/dpaa2_sec/hw/compat.h:54:0: note: this is the location of the previous definition
 #define pr_err(fmt, ...) \
 ^
In file included from /tmp/CENTOS_K3.10.0_GCC4.8.5/i686-native-linuxapp-gcc/74427493f7bc49f9bc980a9c1db12576/dpdk/drivers/bus/dpaa/include/of.h:11:0,
                 from /tmp/CENTOS_K3.10.0_GCC4.8.5/i686-native-linuxapp-gcc/74427493f7bc49f9bc980a9c1db12576/dpdk/drivers/crypto/caam_jr/caam_jr.c:25:
/tmp/CENTOS_K3.10.0_GCC4.8.5/i686-native-linuxapp-gcc/74427493f7bc49f9bc980a9c1db12576/dpdk/drivers/bus/dpaa/include/compat.h:81:0: warning: "pr_warn" redefined [enabled by default]
 #define pr_warn(fmt, args...)  prflush("WARN:" fmt, ##args)
 ^
In file included from /tmp/CENTOS_K3.10.0_GCC4.8.5/i686-native-linuxapp-gcc/74427493f7bc49f9bc980a9c1db12576/dpdk/drivers/crypto/dpaa2_sec/hw/desc.h:18:0,
                 from /tmp/CENTOS_K3.10.0_GCC4.8.5/i686-native-linuxapp-gcc/74427493f7bc49f9bc980a9c1db12576/dpdk/drivers/crypto/dpaa2_sec/hw/rta/sec_run_time_asm.h:11,
                 from /tmp/CENTOS_K3.10.0_GCC4.8.5/i686-native-linuxapp-gcc/74427493f7bc49f9bc980a9c1db12576/dpdk/drivers/crypto/dpaa2_sec/hw/rta.h:11,
--
/tmp/CENTOS_K3.10.0_GCC4.8.5/i686-native-linuxapp-gcc/74427493f7bc49f9bc980a9c1db12576/dpdk/drivers/crypto/dpaa2_sec/hw/compat.h:63:0: note: this is the location of the previous definition
 #define pr_warn(fmt, ...) \
 ^
In file included from /tmp/CENTOS_K3.10.0_GCC4.8.5/i686-native-linuxapp-gcc/74427493f7bc49f9bc980a9c1db12576/dpdk/drivers/bus/dpaa/include/of.h:11:0,
                 from /tmp/CENTOS_K3.10.0_GCC4.8.5/i686-native-linuxapp-gcc/74427493f7bc49f9bc980a9c1db12576/dpdk/drivers/crypto/caam_jr/caam_jr.c:25:
/tmp/CENTOS_K3.10.0_GCC4.8.5/i686-native-linuxapp-gcc/74427493f7bc49f9bc980a9c1db12576/dpdk/drivers/bus/dpaa/include/compat.h:90:0: warning: "pr_debug" redefined [enabled by default]
 #define pr_debug(fmt, args...) {}
 ^
In file included from /tmp/CENTOS_K3.10.0_GCC4.8.5/i686-native-linuxapp-gcc/74427493f7bc49f9bc980a9c1db12576/dpdk/drivers/crypto/dpaa2_sec/hw/desc.h:18:0,
                 from /tmp/CENTOS_K3.10.0_GCC4.8.5/i686-native-linuxapp-gcc/74427493f7bc49f9bc980a9c1db12576/dpdk/drivers/crypto/dpaa2_sec/hw/rta/sec_run_time_asm.h:11,
                 from /tmp/CENTOS_K3.10.0_GCC4.8.5/i686-native-linuxapp-gcc/74427493f7bc49f9bc980a9c1db12576/dpdk/drivers/crypto/dpaa2_sec/hw/rta.h:11,
--
/tmp/CENTOS_K3.10.0_GCC4.8.5/i686-native-linuxapp-gcc/74427493f7bc49f9bc980a9c1db12576/dpdk/drivers/crypto/dpaa2_sec/hw/compat.h:48:0: note: this is the location of the previous definition
 #define pr_debug(fmt, ...)     do { } while (0)
 ^
In file included from /tmp/CENTOS_K3.10.0_GCC4.8.5/i686-native-linuxapp-gcc/74427493f7bc49f9bc980a9c1db12576/dpdk/drivers/bus/dpaa/include/of.h:11:0,
                 from /tmp/CENTOS_K3.10.0_GCC4.8.5/i686-native-linuxapp-gcc/74427493f7bc49f9bc980a9c1db12576/dpdk/drivers/crypto/caam_jr/caam_jr.c:25:
/tmp/CENTOS_K3.10.0_GCC4.8.5/i686-native-linuxapp-gcc/74427493f7bc49f9bc980a9c1db12576/dpdk/drivers/bus/dpaa/include/compat.h:259:0: warning: "cpu_to_be32" redefined [enabled by default]
 #define cpu_to_be32(x) rte_cpu_to_be_32(x)
 ^
In file included from /tmp/CENTOS_K3.10.0_GCC4.8.5/i686-native-linuxapp-gcc/74427493f7bc49f9bc980a9c1db12576/dpdk/drivers/crypto/dpaa2_sec/hw/desc.h:18:0,
                 from /tmp/CENTOS_K3.10.0_GCC4.8.5/i686-native-linuxapp-gcc/74427493f7bc49f9bc980a9c1db12576/dpdk/drivers/crypto/dpaa2_sec/hw/rta/sec_run_time_asm.h:11,
                 from /tmp/CENTOS_K3.10.0_GCC4.8.5/i686-native-linuxapp-gcc/74427493f7bc49f9bc980a9c1db12576/dpdk/drivers/crypto/dpaa2_sec/hw/rta.h:11,
--
/tmp/CENTOS_K3.10.0_GCC4.8.5/i686-native-linuxapp-gcc/74427493f7bc49f9bc980a9c1db12576/dpdk/drivers/crypto/dpaa2_sec/hw/compat.h:113:0: note: this is the location of the previous definition
    #define cpu_to_be32(x) swab32(x)
 ^
  CC ark_ethdev_tx.o
/tmp/CENTOS_K3.10.0_GCC4.8.5/i686-native-linuxapp-gcc/74427493f7bc49f9bc980a9c1db12576/dpdk/drivers/crypto/caam_jr/caam_jr.c: In function ‘caam_jr_prep_cdb’:
/tmp/CENTOS_K3.10.0_GCC4.8.5/i686-native-linuxapp-gcc/74427493f7bc49f9bc980a9c1db12576/dpdk/drivers/crypto/caam_jr/caam_jr.c:434:7: warning: passing argument 4 of ‘cnstr_shdsc_ipsec_new_encap’ makes pointer from integer without a cast [enabled by default]
       &alginfo_c, &alginfo_a);
       ^
In file included from /tmp/CENTOS_K3.10.0_GCC4.8.5/i686-native-linuxapp-gcc/74427493f7bc49f9bc980a9c1db12576/dpdk/drivers/crypto/caam_jr/caam_jr.c:24:0:
/tmp/CENTOS_K3.10.0_GCC4.8.5/i686-native-linuxapp-gcc/74427493f7bc49f9bc980a9c1db12576/dpdk/drivers/crypto/dpaa2_sec/hw/desc/ipsec.h:1086:1: note: expected ‘struct ipsec_encap_pdb *’ but argument is of type ‘int’
 cnstr_shdsc_ipsec_new_encap(uint32_t *descbuf, bool ps,
 ^
/tmp/CENTOS_K3.10.0_GCC4.8.5/i686-native-linuxapp-gcc/74427493f7bc49f9bc980a9c1db12576/dpdk/drivers/crypto/caam_jr/caam_jr.c:434:7: warning: passing argument 5 of ‘cnstr_shdsc_ipsec_new_encap’ from incompatible pointer type [enabled by default]
       &alginfo_c, &alginfo_a);
       ^
In file included from /tmp/CENTOS_K3.10.0_GCC4.8.5/i686-native-linuxapp-gcc/74427493f7bc49f9bc980a9c1db12576/dpdk/drivers/crypto/caam_jr/caam_jr.c:24:0:
/tmp/CENTOS_K3.10.0_GCC4.8.5/i686-native-linuxapp-gcc/74427493f7bc49f9bc980a9c1db12576/dpdk/drivers/crypto/dpaa2_sec/hw/desc/ipsec.h:1086:1: note: expected ‘uint8_t *’ but argument is of type ‘struct ipsec_encap_pdb *’
 cnstr_shdsc_ipsec_new_encap(uint32_t *descbuf, bool ps,
 ^
/tmp/CENTOS_K3.10.0_GCC4.8.5/i686-native-linuxapp-gcc/74427493f7bc49f9bc980a9c1db12576/dpdk/drivers/crypto/caam_jr/caam_jr.c:434:7: warning: passing argument 6 of ‘cnstr_shdsc_ipsec_new_encap’ from incompatible pointer type [enabled by default]
       &alginfo_c, &alginfo_a);
       ^
In file included from /tmp/CENTOS_K3.10.0_GCC4.8.5/i686-native-linuxapp-gcc/74427493f7bc49f9bc980a9c1db12576/dpdk/drivers/crypto/caam_jr/caam_jr.c:24:0:
/tmp/CENTOS_K3.10.0_GCC4.8.5/i686-native-linuxapp-gcc/74427493f7bc49f9bc980a9c1db12576/dpdk/drivers/crypto/dpaa2_sec/hw/desc/ipsec.h:1086:1: note: expected ‘struct alginfo *’ but argument is of type ‘uint8_t *’
 cnstr_shdsc_ipsec_new_encap(uint32_t *descbuf, bool ps,
 ^
/tmp/CENTOS_K3.10.0_GCC4.8.5/i686-native-linuxapp-gcc/74427493f7bc49f9bc980a9c1db12576/dpdk/drivers/crypto/caam_jr/caam_jr.c:434:7: error: too many arguments to function ‘cnstr_shdsc_ipsec_new_encap’
       &alginfo_c, &alginfo_a);
       ^
In file included from /tmp/CENTOS_K3.10.0_GCC4.8.5/i686-native-linuxapp-gcc/74427493f7bc49f9bc980a9c1db12576/dpdk/drivers/crypto/caam_jr/caam_jr.c:24:0:
/tmp/CENTOS_K3.10.0_GCC4.8.5/i686-native-linuxapp-gcc/74427493f7bc49f9bc980a9c1db12576/dpdk/drivers/crypto/dpaa2_sec/hw/desc/ipsec.h:1086:1: note: declared here
 cnstr_shdsc_ipsec_new_encap(uint32_t *descbuf, bool ps,
 ^
/tmp/CENTOS_K3.10.0_GCC4.8.5/i686-native-linuxapp-gcc/74427493f7bc49f9bc980a9c1db12576/dpdk/drivers/crypto/caam_jr/caam_jr.c:440:7: warning: passing argument 4 of ‘cnstr_shdsc_ipsec_new_decap’ makes pointer from integer without a cast [enabled by default]
       &alginfo_c, &alginfo_a);
       ^
In file included from /tmp/CENTOS_K3.10.0_GCC4.8.5/i686-native-linuxapp-gcc/74427493f7bc49f9bc980a9c1db12576/dpdk/drivers/crypto/caam_jr/caam_jr.c:24:0:
/tmp/CENTOS_K3.10.0_GCC4.8.5/i686-native-linuxapp-gcc/74427493f7bc49f9bc980a9c1db12576/dpdk/drivers/crypto/dpaa2_sec/hw/desc/ipsec.h:1189:1: note: expected ‘struct ipsec_decap_pdb *’ but argument is of type ‘int’
 cnstr_shdsc_ipsec_new_decap(uint32_t *descbuf, bool ps,
 ^
/tmp/CENTOS_K3.10.0_GCC4.8.5/i686-native-linuxapp-gcc/74427493f7bc49f9bc980a9c1db12576/dpdk/drivers/crypto/caam_jr/caam_jr.c:440:7: warning: passing argument 5 of ‘cnstr_shdsc_ipsec_new_decap’ from incompatible pointer type [enabled by default]
       &alginfo_c, &alginfo_a);
       ^
In file included from /tmp/CENTOS_K3.10.0_GCC4.8.5/i686-native-linuxapp-gcc/74427493f7bc49f9bc980a9c1db12576/dpdk/drivers/crypto/caam_jr/caam_jr.c:24:0:
/tmp/CENTOS_K3.10.0_GCC4.8.5/i686-native-linuxapp-gcc/74427493f7bc49f9bc980a9c1db12576/dpdk/drivers/crypto/dpaa2_sec/hw/desc/ipsec.h:1189:1: note: expected ‘struct alginfo *’ but argument is of type ‘struct ipsec_decap_pdb *’
 cnstr_shdsc_ipsec_new_decap(uint32_t *descbuf, bool ps,
 ^
/tmp/CENTOS_K3.10.0_GCC4.8.5/i686-native-linuxapp-gcc/74427493f7bc49f9bc980a9c1db12576/dpdk/drivers/crypto/caam_jr/caam_jr.c:440:7: error: too many arguments to function ‘cnstr_shdsc_ipsec_new_decap’
       &alginfo_c, &alginfo_a);
       ^
In file included from /tmp/CENTOS_K3.10.0_GCC4.8.5/i686-native-linuxapp-gcc/74427493f7bc49f9bc980a9c1db12576/dpdk/drivers/crypto/caam_jr/caam_jr.c:24:0:
/tmp/CENTOS_K3.10.0_GCC4.8.5/i686-native-linuxapp-gcc/74427493f7bc49f9bc980a9c1db12576/dpdk/drivers/crypto/dpaa2_sec/hw/desc/ipsec.h:1189:1: note: declared here
 cnstr_shdsc_ipsec_new_decap(uint32_t *descbuf, bool ps,

*Failed Build #9:
OS: UB1604
Target: x86_64-native-linuxapp-gcc-shared
  CC ark_ethdev.o.pmd.o
  LD ark_ethdev.o
  CC ark_ethdev_rx.o
In file included from /tmp/UB1604_K4.4.0_GCC5.4.0/x86_64-native-linuxapp-gcc-shared/74427493f7bc49f9bc980a9c1db12576/dpdk/drivers/bus/dpaa/include/of.h:11:0,
                 from /tmp/UB1604_K4.4.0_GCC5.4.0/x86_64-native-linuxapp-gcc-shared/74427493f7bc49f9bc980a9c1db12576/dpdk/drivers/crypto/caam_jr/caam_jr.c:25:
/tmp/UB1604_K4.4.0_GCC5.4.0/x86_64-native-linuxapp-gcc-shared/74427493f7bc49f9bc980a9c1db12576/dpdk/drivers/bus/dpaa/include/compat.h:80:0: warning: "pr_err" redefined
 #define pr_err(fmt, args...)  prflush("ERR:" fmt, ##args)
 ^
In file included from /tmp/UB1604_K4.4.0_GCC5.4.0/x86_64-native-linuxapp-gcc-shared/74427493f7bc49f9bc980a9c1db12576/dpdk/drivers/crypto/dpaa2_sec/hw/desc.h:18:0,
                 from /tmp/UB1604_K4.4.0_GCC5.4.0/x86_64-native-linuxapp-gcc-shared/74427493f7bc49f9bc980a9c1db12576/dpdk/drivers/crypto/dpaa2_sec/hw/rta/sec_run_time_asm.h:11,
                 from /tmp/UB1604_K4.4.0_GCC5.4.0/x86_64-native-linuxapp-gcc-shared/74427493f7bc49f9bc980a9c1db12576/dpdk/drivers/crypto/dpaa2_sec/hw/rta.h:11,
--
/tmp/UB1604_K4.4.0_GCC5.4.0/x86_64-native-linuxapp-gcc-shared/74427493f7bc49f9bc980a9c1db12576/dpdk/drivers/crypto/dpaa2_sec/hw/compat.h:54:0: note: this is the location of the previous definition
 #define pr_err(fmt, ...) \
 ^
In file included from /tmp/UB1604_K4.4.0_GCC5.4.0/x86_64-native-linuxapp-gcc-shared/74427493f7bc49f9bc980a9c1db12576/dpdk/drivers/bus/dpaa/include/of.h:11:0,
                 from /tmp/UB1604_K4.4.0_GCC5.4.0/x86_64-native-linuxapp-gcc-shared/74427493f7bc49f9bc980a9c1db12576/dpdk/drivers/crypto/caam_jr/caam_jr.c:25:
/tmp/UB1604_K4.4.0_GCC5.4.0/x86_64-native-linuxapp-gcc-shared/74427493f7bc49f9bc980a9c1db12576/dpdk/drivers/bus/dpaa/include/compat.h:81:0: warning: "pr_warn" redefined
 #define pr_warn(fmt, args...)  prflush("WARN:" fmt, ##args)
 ^
In file included from /tmp/UB1604_K4.4.0_GCC5.4.0/x86_64-native-linuxapp-gcc-shared/74427493f7bc49f9bc980a9c1db12576/dpdk/drivers/crypto/dpaa2_sec/hw/desc.h:18:0,
                 from /tmp/UB1604_K4.4.0_GCC5.4.0/x86_64-native-linuxapp-gcc-shared/74427493f7bc49f9bc980a9c1db12576/dpdk/drivers/crypto/dpaa2_sec/hw/rta/sec_run_time_asm.h:11,
                 from /tmp/UB1604_K4.4.0_GCC5.4.0/x86_64-native-linuxapp-gcc-shared/74427493f7bc49f9bc980a9c1db12576/dpdk/drivers/crypto/dpaa2_sec/hw/rta.h:11,
--
/tmp/UB1604_K4.4.0_GCC5.4.0/x86_64-native-linuxapp-gcc-shared/74427493f7bc49f9bc980a9c1db12576/dpdk/drivers/crypto/dpaa2_sec/hw/compat.h:63:0: note: this is the location of the previous definition
 #define pr_warn(fmt, ...) \
 ^
In file included from /tmp/UB1604_K4.4.0_GCC5.4.0/x86_64-native-linuxapp-gcc-shared/74427493f7bc49f9bc980a9c1db12576/dpdk/drivers/bus/dpaa/include/of.h:11:0,
                 from /tmp/UB1604_K4.4.0_GCC5.4.0/x86_64-native-linuxapp-gcc-shared/74427493f7bc49f9bc980a9c1db12576/dpdk/drivers/crypto/caam_jr/caam_jr.c:25:
/tmp/UB1604_K4.4.0_GCC5.4.0/x86_64-native-linuxapp-gcc-shared/74427493f7bc49f9bc980a9c1db12576/dpdk/drivers/bus/dpaa/include/compat.h:90:0: warning: "pr_debug" redefined
 #define pr_debug(fmt, args...) {}
 ^
In file included from /tmp/UB1604_K4.4.0_GCC5.4.0/x86_64-native-linuxapp-gcc-shared/74427493f7bc49f9bc980a9c1db12576/dpdk/drivers/crypto/dpaa2_sec/hw/desc.h:18:0,
                 from /tmp/UB1604_K4.4.0_GCC5.4.0/x86_64-native-linuxapp-gcc-shared/74427493f7bc49f9bc980a9c1db12576/dpdk/drivers/crypto/dpaa2_sec/hw/rta/sec_run_time_asm.h:11,
                 from /tmp/UB1604_K4.4.0_GCC5.4.0/x86_64-native-linuxapp-gcc-shared/74427493f7bc49f9bc980a9c1db12576/dpdk/drivers/crypto/dpaa2_sec/hw/rta.h:11,
--
/tmp/UB1604_K4.4.0_GCC5.4.0/x86_64-native-linuxapp-gcc-shared/74427493f7bc49f9bc980a9c1db12576/dpdk/drivers/crypto/dpaa2_sec/hw/compat.h:48:0: note: this is the location of the previous definition
 #define pr_debug(fmt, ...)     do { } while (0)
 ^
In file included from /tmp/UB1604_K4.4.0_GCC5.4.0/x86_64-native-linuxapp-gcc-shared/74427493f7bc49f9bc980a9c1db12576/dpdk/drivers/bus/dpaa/include/of.h:11:0,
                 from /tmp/UB1604_K4.4.0_GCC5.4.0/x86_64-native-linuxapp-gcc-shared/74427493f7bc49f9bc980a9c1db12576/dpdk/drivers/crypto/caam_jr/caam_jr.c:25:
/tmp/UB1604_K4.4.0_GCC5.4.0/x86_64-native-linuxapp-gcc-shared/74427493f7bc49f9bc980a9c1db12576/dpdk/drivers/bus/dpaa/include/compat.h:259:0: warning: "cpu_to_be32" redefined
 #define cpu_to_be32(x) rte_cpu_to_be_32(x)
 ^
In file included from /tmp/UB1604_K4.4.0_GCC5.4.0/x86_64-native-linuxapp-gcc-shared/74427493f7bc49f9bc980a9c1db12576/dpdk/drivers/crypto/dpaa2_sec/hw/desc.h:18:0,
                 from /tmp/UB1604_K4.4.0_GCC5.4.0/x86_64-native-linuxapp-gcc-shared/74427493f7bc49f9bc980a9c1db12576/dpdk/drivers/crypto/dpaa2_sec/hw/rta/sec_run_time_asm.h:11,
                 from /tmp/UB1604_K4.4.0_GCC5.4.0/x86_64-native-linuxapp-gcc-shared/74427493f7bc49f9bc980a9c1db12576/dpdk/drivers/crypto/dpaa2_sec/hw/rta.h:11,
--
                 from /tmp/UB1604_K4.4.0_GCC5.4.0/x86_64-native-linuxapp-gcc-shared/74427493f7bc49f9bc980a9c1db12576/dpdk/drivers/crypto/caam_jr/caam_jr.c:22:
/tmp/UB1604_K4.4.0_GCC5.4.0/x86_64-native-linuxapp-gcc-shared/74427493f7bc49f9bc980a9c1db12576/dpdk/drivers/crypto/dpaa2_sec/hw/compat.h:113:0: note: this is the location of the previous definition
    #define cpu_to_be32(x) swab32(x)
 ^
/tmp/UB1604_K4.4.0_GCC5.4.0/x86_64-native-linuxapp-gcc-shared/74427493f7bc49f9bc980a9c1db12576/dpdk/drivers/crypto/caam_jr/caam_jr.c: In function ‘caam_jr_prep_cdb’:
/tmp/UB1604_K4.4.0_GCC5.4.0/x86_64-native-linuxapp-gcc-shared/74427493f7bc49f9bc980a9c1db12576/dpdk/drivers/crypto/caam_jr/caam_jr.c:431:19: warning: passing argument 4 of ‘cnstr_shdsc_ipsec_new_encap’ makes pointer from integer without a cast [-Wint-conversion]
       true, swap, SHR_SERIAL,
                   ^
In file included from /tmp/UB1604_K4.4.0_GCC5.4.0/x86_64-native-linuxapp-gcc-shared/74427493f7bc49f9bc980a9c1db12576/dpdk/drivers/crypto/caam_jr/caam_jr.c:24:0:
/tmp/UB1604_K4.4.0_GCC5.4.0/x86_64-native-linuxapp-gcc-shared/74427493f7bc49f9bc980a9c1db12576/dpdk/drivers/crypto/dpaa2_sec/hw/desc/ipsec.h:1086:1: note: expected ‘struct ipsec_encap_pdb *’ but argument is of type ‘int’
 cnstr_shdsc_ipsec_new_encap(uint32_t *descbuf, bool ps,
 ^
/tmp/UB1604_K4.4.0_GCC5.4.0/x86_64-native-linuxapp-gcc-shared/74427493f7bc49f9bc980a9c1db12576/dpdk/drivers/crypto/caam_jr/caam_jr.c:432:7: warning: passing argument 5 of ‘cnstr_shdsc_ipsec_new_encap’ from incompatible pointer type [-Wincompatible-pointer-types]
       &ses->encap_pdb,
       ^
In file included from /tmp/UB1604_K4.4.0_GCC5.4.0/x86_64-native-linuxapp-gcc-shared/74427493f7bc49f9bc980a9c1db12576/dpdk/drivers/crypto/caam_jr/caam_jr.c:24:0:
/tmp/UB1604_K4.4.0_GCC5.4.0/x86_64-native-linuxapp-gcc-shared/74427493f7bc49f9bc980a9c1db12576/dpdk/drivers/crypto/dpaa2_sec/hw/desc/ipsec.h:1086:1: note: expected ‘uint8_t * {aka unsigned char *}’ but argument is of type ‘struct ipsec_encap_pdb *’
 cnstr_shdsc_ipsec_new_encap(uint32_t *descbuf, bool ps,
 ^
/tmp/UB1604_K4.4.0_GCC5.4.0/x86_64-native-linuxapp-gcc-shared/74427493f7bc49f9bc980a9c1db12576/dpdk/drivers/crypto/caam_jr/caam_jr.c:433:7: warning: passing argument 6 of ‘cnstr_shdsc_ipsec_new_encap’ from incompatible pointer type [-Wincompatible-pointer-types]
       (uint8_t *)&ses->ip4_hdr,
       ^
In file included from /tmp/UB1604_K4.4.0_GCC5.4.0/x86_64-native-linuxapp-gcc-shared/74427493f7bc49f9bc980a9c1db12576/dpdk/drivers/crypto/caam_jr/caam_jr.c:24:0:
/tmp/UB1604_K4.4.0_GCC5.4.0/x86_64-native-linuxapp-gcc-shared/74427493f7bc49f9bc980a9c1db12576/dpdk/drivers/crypto/dpaa2_sec/hw/desc/ipsec.h:1086:1: note: expected ‘struct alginfo *’ but argument is of type ‘uint8_t * {aka unsigned char *}’
 cnstr_shdsc_ipsec_new_encap(uint32_t *descbuf, bool ps,
 ^
/tmp/UB1604_K4.4.0_GCC5.4.0/x86_64-native-linuxapp-gcc-shared/74427493f7bc49f9bc980a9c1db12576/dpdk/drivers/crypto/caam_jr/caam_jr.c:429:23: error: too many arguments to function ‘cnstr_shdsc_ipsec_new_encap’
     shared_desc_len = cnstr_shdsc_ipsec_new_encap(
                       ^
In file included from /tmp/UB1604_K4.4.0_GCC5.4.0/x86_64-native-linuxapp-gcc-shared/74427493f7bc49f9bc980a9c1db12576/dpdk/drivers/crypto/caam_jr/caam_jr.c:24:0:
/tmp/UB1604_K4.4.0_GCC5.4.0/x86_64-native-linuxapp-gcc-shared/74427493f7bc49f9bc980a9c1db12576/dpdk/drivers/crypto/dpaa2_sec/hw/desc/ipsec.h:1086:1: note: declared here
 cnstr_shdsc_ipsec_new_encap(uint32_t *descbuf, bool ps,
 ^
/tmp/UB1604_K4.4.0_GCC5.4.0/x86_64-native-linuxapp-gcc-shared/74427493f7bc49f9bc980a9c1db12576/dpdk/drivers/crypto/caam_jr/caam_jr.c:438:19: warning: passing argument 4 of ‘cnstr_shdsc_ipsec_new_decap’ makes pointer from integer without a cast [-Wint-conversion]
       true, swap, SHR_SERIAL,
                   ^
In file included from /tmp/UB1604_K4.4.0_GCC5.4.0/x86_64-native-linuxapp-gcc-shared/74427493f7bc49f9bc980a9c1db12576/dpdk/drivers/crypto/caam_jr/caam_jr.c:24:0:
/tmp/UB1604_K4.4.0_GCC5.4.0/x86_64-native-linuxapp-gcc-shared/74427493f7bc49f9bc980a9c1db12576/dpdk/drivers/crypto/dpaa2_sec/hw/desc/ipsec.h:1189:1: note: expected ‘struct ipsec_decap_pdb *’ but argument is of type ‘int’
 cnstr_shdsc_ipsec_new_decap(uint32_t *descbuf, bool ps,
 ^
/tmp/UB1604_K4.4.0_GCC5.4.0/x86_64-native-linuxapp-gcc-shared/74427493f7bc49f9bc980a9c1db12576/dpdk/drivers/crypto/caam_jr/caam_jr.c:439:7: warning: passing argument 5 of ‘cnstr_shdsc_ipsec_new_decap’ from incompatible pointer type [-Wincompatible-pointer-types]
       &ses->decap_pdb,
       ^
In file included from /tmp/UB1604_K4.4.0_GCC5.4.0/x86_64-native-linuxapp-gcc-shared/74427493f7bc49f9bc980a9c1db12576/dpdk/drivers/crypto/caam_jr/caam_jr.c:24:0:
/tmp/UB1604_K4.4.0_GCC5.4.0/x86_64-native-linuxapp-gcc-shared/74427493f7bc49f9bc980a9c1db12576/dpdk/drivers/crypto/dpaa2_sec/hw/desc/ipsec.h:1189:1: note: expected ‘struct alginfo *’ but argument is of type ‘struct ipsec_decap_pdb *’
 cnstr_shdsc_ipsec_new_decap(uint32_t *descbuf, bool ps,
 ^
/tmp/UB1604_K4.4.0_GCC5.4.0/x86_64-native-linuxapp-gcc-shared/74427493f7bc49f9bc980a9c1db12576/dpdk/drivers/crypto/caam_jr/caam_jr.c:436:23: error: too many arguments to function ‘cnstr_shdsc_ipsec_new_decap’
     shared_desc_len = cnstr_shdsc_ipsec_new_decap(
                       ^
In file included from /tmp/UB1604_K4.4.0_GCC5.4.0/x86_64-native-linuxapp-gcc-shared/74427493f7bc49f9bc980a9c1db12576/dpdk/drivers/crypto/caam_jr/caam_jr.c:24:0:
/tmp/UB1604_K4.4.0_GCC5.4.0/x86_64-native-linuxapp-gcc-shared/74427493f7bc49f9bc980a9c1db12576/dpdk/drivers/crypto/dpaa2_sec/hw/desc/ipsec.h:1189:1: note: declared here
 cnstr_shdsc_ipsec_new_decap(uint32_t *descbuf, bool ps,
 ^
/tmp/UB1604_K4.4.0_GCC5.4.0/x86_64-native-linuxapp-gcc-shared/74427493f7bc49f9bc980a9c1db12576/dpdk/mk/internal/rte.compile-pre.mk:114: recipe for target 'caam_jr.o' failed
make[6]: *** [caam_jr.o] Error 1
/tmp/UB1604_K4.4.0_GCC5.4.0/x86_64-native-linuxapp-gcc-shared/74427493f7bc49f9bc980a9c1db12576/dpdk/mk/rte.subdir.mk:35: recipe for target 'caam_jr' failed
make[5]: *** [caam_jr] Error 2
/tmp/UB1604_K4.4.0_GCC5.4.0/x86_64-native-linuxapp-gcc-shared/74427493f7bc49f9bc980a9c1db12576/dpdk/mk/rte.subdir.mk:35: recipe for target 'crypto' failed
make[4]: *** [crypto] Error 2
make[4]: *** Waiting for unfinished jobs....
== Build drivers/net/avf
  CC avf_adminq.o
  CC ark_ethdev_tx.o
--
  PMDINFO ifcvf_vdpa.o.pmd.c
  CC ifcvf_vdpa.o.pmd.o
  LD ifcvf_vdpa.o
  LD librte_pmd_ifc.so.1.1
  INSTALL-LIB librte_pmd_ifc.so.1.1
/tmp/UB1604_K4.4.0_GCC5.4.0/x86_64-native-linuxapp-gcc-shared/74427493f7bc49f9bc980a9c1db12576/dpdk/mk/rte.sdkbuild.mk:49: recipe for target 'drivers' failed
make[3]: *** [drivers] Error 2
/tmp/UB1604_K4.4.0_GCC5.4.0/x86_64-native-linuxapp-gcc-shared/74427493f7bc49f9bc980a9c1db12576/dpdk/mk/rte.sdkroot.mk:100: recipe for target 'all' failed
make[2]: *** [all] Error 2
/tmp/UB1604_K4.4.0_GCC5.4.0/x86_64-native-linuxapp-gcc-shared/74427493f7bc49f9bc980a9c1db12576/dpdk/mk/rte.sdkinstall.mk:57: recipe for target 'pre_install' failed
make[1]: *** [pre_install] Error 2
/tmp/UB1604_K4.4.0_GCC5.4.0/x86_64-native-linuxapp-gcc-shared/74427493f7bc49f9bc980a9c1db12576/dpdk/mk/rte.sdkroot.mk:79: recipe for target 'install' failed
make: *** [install] Error 2

*Failed Build #10:
OS: FC24
Target: i686-native-linuxapp-gcc
  LD ark_ethdev.o
  CC ark_ethdev_rx.o
  CC caam_jr.o
In file included from /tmp/FC24_K4.5.5_GCC6.1.1/i686-native-linuxapp-gcc/74427493f7bc49f9bc980a9c1db12576/dpdk/drivers/bus/dpaa/include/of.h:11:0,
                 from /tmp/FC24_K4.5.5_GCC6.1.1/i686-native-linuxapp-gcc/74427493f7bc49f9bc980a9c1db12576/dpdk/drivers/crypto/caam_jr/caam_jr.c:25:
/tmp/FC24_K4.5.5_GCC6.1.1/i686-native-linuxapp-gcc/74427493f7bc49f9bc980a9c1db12576/dpdk/drivers/bus/dpaa/include/compat.h:80:0: warning: "pr_err" redefined
 #define pr_err(fmt, args...)  prflush("ERR:" fmt, ##args)
 
In file included from /tmp/FC24_K4.5.5_GCC6.1.1/i686-native-linuxapp-gcc/74427493f7bc49f9bc980a9c1db12576/dpdk/drivers/crypto/dpaa2_sec/hw/desc.h:18:0,
                 from /tmp/FC24_K4.5.5_GCC6.1.1/i686-native-linuxapp-gcc/74427493f7bc49f9bc980a9c1db12576/dpdk/drivers/crypto/dpaa2_sec/hw/rta/sec_run_time_asm.h:11,
                 from /tmp/FC24_K4.5.5_GCC6.1.1/i686-native-linuxapp-gcc/74427493f7bc49f9bc980a9c1db12576/dpdk/drivers/crypto/dpaa2_sec/hw/rta.h:11,
--
/tmp/FC24_K4.5.5_GCC6.1.1/i686-native-linuxapp-gcc/74427493f7bc49f9bc980a9c1db12576/dpdk/drivers/crypto/dpaa2_sec/hw/compat.h:54:0: note: this is the location of the previous definition
 #define pr_err(fmt, ...) \
 
In file included from /tmp/FC24_K4.5.5_GCC6.1.1/i686-native-linuxapp-gcc/74427493f7bc49f9bc980a9c1db12576/dpdk/drivers/bus/dpaa/include/of.h:11:0,
                 from /tmp/FC24_K4.5.5_GCC6.1.1/i686-native-linuxapp-gcc/74427493f7bc49f9bc980a9c1db12576/dpdk/drivers/crypto/caam_jr/caam_jr.c:25:
/tmp/FC24_K4.5.5_GCC6.1.1/i686-native-linuxapp-gcc/74427493f7bc49f9bc980a9c1db12576/dpdk/drivers/bus/dpaa/include/compat.h:81:0: warning: "pr_warn" redefined
 #define pr_warn(fmt, args...)  prflush("WARN:" fmt, ##args)
 
In file included from /tmp/FC24_K4.5.5_GCC6.1.1/i686-native-linuxapp-gcc/74427493f7bc49f9bc980a9c1db12576/dpdk/drivers/crypto/dpaa2_sec/hw/desc.h:18:0,
                 from /tmp/FC24_K4.5.5_GCC6.1.1/i686-native-linuxapp-gcc/74427493f7bc49f9bc980a9c1db12576/dpdk/drivers/crypto/dpaa2_sec/hw/rta/sec_run_time_asm.h:11,
                 from /tmp/FC24_K4.5.5_GCC6.1.1/i686-native-linuxapp-gcc/74427493f7bc49f9bc980a9c1db12576/dpdk/drivers/crypto/dpaa2_sec/hw/rta.h:11,
--
/tmp/FC24_K4.5.5_GCC6.1.1/i686-native-linuxapp-gcc/74427493f7bc49f9bc980a9c1db12576/dpdk/drivers/crypto/dpaa2_sec/hw/compat.h:63:0: note: this is the location of the previous definition
 #define pr_warn(fmt, ...) \
 
In file included from /tmp/FC24_K4.5.5_GCC6.1.1/i686-native-linuxapp-gcc/74427493f7bc49f9bc980a9c1db12576/dpdk/drivers/bus/dpaa/include/of.h:11:0,
                 from /tmp/FC24_K4.5.5_GCC6.1.1/i686-native-linuxapp-gcc/74427493f7bc49f9bc980a9c1db12576/dpdk/drivers/crypto/caam_jr/caam_jr.c:25:
/tmp/FC24_K4.5.5_GCC6.1.1/i686-native-linuxapp-gcc/74427493f7bc49f9bc980a9c1db12576/dpdk/drivers/bus/dpaa/include/compat.h:90:0: warning: "pr_debug" redefined
 #define pr_debug(fmt, args...) {}
 
In file included from /tmp/FC24_K4.5.5_GCC6.1.1/i686-native-linuxapp-gcc/74427493f7bc49f9bc980a9c1db12576/dpdk/drivers/crypto/dpaa2_sec/hw/desc.h:18:0,
                 from /tmp/FC24_K4.5.5_GCC6.1.1/i686-native-linuxapp-gcc/74427493f7bc49f9bc980a9c1db12576/dpdk/drivers/crypto/dpaa2_sec/hw/rta/sec_run_time_asm.h:11,
                 from /tmp/FC24_K4.5.5_GCC6.1.1/i686-native-linuxapp-gcc/74427493f7bc49f9bc980a9c1db12576/dpdk/drivers/crypto/dpaa2_sec/hw/rta.h:11,
--
/tmp/FC24_K4.5.5_GCC6.1.1/i686-native-linuxapp-gcc/74427493f7bc49f9bc980a9c1db12576/dpdk/drivers/crypto/dpaa2_sec/hw/compat.h:48:0: note: this is the location of the previous definition
 #define pr_debug(fmt, ...)     do { } while (0)
 
In file included from /tmp/FC24_K4.5.5_GCC6.1.1/i686-native-linuxapp-gcc/74427493f7bc49f9bc980a9c1db12576/dpdk/drivers/bus/dpaa/include/of.h:11:0,
                 from /tmp/FC24_K4.5.5_GCC6.1.1/i686-native-linuxapp-gcc/74427493f7bc49f9bc980a9c1db12576/dpdk/drivers/crypto/caam_jr/caam_jr.c:25:
/tmp/FC24_K4.5.5_GCC6.1.1/i686-native-linuxapp-gcc/74427493f7bc49f9bc980a9c1db12576/dpdk/drivers/bus/dpaa/include/compat.h:259:0: warning: "cpu_to_be32" redefined
 #define cpu_to_be32(x) rte_cpu_to_be_32(x)
 
In file included from /tmp/FC24_K4.5.5_GCC6.1.1/i686-native-linuxapp-gcc/74427493f7bc49f9bc980a9c1db12576/dpdk/drivers/crypto/dpaa2_sec/hw/desc.h:18:0,
                 from /tmp/FC24_K4.5.5_GCC6.1.1/i686-native-linuxapp-gcc/74427493f7bc49f9bc980a9c1db12576/dpdk/drivers/crypto/dpaa2_sec/hw/rta/sec_run_time_asm.h:11,
                 from /tmp/FC24_K4.5.5_GCC6.1.1/i686-native-linuxapp-gcc/74427493f7bc49f9bc980a9c1db12576/dpdk/drivers/crypto/dpaa2_sec/hw/rta.h:11,
--
                 from /tmp/FC24_K4.5.5_GCC6.1.1/i686-native-linuxapp-gcc/74427493f7bc49f9bc980a9c1db12576/dpdk/drivers/crypto/caam_jr/caam_jr.c:22:
/tmp/FC24_K4.5.5_GCC6.1.1/i686-native-linuxapp-gcc/74427493f7bc49f9bc980a9c1db12576/dpdk/drivers/crypto/dpaa2_sec/hw/compat.h:113:0: note: this is the location of the previous definition
    #define cpu_to_be32(x) swab32(x)
 
/tmp/FC24_K4.5.5_GCC6.1.1/i686-native-linuxapp-gcc/74427493f7bc49f9bc980a9c1db12576/dpdk/drivers/crypto/caam_jr/caam_jr.c: In function ‘caam_jr_prep_cdb’:
/tmp/FC24_K4.5.5_GCC6.1.1/i686-native-linuxapp-gcc/74427493f7bc49f9bc980a9c1db12576/dpdk/drivers/crypto/caam_jr/caam_jr.c:431:19: warning: passing argument 4 of ‘cnstr_shdsc_ipsec_new_encap’ makes pointer from integer without a cast [-Wint-conversion]
       true, swap, SHR_SERIAL,
                   ^~~~~~~~~~
In file included from /tmp/FC24_K4.5.5_GCC6.1.1/i686-native-linuxapp-gcc/74427493f7bc49f9bc980a9c1db12576/dpdk/drivers/crypto/caam_jr/caam_jr.c:24:0:
/tmp/FC24_K4.5.5_GCC6.1.1/i686-native-linuxapp-gcc/74427493f7bc49f9bc980a9c1db12576/dpdk/drivers/crypto/dpaa2_sec/hw/desc/ipsec.h:1086:1: note: expected ‘struct ipsec_encap_pdb *’ but argument is of type ‘int’
 cnstr_shdsc_ipsec_new_encap(uint32_t *descbuf, bool ps,
 ^~~~~~~~~~~~~~~~~~~~~~~~~~~
/tmp/FC24_K4.5.5_GCC6.1.1/i686-native-linuxapp-gcc/74427493f7bc49f9bc980a9c1db12576/dpdk/drivers/crypto/caam_jr/caam_jr.c:432:7: warning: passing argument 5 of ‘cnstr_shdsc_ipsec_new_encap’ from incompatible pointer type [-Wincompatible-pointer-types]
       &ses->encap_pdb,
       ^
In file included from /tmp/FC24_K4.5.5_GCC6.1.1/i686-native-linuxapp-gcc/74427493f7bc49f9bc980a9c1db12576/dpdk/drivers/crypto/caam_jr/caam_jr.c:24:0:
/tmp/FC24_K4.5.5_GCC6.1.1/i686-native-linuxapp-gcc/74427493f7bc49f9bc980a9c1db12576/dpdk/drivers/crypto/dpaa2_sec/hw/desc/ipsec.h:1086:1: note: expected ‘uint8_t * {aka unsigned char *}’ but argument is of type ‘struct ipsec_encap_pdb *’
 cnstr_shdsc_ipsec_new_encap(uint32_t *descbuf, bool ps,
 ^~~~~~~~~~~~~~~~~~~~~~~~~~~
/tmp/FC24_K4.5.5_GCC6.1.1/i686-native-linuxapp-gcc/74427493f7bc49f9bc980a9c1db12576/dpdk/drivers/crypto/caam_jr/caam_jr.c:433:7: warning: passing argument 6 of ‘cnstr_shdsc_ipsec_new_encap’ from incompatible pointer type [-Wincompatible-pointer-types]
       (uint8_t *)&ses->ip4_hdr,
       ^
In file included from /tmp/FC24_K4.5.5_GCC6.1.1/i686-native-linuxapp-gcc/74427493f7bc49f9bc980a9c1db12576/dpdk/drivers/crypto/caam_jr/caam_jr.c:24:0:
/tmp/FC24_K4.5.5_GCC6.1.1/i686-native-linuxapp-gcc/74427493f7bc49f9bc980a9c1db12576/dpdk/drivers/crypto/dpaa2_sec/hw/desc/ipsec.h:1086:1: note: expected ‘struct alginfo *’ but argument is of type ‘uint8_t * {aka unsigned char *}’
 cnstr_shdsc_ipsec_new_encap(uint32_t *descbuf, bool ps,
 ^~~~~~~~~~~~~~~~~~~~~~~~~~~
/tmp/FC24_K4.5.5_GCC6.1.1/i686-native-linuxapp-gcc/74427493f7bc49f9bc980a9c1db12576/dpdk/drivers/crypto/caam_jr/caam_jr.c:429:23: error: too many arguments to function ‘cnstr_shdsc_ipsec_new_encap’
     shared_desc_len = cnstr_shdsc_ipsec_new_encap(
                       ^~~~~~~~~~~~~~~~~~~~~~~~~~~
In file included from /tmp/FC24_K4.5.5_GCC6.1.1/i686-native-linuxapp-gcc/74427493f7bc49f9bc980a9c1db12576/dpdk/drivers/crypto/caam_jr/caam_jr.c:24:0:
/tmp/FC24_K4.5.5_GCC6.1.1/i686-native-linuxapp-gcc/74427493f7bc49f9bc980a9c1db12576/dpdk/drivers/crypto/dpaa2_sec/hw/desc/ipsec.h:1086:1: note: declared here
 cnstr_shdsc_ipsec_new_encap(uint32_t *descbuf, bool ps,
 ^~~~~~~~~~~~~~~~~~~~~~~~~~~
/tmp/FC24_K4.5.5_GCC6.1.1/i686-native-linuxapp-gcc/74427493f7bc49f9bc980a9c1db12576/dpdk/drivers/crypto/caam_jr/caam_jr.c:438:19: warning: passing argument 4 of ‘cnstr_shdsc_ipsec_new_decap’ makes pointer from integer without a cast [-Wint-conversion]
       true, swap, SHR_SERIAL,
                   ^~~~~~~~~~
In file included from /tmp/FC24_K4.5.5_GCC6.1.1/i686-native-linuxapp-gcc/74427493f7bc49f9bc980a9c1db12576/dpdk/drivers/crypto/caam_jr/caam_jr.c:24:0:
/tmp/FC24_K4.5.5_GCC6.1.1/i686-native-linuxapp-gcc/74427493f7bc49f9bc980a9c1db12576/dpdk/drivers/crypto/dpaa2_sec/hw/desc/ipsec.h:1189:1: note: expected ‘struct ipsec_decap_pdb *’ but argument is of type ‘int’
 cnstr_shdsc_ipsec_new_decap(uint32_t *descbuf, bool ps,
 ^~~~~~~~~~~~~~~~~~~~~~~~~~~
/tmp/FC24_K4.5.5_GCC6.1.1/i686-native-linuxapp-gcc/74427493f7bc49f9bc980a9c1db12576/dpdk/drivers/crypto/caam_jr/caam_jr.c:439:7: warning: passing argument 5 of ‘cnstr_shdsc_ipsec_new_decap’ from incompatible pointer type [-Wincompatible-pointer-types]
       &ses->decap_pdb,
       ^
In file included from /tmp/FC24_K4.5.5_GCC6.1.1/i686-native-linuxapp-gcc/74427493f7bc49f9bc980a9c1db12576/dpdk/drivers/crypto/caam_jr/caam_jr.c:24:0:
/tmp/FC24_K4.5.5_GCC6.1.1/i686-native-linuxapp-gcc/74427493f7bc49f9bc980a9c1db12576/dpdk/drivers/crypto/dpaa2_sec/hw/desc/ipsec.h:1189:1: note: expected ‘struct alginfo *’ but argument is of type ‘struct ipsec_decap_pdb *’
 cnstr_shdsc_ipsec_new_decap(uint32_t *descbuf, bool ps,
 ^~~~~~~~~~~~~~~~~~~~~~~~~~~
/tmp/FC24_K4.5.5_GCC6.1.1/i686-native-linuxapp-gcc/74427493f7bc49f9bc980a9c1db12576/dpdk/drivers/crypto/caam_jr/caam_jr.c:436:23: error: too many arguments to function ‘cnstr_shdsc_ipsec_new_decap’
     shared_desc_len = cnstr_shdsc_ipsec_new_decap(
                       ^~~~~~~~~~~~~~~~~~~~~~~~~~~
In file included from /tmp/FC24_K4.5.5_GCC6.1.1/i686-native-linuxapp-gcc/74427493f7bc49f9bc980a9c1db12576/dpdk/drivers/crypto/caam_jr/caam_jr.c:24:0:
/tmp/FC24_K4.5.5_GCC6.1.1/i686-native-linuxapp-gcc/74427493f7bc49f9bc980a9c1db12576/dpdk/drivers/crypto/dpaa2_sec/hw/desc/ipsec.h:1189:1: note: declared here
 cnstr_shdsc_ipsec_new_decap(uint32_t *descbuf, bool ps,
 ^~~~~~~~~~~~~~~~~~~~~~~~~~~
/tmp/FC24_K4.5.5_GCC6.1.1/i686-native-linuxapp-gcc/74427493f7bc49f9bc980a9c1db12576/dpdk/mk/internal/rte.compile-pre.mk:114: recipe for target 'caam_jr.o' failed
make[6]: *** [caam_jr.o] Error 1
/tmp/FC24_K4.5.5_GCC6.1.1/i686-native-linuxapp-gcc/74427493f7bc49f9bc980a9c1db12576/dpdk/mk/rte.subdir.mk:35: recipe for target 'caam_jr' failed
make[5]: *** [caam_jr] Error 2
/tmp/FC24_K4.5.5_GCC6.1.1/i686-native-linuxapp-gcc/74427493f7bc49f9bc980a9c1db12576/dpdk/mk/rte.subdir.mk:35: recipe for target 'crypto' failed
make[4]: *** [crypto] Error 2
make[4]: *** Waiting for unfinished jobs....
== Build drivers/net/avf
  CC avf_adminq.o
  CC ark_ethdev_tx.o
--
  CC rte_eth_softnic_cli.o
  CC parser.o
  CC conn.o
  AR librte_pmd_softnic.a
  INSTALL-LIB librte_pmd_softnic.a
/tmp/FC24_K4.5.5_GCC6.1.1/i686-native-linuxapp-gcc/74427493f7bc49f9bc980a9c1db12576/dpdk/mk/rte.sdkbuild.mk:49: recipe for target 'drivers' failed
make[3]: *** [drivers] Error 2
/tmp/FC24_K4.5.5_GCC6.1.1/i686-native-linuxapp-gcc/74427493f7bc49f9bc980a9c1db12576/dpdk/mk/rte.sdkroot.mk:100: recipe for target 'all' failed
make[2]: *** [all] Error 2
/tmp/FC24_K4.5.5_GCC6.1.1/i686-native-linuxapp-gcc/74427493f7bc49f9bc980a9c1db12576/dpdk/mk/rte.sdkinstall.mk:57: recipe for target 'pre_install' failed
make[1]: *** [pre_install] Error 2
/tmp/FC24_K4.5.5_GCC6.1.1/i686-native-linuxapp-gcc/74427493f7bc49f9bc980a9c1db12576/dpdk/mk/rte.sdkroot.mk:79: recipe for target 'install' failed
make: *** [install] Error 2

*Failed Build #11:
OS: FC24
Target: x86_64-native-linuxapp-clang
  CC ark_ethdev_rx.o
  CC caam_jr.o
  CC ark_ethdev_tx.o
In file included from /tmp/FC24_K4.9.13_GCC6.2.1/x86_64-native-linuxapp-clang/74427493f7bc49f9bc980a9c1db12576/dpdk/drivers/crypto/caam_jr/caam_jr.c:25:
In file included from /tmp/FC24_K4.9.13_GCC6.2.1/x86_64-native-linuxapp-clang/74427493f7bc49f9bc980a9c1db12576/dpdk/drivers/bus/dpaa/include/of.h:11:
/tmp/FC24_K4.9.13_GCC6.2.1/x86_64-native-linuxapp-clang/74427493f7bc49f9bc980a9c1db12576/dpdk/drivers/bus/dpaa/include/compat.h:80:9: warning: 'pr_err' macro redefined [-Wmacro-redefined]
#define pr_err(fmt, args...)     prflush("ERR:" fmt, ##args)
        ^
/tmp/FC24_K4.9.13_GCC6.2.1/x86_64-native-linuxapp-clang/74427493f7bc49f9bc980a9c1db12576/dpdk/drivers/crypto/dpaa2_sec/hw/compat.h:54:9: note: previous definition is here
#define pr_err(fmt, ...) \
        ^
In file included from /tmp/FC24_K4.9.13_GCC6.2.1/x86_64-native-linuxapp-clang/74427493f7bc49f9bc980a9c1db12576/dpdk/drivers/crypto/caam_jr/caam_jr.c:25:
In file included from /tmp/FC24_K4.9.13_GCC6.2.1/x86_64-native-linuxapp-clang/74427493f7bc49f9bc980a9c1db12576/dpdk/drivers/bus/dpaa/include/of.h:11:
/tmp/FC24_K4.9.13_GCC6.2.1/x86_64-native-linuxapp-clang/74427493f7bc49f9bc980a9c1db12576/dpdk/drivers/bus/dpaa/include/compat.h:81:9: warning: 'pr_warn' macro redefined [-Wmacro-redefined]
#define pr_warn(fmt, args...)    prflush("WARN:" fmt, ##args)
        ^
/tmp/FC24_K4.9.13_GCC6.2.1/x86_64-native-linuxapp-clang/74427493f7bc49f9bc980a9c1db12576/dpdk/drivers/crypto/dpaa2_sec/hw/compat.h:63:9: note: previous definition is here
#define pr_warn(fmt, ...) \
        ^
In file included from /tmp/FC24_K4.9.13_GCC6.2.1/x86_64-native-linuxapp-clang/74427493f7bc49f9bc980a9c1db12576/dpdk/drivers/crypto/caam_jr/caam_jr.c:25:
In file included from /tmp/FC24_K4.9.13_GCC6.2.1/x86_64-native-linuxapp-clang/74427493f7bc49f9bc980a9c1db12576/dpdk/drivers/bus/dpaa/include/of.h:11:
/tmp/FC24_K4.9.13_GCC6.2.1/x86_64-native-linuxapp-clang/74427493f7bc49f9bc980a9c1db12576/dpdk/drivers/bus/dpaa/include/compat.h:90:9: warning: 'pr_debug' macro redefined [-Wmacro-redefined]
#define pr_debug(fmt, args...) {}
        ^
/tmp/FC24_K4.9.13_GCC6.2.1/x86_64-native-linuxapp-clang/74427493f7bc49f9bc980a9c1db12576/dpdk/drivers/crypto/dpaa2_sec/hw/compat.h:48:9: note: previous definition is here
#define pr_debug(fmt, ...)     do { } while (0)
        ^
In file included from /tmp/FC24_K4.9.13_GCC6.2.1/x86_64-native-linuxapp-clang/74427493f7bc49f9bc980a9c1db12576/dpdk/drivers/crypto/caam_jr/caam_jr.c:25:
In file included from /tmp/FC24_K4.9.13_GCC6.2.1/x86_64-native-linuxapp-clang/74427493f7bc49f9bc980a9c1db12576/dpdk/drivers/bus/dpaa/include/of.h:11:
/tmp/FC24_K4.9.13_GCC6.2.1/x86_64-native-linuxapp-clang/74427493f7bc49f9bc980a9c1db12576/dpdk/drivers/bus/dpaa/include/compat.h:259:9: warning: 'cpu_to_be32' macro redefined [-Wmacro-redefined]
#define cpu_to_be32(x) rte_cpu_to_be_32(x)
        ^
/tmp/FC24_K4.9.13_GCC6.2.1/x86_64-native-linuxapp-clang/74427493f7bc49f9bc980a9c1db12576/dpdk/drivers/crypto/dpaa2_sec/hw/compat.h:113:12: note: previous definition is here
                        #define cpu_to_be32(x)  swab32(x)
                                ^
/tmp/FC24_K4.9.13_GCC6.2.1/x86_64-native-linuxapp-clang/74427493f7bc49f9bc980a9c1db12576/dpdk/drivers/crypto/caam_jr/caam_jr.c:434:19: error: too many arguments to function call, expected 7, have 8
                                                &alginfo_c, &alginfo_a);
                                                            ^~~~~~~~~~
/tmp/FC24_K4.9.13_GCC6.2.1/x86_64-native-linuxapp-clang/74427493f7bc49f9bc980a9c1db12576/dpdk/drivers/crypto/dpaa2_sec/hw/desc/ipsec.h:1085:1: note: 'cnstr_shdsc_ipsec_new_encap' declared here
static inline int
^
/tmp/FC24_K4.9.13_GCC6.2.1/x86_64-native-linuxapp-clang/74427493f7bc49f9bc980a9c1db12576/dpdk/drivers/crypto/caam_jr/caam_jr.c:440:19: error: too many arguments to function call, expected 6, have 7
                                                &alginfo_c, &alginfo_a);
                                                            ^~~~~~~~~~
/tmp/FC24_K4.9.13_GCC6.2.1/x86_64-native-linuxapp-clang/74427493f7bc49f9bc980a9c1db12576/dpdk/drivers/crypto/dpaa2_sec/hw/desc/ipsec.h:1188:1: note: 'cnstr_shdsc_ipsec_new_decap' declared here
static inline int
^
4 warnings and 2 errors generated.
/tmp/FC24_K4.9.13_GCC6.2.1/x86_64-native-linuxapp-clang/74427493f7bc49f9bc980a9c1db12576/dpdk/mk/internal/rte.compile-pre.mk:114: recipe for target 'caam_jr.o' failed
make[6]: *** [caam_jr.o] Error 1
/tmp/FC24_K4.9.13_GCC6.2.1/x86_64-native-linuxapp-clang/74427493f7bc49f9bc980a9c1db12576/dpdk/mk/rte.subdir.mk:35: recipe for target 'caam_jr' failed
make[5]: *** [caam_jr] Error 2
/tmp/FC24_K4.9.13_GCC6.2.1/x86_64-native-linuxapp-clang/74427493f7bc49f9bc980a9c1db12576/dpdk/mk/rte.subdir.mk:35: recipe for target 'crypto' failed
make[4]: *** [crypto] Error 2
make[4]: *** Waiting for unfinished jobs....
  CC ark_mpu.o
  CC ark_pktchkr.o
  CC ark_pktdir.o
--
  CC rte_eth_softnic_cli.o
  CC parser.o
  CC conn.o
  AR librte_pmd_softnic.a
  INSTALL-LIB librte_pmd_softnic.a
/tmp/FC24_K4.9.13_GCC6.2.1/x86_64-native-linuxapp-clang/74427493f7bc49f9bc980a9c1db12576/dpdk/mk/rte.sdkbuild.mk:49: recipe for target 'drivers' failed
make[3]: *** [drivers] Error 2
/tmp/FC24_K4.9.13_GCC6.2.1/x86_64-native-linuxapp-clang/74427493f7bc49f9bc980a9c1db12576/dpdk/mk/rte.sdkroot.mk:100: recipe for target 'all' failed
make[2]: *** [all] Error 2
/tmp/FC24_K4.9.13_GCC6.2.1/x86_64-native-linuxapp-clang/74427493f7bc49f9bc980a9c1db12576/dpdk/mk/rte.sdkinstall.mk:57: recipe for target 'pre_install' failed
make[1]: *** [pre_install] Error 2
/tmp/FC24_K4.9.13_GCC6.2.1/x86_64-native-linuxapp-clang/74427493f7bc49f9bc980a9c1db12576/dpdk/mk/rte.sdkroot.mk:79: recipe for target 'install' failed
make: *** [install] Error 2

*Failed Build #12:
OS: FC25
Target: x86_64-native-linuxapp-gcc-debug
  CC caam_jr_uio.o
  CC caam_jr.o
  CC ark_ethdev_tx.o
In file included from /tmp/FC25_K4.8.6_GCC6.3.1/x86_64-native-linuxapp-gcc-debug/74427493f7bc49f9bc980a9c1db12576/dpdk/drivers/bus/dpaa/include/of.h:11:0,
                 from /tmp/FC25_K4.8.6_GCC6.3.1/x86_64-native-linuxapp-gcc-debug/74427493f7bc49f9bc980a9c1db12576/dpdk/drivers/crypto/caam_jr/caam_jr.c:25:
/tmp/FC25_K4.8.6_GCC6.3.1/x86_64-native-linuxapp-gcc-debug/74427493f7bc49f9bc980a9c1db12576/dpdk/drivers/bus/dpaa/include/compat.h:80:0: warning: "pr_err" redefined
 #define pr_err(fmt, args...)  prflush("ERR:" fmt, ##args)
 
In file included from /tmp/FC25_K4.8.6_GCC6.3.1/x86_64-native-linuxapp-gcc-debug/74427493f7bc49f9bc980a9c1db12576/dpdk/drivers/crypto/dpaa2_sec/hw/desc.h:18:0,
                 from /tmp/FC25_K4.8.6_GCC6.3.1/x86_64-native-linuxapp-gcc-debug/74427493f7bc49f9bc980a9c1db12576/dpdk/drivers/crypto/dpaa2_sec/hw/rta/sec_run_time_asm.h:11,
                 from /tmp/FC25_K4.8.6_GCC6.3.1/x86_64-native-linuxapp-gcc-debug/74427493f7bc49f9bc980a9c1db12576/dpdk/drivers/crypto/dpaa2_sec/hw/rta.h:11,
--
/tmp/FC25_K4.8.6_GCC6.3.1/x86_64-native-linuxapp-gcc-debug/74427493f7bc49f9bc980a9c1db12576/dpdk/drivers/crypto/dpaa2_sec/hw/compat.h:54:0: note: this is the location of the previous definition
 #define pr_err(fmt, ...) \
 
In file included from /tmp/FC25_K4.8.6_GCC6.3.1/x86_64-native-linuxapp-gcc-debug/74427493f7bc49f9bc980a9c1db12576/dpdk/drivers/bus/dpaa/include/of.h:11:0,
                 from /tmp/FC25_K4.8.6_GCC6.3.1/x86_64-native-linuxapp-gcc-debug/74427493f7bc49f9bc980a9c1db12576/dpdk/drivers/crypto/caam_jr/caam_jr.c:25:
/tmp/FC25_K4.8.6_GCC6.3.1/x86_64-native-linuxapp-gcc-debug/74427493f7bc49f9bc980a9c1db12576/dpdk/drivers/bus/dpaa/include/compat.h:81:0: warning: "pr_warn" redefined
 #define pr_warn(fmt, args...)  prflush("WARN:" fmt, ##args)
 
In file included from /tmp/FC25_K4.8.6_GCC6.3.1/x86_64-native-linuxapp-gcc-debug/74427493f7bc49f9bc980a9c1db12576/dpdk/drivers/crypto/dpaa2_sec/hw/desc.h:18:0,
                 from /tmp/FC25_K4.8.6_GCC6.3.1/x86_64-native-linuxapp-gcc-debug/74427493f7bc49f9bc980a9c1db12576/dpdk/drivers/crypto/dpaa2_sec/hw/rta/sec_run_time_asm.h:11,
                 from /tmp/FC25_K4.8.6_GCC6.3.1/x86_64-native-linuxapp-gcc-debug/74427493f7bc49f9bc980a9c1db12576/dpdk/drivers/crypto/dpaa2_sec/hw/rta.h:11,
--
/tmp/FC25_K4.8.6_GCC6.3.1/x86_64-native-linuxapp-gcc-debug/74427493f7bc49f9bc980a9c1db12576/dpdk/drivers/crypto/dpaa2_sec/hw/compat.h:63:0: note: this is the location of the previous definition
 #define pr_warn(fmt, ...) \
 
In file included from /tmp/FC25_K4.8.6_GCC6.3.1/x86_64-native-linuxapp-gcc-debug/74427493f7bc49f9bc980a9c1db12576/dpdk/drivers/bus/dpaa/include/of.h:11:0,
                 from /tmp/FC25_K4.8.6_GCC6.3.1/x86_64-native-linuxapp-gcc-debug/74427493f7bc49f9bc980a9c1db12576/dpdk/drivers/crypto/caam_jr/caam_jr.c:25:
/tmp/FC25_K4.8.6_GCC6.3.1/x86_64-native-linuxapp-gcc-debug/74427493f7bc49f9bc980a9c1db12576/dpdk/drivers/bus/dpaa/include/compat.h:90:0: warning: "pr_debug" redefined
 #define pr_debug(fmt, args...) {}
 
In file included from /tmp/FC25_K4.8.6_GCC6.3.1/x86_64-native-linuxapp-gcc-debug/74427493f7bc49f9bc980a9c1db12576/dpdk/drivers/crypto/dpaa2_sec/hw/desc.h:18:0,
                 from /tmp/FC25_K4.8.6_GCC6.3.1/x86_64-native-linuxapp-gcc-debug/74427493f7bc49f9bc980a9c1db12576/dpdk/drivers/crypto/dpaa2_sec/hw/rta/sec_run_time_asm.h:11,
                 from /tmp/FC25_K4.8.6_GCC6.3.1/x86_64-native-linuxapp-gcc-debug/74427493f7bc49f9bc980a9c1db12576/dpdk/drivers/crypto/dpaa2_sec/hw/rta.h:11,
--
/tmp/FC25_K4.8.6_GCC6.3.1/x86_64-native-linuxapp-gcc-debug/74427493f7bc49f9bc980a9c1db12576/dpdk/drivers/crypto/dpaa2_sec/hw/compat.h:48:0: note: this is the location of the previous definition
 #define pr_debug(fmt, ...)     do { } while (0)
 
In file included from /tmp/FC25_K4.8.6_GCC6.3.1/x86_64-native-linuxapp-gcc-debug/74427493f7bc49f9bc980a9c1db12576/dpdk/drivers/bus/dpaa/include/of.h:11:0,
                 from /tmp/FC25_K4.8.6_GCC6.3.1/x86_64-native-linuxapp-gcc-debug/74427493f7bc49f9bc980a9c1db12576/dpdk/drivers/crypto/caam_jr/caam_jr.c:25:
/tmp/FC25_K4.8.6_GCC6.3.1/x86_64-native-linuxapp-gcc-debug/74427493f7bc49f9bc980a9c1db12576/dpdk/drivers/bus/dpaa/include/compat.h:259:0: warning: "cpu_to_be32" redefined
 #define cpu_to_be32(x) rte_cpu_to_be_32(x)
 
In file included from /tmp/FC25_K4.8.6_GCC6.3.1/x86_64-native-linuxapp-gcc-debug/74427493f7bc49f9bc980a9c1db12576/dpdk/drivers/crypto/dpaa2_sec/hw/desc.h:18:0,
                 from /tmp/FC25_K4.8.6_GCC6.3.1/x86_64-native-linuxapp-gcc-debug/74427493f7bc49f9bc980a9c1db12576/dpdk/drivers/crypto/dpaa2_sec/hw/rta/sec_run_time_asm.h:11,
                 from /tmp/FC25_K4.8.6_GCC6.3.1/x86_64-native-linuxapp-gcc-debug/74427493f7bc49f9bc980a9c1db12576/dpdk/drivers/crypto/dpaa2_sec/hw/rta.h:11,
--
                 from /tmp/FC25_K4.8.6_GCC6.3.1/x86_64-native-linuxapp-gcc-debug/74427493f7bc49f9bc980a9c1db12576/dpdk/drivers/crypto/caam_jr/caam_jr.c:22:
/tmp/FC25_K4.8.6_GCC6.3.1/x86_64-native-linuxapp-gcc-debug/74427493f7bc49f9bc980a9c1db12576/dpdk/drivers/crypto/dpaa2_sec/hw/compat.h:113:0: note: this is the location of the previous definition
    #define cpu_to_be32(x) swab32(x)
 
/tmp/FC25_K4.8.6_GCC6.3.1/x86_64-native-linuxapp-gcc-debug/74427493f7bc49f9bc980a9c1db12576/dpdk/drivers/crypto/caam_jr/caam_jr.c: In function ‘caam_jr_prep_cdb’:
/tmp/FC25_K4.8.6_GCC6.3.1/x86_64-native-linuxapp-gcc-debug/74427493f7bc49f9bc980a9c1db12576/dpdk/drivers/crypto/caam_jr/caam_jr.c:431:19: warning: passing argument 4 of ‘cnstr_shdsc_ipsec_new_encap’ makes pointer from integer without a cast [-Wint-conversion]
       true, swap, SHR_SERIAL,
                   ^~~~~~~~~~
In file included from /tmp/FC25_K4.8.6_GCC6.3.1/x86_64-native-linuxapp-gcc-debug/74427493f7bc49f9bc980a9c1db12576/dpdk/drivers/crypto/caam_jr/caam_jr.c:24:0:
/tmp/FC25_K4.8.6_GCC6.3.1/x86_64-native-linuxapp-gcc-debug/74427493f7bc49f9bc980a9c1db12576/dpdk/drivers/crypto/dpaa2_sec/hw/desc/ipsec.h:1086:1: note: expected ‘struct ipsec_encap_pdb *’ but argument is of type ‘int’
 cnstr_shdsc_ipsec_new_encap(uint32_t *descbuf, bool ps,
 ^~~~~~~~~~~~~~~~~~~~~~~~~~~
/tmp/FC25_K4.8.6_GCC6.3.1/x86_64-native-linuxapp-gcc-debug/74427493f7bc49f9bc980a9c1db12576/dpdk/drivers/crypto/caam_jr/caam_jr.c:432:7: warning: passing argument 5 of ‘cnstr_shdsc_ipsec_new_encap’ from incompatible pointer type [-Wincompatible-pointer-types]
       &ses->encap_pdb,
       ^
In file included from /tmp/FC25_K4.8.6_GCC6.3.1/x86_64-native-linuxapp-gcc-debug/74427493f7bc49f9bc980a9c1db12576/dpdk/drivers/crypto/caam_jr/caam_jr.c:24:0:
/tmp/FC25_K4.8.6_GCC6.3.1/x86_64-native-linuxapp-gcc-debug/74427493f7bc49f9bc980a9c1db12576/dpdk/drivers/crypto/dpaa2_sec/hw/desc/ipsec.h:1086:1: note: expected ‘uint8_t * {aka unsigned char *}’ but argument is of type ‘struct ipsec_encap_pdb *’
 cnstr_shdsc_ipsec_new_encap(uint32_t *descbuf, bool ps,
 ^~~~~~~~~~~~~~~~~~~~~~~~~~~
/tmp/FC25_K4.8.6_GCC6.3.1/x86_64-native-linuxapp-gcc-debug/74427493f7bc49f9bc980a9c1db12576/dpdk/drivers/crypto/caam_jr/caam_jr.c:433:7: warning: passing argument 6 of ‘cnstr_shdsc_ipsec_new_encap’ from incompatible pointer type [-Wincompatible-pointer-types]
       (uint8_t *)&ses->ip4_hdr,
       ^
In file included from /tmp/FC25_K4.8.6_GCC6.3.1/x86_64-native-linuxapp-gcc-debug/74427493f7bc49f9bc980a9c1db12576/dpdk/drivers/crypto/caam_jr/caam_jr.c:24:0:
/tmp/FC25_K4.8.6_GCC6.3.1/x86_64-native-linuxapp-gcc-debug/74427493f7bc49f9bc980a9c1db12576/dpdk/drivers/crypto/dpaa2_sec/hw/desc/ipsec.h:1086:1: note: expected ‘struct alginfo *’ but argument is of type ‘uint8_t * {aka unsigned char *}’
 cnstr_shdsc_ipsec_new_encap(uint32_t *descbuf, bool ps,
 ^~~~~~~~~~~~~~~~~~~~~~~~~~~
/tmp/FC25_K4.8.6_GCC6.3.1/x86_64-native-linuxapp-gcc-debug/74427493f7bc49f9bc980a9c1db12576/dpdk/drivers/crypto/caam_jr/caam_jr.c:429:23: error: too many arguments to function ‘cnstr_shdsc_ipsec_new_encap’
     shared_desc_len = cnstr_shdsc_ipsec_new_encap(
                       ^~~~~~~~~~~~~~~~~~~~~~~~~~~
In file included from /tmp/FC25_K4.8.6_GCC6.3.1/x86_64-native-linuxapp-gcc-debug/74427493f7bc49f9bc980a9c1db12576/dpdk/drivers/crypto/caam_jr/caam_jr.c:24:0:
/tmp/FC25_K4.8.6_GCC6.3.1/x86_64-native-linuxapp-gcc-debug/74427493f7bc49f9bc980a9c1db12576/dpdk/drivers/crypto/dpaa2_sec/hw/desc/ipsec.h:1086:1: note: declared here
 cnstr_shdsc_ipsec_new_encap(uint32_t *descbuf, bool ps,
 ^~~~~~~~~~~~~~~~~~~~~~~~~~~
/tmp/FC25_K4.8.6_GCC6.3.1/x86_64-native-linuxapp-gcc-debug/74427493f7bc49f9bc980a9c1db12576/dpdk/drivers/crypto/caam_jr/caam_jr.c:438:19: warning: passing argument 4 of ‘cnstr_shdsc_ipsec_new_decap’ makes pointer from integer without a cast [-Wint-conversion]
       true, swap, SHR_SERIAL,
                   ^~~~~~~~~~
In file included from /tmp/FC25_K4.8.6_GCC6.3.1/x86_64-native-linuxapp-gcc-debug/74427493f7bc49f9bc980a9c1db12576/dpdk/drivers/crypto/caam_jr/caam_jr.c:24:0:
/tmp/FC25_K4.8.6_GCC6.3.1/x86_64-native-linuxapp-gcc-debug/74427493f7bc49f9bc980a9c1db12576/dpdk/drivers/crypto/dpaa2_sec/hw/desc/ipsec.h:1189:1: note: expected ‘struct ipsec_decap_pdb *’ but argument is of type ‘int’
 cnstr_shdsc_ipsec_new_decap(uint32_t *descbuf, bool ps,
 ^~~~~~~~~~~~~~~~~~~~~~~~~~~
/tmp/FC25_K4.8.6_GCC6.3.1/x86_64-native-linuxapp-gcc-debug/74427493f7bc49f9bc980a9c1db12576/dpdk/drivers/crypto/caam_jr/caam_jr.c:439:7: warning: passing argument 5 of ‘cnstr_shdsc_ipsec_new_decap’ from incompatible pointer type [-Wincompatible-pointer-types]
       &ses->decap_pdb,
       ^
In file included from /tmp/FC25_K4.8.6_GCC6.3.1/x86_64-native-linuxapp-gcc-debug/74427493f7bc49f9bc980a9c1db12576/dpdk/drivers/crypto/caam_jr/caam_jr.c:24:0:
/tmp/FC25_K4.8.6_GCC6.3.1/x86_64-native-linuxapp-gcc-debug/74427493f7bc49f9bc980a9c1db12576/dpdk/drivers/crypto/dpaa2_sec/hw/desc/ipsec.h:1189:1: note: expected ‘struct alginfo *’ but argument is of type ‘struct ipsec_decap_pdb *’
 cnstr_shdsc_ipsec_new_decap(uint32_t *descbuf, bool ps,
 ^~~~~~~~~~~~~~~~~~~~~~~~~~~
/tmp/FC25_K4.8.6_GCC6.3.1/x86_64-native-linuxapp-gcc-debug/74427493f7bc49f9bc980a9c1db12576/dpdk/drivers/crypto/caam_jr/caam_jr.c:436:23: error: too many arguments to function ‘cnstr_shdsc_ipsec_new_decap’
     shared_desc_len = cnstr_shdsc_ipsec_new_decap(
                       ^~~~~~~~~~~~~~~~~~~~~~~~~~~
In file included from /tmp/FC25_K4.8.6_GCC6.3.1/x86_64-native-linuxapp-gcc-debug/74427493f7bc49f9bc980a9c1db12576/dpdk/drivers/crypto/caam_jr/caam_jr.c:24:0:
/tmp/FC25_K4.8.6_GCC6.3.1/x86_64-native-linuxapp-gcc-debug/74427493f7bc49f9bc980a9c1db12576/dpdk/drivers/crypto/dpaa2_sec/hw/desc/ipsec.h:1189:1: note: declared here
 cnstr_shdsc_ipsec_new_decap(uint32_t *descbuf, bool ps,
 ^~~~~~~~~~~~~~~~~~~~~~~~~~~
In file included from /tmp/FC25_K4.8.6_GCC6.3.1/x86_64-native-linuxapp-gcc-debug/74427493f7bc49f9bc980a9c1db12576/dpdk/drivers/crypto/caam_jr/caam_jr.c:31:0:
/tmp/FC25_K4.8.6_GCC6.3.1/x86_64-native-linuxapp-gcc-debug/74427493f7bc49f9bc980a9c1db12576/dpdk/drivers/crypto/caam_jr/caam_jr_desc.h:119:32: warning: cast from pointer to integer of different size [-Wpointer-to-int-cast]
  CAAM_JR_INFO("Des@ 0x%08x\n", (uint32_t)((uint32_t *)(descriptor)));\
                                ^
/tmp/FC25_K4.8.6_GCC6.3.1/x86_64-native-linuxapp-gcc-debug/74427493f7bc49f9bc980a9c1db12576/dpdk/drivers/crypto/caam_jr/caam_jr_log.h:14:15: note: in definition of macro ‘CAAM_JR_LOG’
   fmt "\n", ##args)
               ^~~~
--
  ^~~~~~~~~~~~
/tmp/FC25_K4.8.6_GCC6.3.1/x86_64-native-linuxapp-gcc-debug/74427493f7bc49f9bc980a9c1db12576/dpdk/drivers/crypto/caam_jr/caam_jr.c:459:2: note: in expansion of macro ‘SEC_DUMP_DESC’
  SEC_DUMP_DESC(cdb->sh_desc);
  ^~~~~~~~~~~~~
In file included from /tmp/FC25_K4.8.6_GCC6.3.1/x86_64-native-linuxapp-gcc-debug/74427493f7bc49f9bc980a9c1db12576/dpdk/drivers/crypto/caam_jr/caam_jr.c:30:0:
/tmp/FC25_K4.8.6_GCC6.3.1/x86_64-native-linuxapp-gcc-debug/74427493f7bc49f9bc980a9c1db12576/dpdk/drivers/crypto/caam_jr/caam_jr_desc.h:124:4: warning: cast from pointer to integer of different size [-Wpointer-to-int-cast]
    (uint32_t)(((uint32_t *)(descriptor)) + __i), \
    ^
/tmp/FC25_K4.8.6_GCC6.3.1/x86_64-native-linuxapp-gcc-debug/74427493f7bc49f9bc980a9c1db12576/dpdk/drivers/crypto/caam_jr/caam_jr.c:459:2: note: in expansion of macro ‘SEC_DUMP_DESC’
  SEC_DUMP_DESC(cdb->sh_desc);
  ^~~~~~~~~~~~~
  CC ark_mpu.o
  CC ark_pktchkr.o
/tmp/FC25_K4.8.6_GCC6.3.1/x86_64-native-linuxapp-gcc-debug/74427493f7bc49f9bc980a9c1db12576/dpdk/mk/internal/rte.compile-pre.mk:114: recipe for target 'caam_jr.o' failed
make[6]: *** [caam_jr.o] Error 1
/tmp/FC25_K4.8.6_GCC6.3.1/x86_64-native-linuxapp-gcc-debug/74427493f7bc49f9bc980a9c1db12576/dpdk/mk/rte.subdir.mk:35: recipe for target 'caam_jr' failed
make[5]: *** [caam_jr] Error 2
/tmp/FC25_K4.8.6_GCC6.3.1/x86_64-native-linuxapp-gcc-debug/74427493f7bc49f9bc980a9c1db12576/dpdk/mk/rte.subdir.mk:35: recipe for target 'crypto' failed
make[4]: *** [crypto] Error 2
make[4]: *** Waiting for unfinished jobs....
  CC ark_pktdir.o
  CC ark_pktgen.o
== Build drivers/net/avf
--
  CC conn.o
  AR librte_pmd_ifc.a
  INSTALL-LIB librte_pmd_ifc.a
  AR librte_pmd_softnic.a
  INSTALL-LIB librte_pmd_softnic.a
/tmp/FC25_K4.8.6_GCC6.3.1/x86_64-native-linuxapp-gcc-debug/74427493f7bc49f9bc980a9c1db12576/dpdk/mk/rte.sdkbuild.mk:49: recipe for target 'drivers' failed
make[3]: *** [drivers] Error 2
/tmp/FC25_K4.8.6_GCC6.3.1/x86_64-native-linuxapp-gcc-debug/74427493f7bc49f9bc980a9c1db12576/dpdk/mk/rte.sdkroot.mk:100: recipe for target 'all' failed
make[2]: *** [all] Error 2
/tmp/FC25_K4.8.6_GCC6.3.1/x86_64-native-linuxapp-gcc-debug/74427493f7bc49f9bc980a9c1db12576/dpdk/mk/rte.sdkinstall.mk:57: recipe for target 'pre_install' failed
make[1]: *** [pre_install] Error 2
/tmp/FC25_K4.8.6_GCC6.3.1/x86_64-native-linuxapp-gcc-debug/74427493f7bc49f9bc980a9c1db12576/dpdk/mk/rte.sdkroot.mk:79: recipe for target 'install' failed
make: *** [install] Error 2

*Failed Build #13:
OS: FC24
Target: x86_64-native-linuxapp-gcc-shared
  LD ark_ethdev.o
  CC caam_jr.o
  CC ark_ethdev_rx.o
In file included from /tmp/FC24_K4.9.13_GCC6.2.1/x86_64-native-linuxapp-gcc-shared/74427493f7bc49f9bc980a9c1db12576/dpdk/drivers/bus/dpaa/include/of.h:11:0,
                 from /tmp/FC24_K4.9.13_GCC6.2.1/x86_64-native-linuxapp-gcc-shared/74427493f7bc49f9bc980a9c1db12576/dpdk/drivers/crypto/caam_jr/caam_jr.c:25:
/tmp/FC24_K4.9.13_GCC6.2.1/x86_64-native-linuxapp-gcc-shared/74427493f7bc49f9bc980a9c1db12576/dpdk/drivers/bus/dpaa/include/compat.h:80:0: warning: "pr_err" redefined
 #define pr_err(fmt, args...)  prflush("ERR:" fmt, ##args)
 
In file included from /tmp/FC24_K4.9.13_GCC6.2.1/x86_64-native-linuxapp-gcc-shared/74427493f7bc49f9bc980a9c1db12576/dpdk/drivers/crypto/dpaa2_sec/hw/desc.h:18:0,
                 from /tmp/FC24_K4.9.13_GCC6.2.1/x86_64-native-linuxapp-gcc-shared/74427493f7bc49f9bc980a9c1db12576/dpdk/drivers/crypto/dpaa2_sec/hw/rta/sec_run_time_asm.h:11,
                 from /tmp/FC24_K4.9.13_GCC6.2.1/x86_64-native-linuxapp-gcc-shared/74427493f7bc49f9bc980a9c1db12576/dpdk/drivers/crypto/dpaa2_sec/hw/rta.h:11,
--
/tmp/FC24_K4.9.13_GCC6.2.1/x86_64-native-linuxapp-gcc-shared/74427493f7bc49f9bc980a9c1db12576/dpdk/drivers/crypto/dpaa2_sec/hw/compat.h:54:0: note: this is the location of the previous definition
 #define pr_err(fmt, ...) \
 
In file included from /tmp/FC24_K4.9.13_GCC6.2.1/x86_64-native-linuxapp-gcc-shared/74427493f7bc49f9bc980a9c1db12576/dpdk/drivers/bus/dpaa/include/of.h:11:0,
                 from /tmp/FC24_K4.9.13_GCC6.2.1/x86_64-native-linuxapp-gcc-shared/74427493f7bc49f9bc980a9c1db12576/dpdk/drivers/crypto/caam_jr/caam_jr.c:25:
/tmp/FC24_K4.9.13_GCC6.2.1/x86_64-native-linuxapp-gcc-shared/74427493f7bc49f9bc980a9c1db12576/dpdk/drivers/bus/dpaa/include/compat.h:81:0: warning: "pr_warn" redefined
 #define pr_warn(fmt, args...)  prflush("WARN:" fmt, ##args)
 
In file included from /tmp/FC24_K4.9.13_GCC6.2.1/x86_64-native-linuxapp-gcc-shared/74427493f7bc49f9bc980a9c1db12576/dpdk/drivers/crypto/dpaa2_sec/hw/desc.h:18:0,
                 from /tmp/FC24_K4.9.13_GCC6.2.1/x86_64-native-linuxapp-gcc-shared/74427493f7bc49f9bc980a9c1db12576/dpdk/drivers/crypto/dpaa2_sec/hw/rta/sec_run_time_asm.h:11,
                 from /tmp/FC24_K4.9.13_GCC6.2.1/x86_64-native-linuxapp-gcc-shared/74427493f7bc49f9bc980a9c1db12576/dpdk/drivers/crypto/dpaa2_sec/hw/rta.h:11,
--
/tmp/FC24_K4.9.13_GCC6.2.1/x86_64-native-linuxapp-gcc-shared/74427493f7bc49f9bc980a9c1db12576/dpdk/drivers/crypto/dpaa2_sec/hw/compat.h:63:0: note: this is the location of the previous definition
 #define pr_warn(fmt, ...) \
 
In file included from /tmp/FC24_K4.9.13_GCC6.2.1/x86_64-native-linuxapp-gcc-shared/74427493f7bc49f9bc980a9c1db12576/dpdk/drivers/bus/dpaa/include/of.h:11:0,
                 from /tmp/FC24_K4.9.13_GCC6.2.1/x86_64-native-linuxapp-gcc-shared/74427493f7bc49f9bc980a9c1db12576/dpdk/drivers/crypto/caam_jr/caam_jr.c:25:
/tmp/FC24_K4.9.13_GCC6.2.1/x86_64-native-linuxapp-gcc-shared/74427493f7bc49f9bc980a9c1db12576/dpdk/drivers/bus/dpaa/include/compat.h:90:0: warning: "pr_debug" redefined
 #define pr_debug(fmt, args...) {}
 
In file included from /tmp/FC24_K4.9.13_GCC6.2.1/x86_64-native-linuxapp-gcc-shared/74427493f7bc49f9bc980a9c1db12576/dpdk/drivers/crypto/dpaa2_sec/hw/desc.h:18:0,
                 from /tmp/FC24_K4.9.13_GCC6.2.1/x86_64-native-linuxapp-gcc-shared/74427493f7bc49f9bc980a9c1db12576/dpdk/drivers/crypto/dpaa2_sec/hw/rta/sec_run_time_asm.h:11,
                 from /tmp/FC24_K4.9.13_GCC6.2.1/x86_64-native-linuxapp-gcc-shared/74427493f7bc49f9bc980a9c1db12576/dpdk/drivers/crypto/dpaa2_sec/hw/rta.h:11,
--
/tmp/FC24_K4.9.13_GCC6.2.1/x86_64-native-linuxapp-gcc-shared/74427493f7bc49f9bc980a9c1db12576/dpdk/drivers/crypto/dpaa2_sec/hw/compat.h:48:0: note: this is the location of the previous definition
 #define pr_debug(fmt, ...)     do { } while (0)
 
In file included from /tmp/FC24_K4.9.13_GCC6.2.1/x86_64-native-linuxapp-gcc-shared/74427493f7bc49f9bc980a9c1db12576/dpdk/drivers/bus/dpaa/include/of.h:11:0,
                 from /tmp/FC24_K4.9.13_GCC6.2.1/x86_64-native-linuxapp-gcc-shared/74427493f7bc49f9bc980a9c1db12576/dpdk/drivers/crypto/caam_jr/caam_jr.c:25:
/tmp/FC24_K4.9.13_GCC6.2.1/x86_64-native-linuxapp-gcc-shared/74427493f7bc49f9bc980a9c1db12576/dpdk/drivers/bus/dpaa/include/compat.h:259:0: warning: "cpu_to_be32" redefined
 #define cpu_to_be32(x) rte_cpu_to_be_32(x)
 
In file included from /tmp/FC24_K4.9.13_GCC6.2.1/x86_64-native-linuxapp-gcc-shared/74427493f7bc49f9bc980a9c1db12576/dpdk/drivers/crypto/dpaa2_sec/hw/desc.h:18:0,
                 from /tmp/FC24_K4.9.13_GCC6.2.1/x86_64-native-linuxapp-gcc-shared/74427493f7bc49f9bc980a9c1db12576/dpdk/drivers/crypto/dpaa2_sec/hw/rta/sec_run_time_asm.h:11,
                 from /tmp/FC24_K4.9.13_GCC6.2.1/x86_64-native-linuxapp-gcc-shared/74427493f7bc49f9bc980a9c1db12576/dpdk/drivers/crypto/dpaa2_sec/hw/rta.h:11,
--
                 from /tmp/FC24_K4.9.13_GCC6.2.1/x86_64-native-linuxapp-gcc-shared/74427493f7bc49f9bc980a9c1db12576/dpdk/drivers/crypto/caam_jr/caam_jr.c:22:
/tmp/FC24_K4.9.13_GCC6.2.1/x86_64-native-linuxapp-gcc-shared/74427493f7bc49f9bc980a9c1db12576/dpdk/drivers/crypto/dpaa2_sec/hw/compat.h:113:0: note: this is the location of the previous definition
    #define cpu_to_be32(x) swab32(x)
 
/tmp/FC24_K4.9.13_GCC6.2.1/x86_64-native-linuxapp-gcc-shared/74427493f7bc49f9bc980a9c1db12576/dpdk/drivers/crypto/caam_jr/caam_jr.c: In function ‘caam_jr_prep_cdb’:
/tmp/FC24_K4.9.13_GCC6.2.1/x86_64-native-linuxapp-gcc-shared/74427493f7bc49f9bc980a9c1db12576/dpdk/drivers/crypto/caam_jr/caam_jr.c:431:19: warning: passing argument 4 of ‘cnstr_shdsc_ipsec_new_encap’ makes pointer from integer without a cast [-Wint-conversion]
       true, swap, SHR_SERIAL,
                   ^~~~~~~~~~
In file included from /tmp/FC24_K4.9.13_GCC6.2.1/x86_64-native-linuxapp-gcc-shared/74427493f7bc49f9bc980a9c1db12576/dpdk/drivers/crypto/caam_jr/caam_jr.c:24:0:
/tmp/FC24_K4.9.13_GCC6.2.1/x86_64-native-linuxapp-gcc-shared/74427493f7bc49f9bc980a9c1db12576/dpdk/drivers/crypto/dpaa2_sec/hw/desc/ipsec.h:1086:1: note: expected ‘struct ipsec_encap_pdb *’ but argument is of type ‘int’
 cnstr_shdsc_ipsec_new_encap(uint32_t *descbuf, bool ps,
 ^~~~~~~~~~~~~~~~~~~~~~~~~~~
/tmp/FC24_K4.9.13_GCC6.2.1/x86_64-native-linuxapp-gcc-shared/74427493f7bc49f9bc980a9c1db12576/dpdk/drivers/crypto/caam_jr/caam_jr.c:432:7: warning: passing argument 5 of ‘cnstr_shdsc_ipsec_new_encap’ from incompatible pointer type [-Wincompatible-pointer-types]
       &ses->encap_pdb,
       ^
In file included from /tmp/FC24_K4.9.13_GCC6.2.1/x86_64-native-linuxapp-gcc-shared/74427493f7bc49f9bc980a9c1db12576/dpdk/drivers/crypto/caam_jr/caam_jr.c:24:0:
/tmp/FC24_K4.9.13_GCC6.2.1/x86_64-native-linuxapp-gcc-shared/74427493f7bc49f9bc980a9c1db12576/dpdk/drivers/crypto/dpaa2_sec/hw/desc/ipsec.h:1086:1: note: expected ‘uint8_t * {aka unsigned char *}’ but argument is of type ‘struct ipsec_encap_pdb *’
 cnstr_shdsc_ipsec_new_encap(uint32_t *descbuf, bool ps,
 ^~~~~~~~~~~~~~~~~~~~~~~~~~~
/tmp/FC24_K4.9.13_GCC6.2.1/x86_64-native-linuxapp-gcc-shared/74427493f7bc49f9bc980a9c1db12576/dpdk/drivers/crypto/caam_jr/caam_jr.c:433:7: warning: passing argument 6 of ‘cnstr_shdsc_ipsec_new_encap’ from incompatible pointer type [-Wincompatible-pointer-types]
       (uint8_t *)&ses->ip4_hdr,
       ^
In file included from /tmp/FC24_K4.9.13_GCC6.2.1/x86_64-native-linuxapp-gcc-shared/74427493f7bc49f9bc980a9c1db12576/dpdk/drivers/crypto/caam_jr/caam_jr.c:24:0:
/tmp/FC24_K4.9.13_GCC6.2.1/x86_64-native-linuxapp-gcc-shared/74427493f7bc49f9bc980a9c1db12576/dpdk/drivers/crypto/dpaa2_sec/hw/desc/ipsec.h:1086:1: note: expected ‘struct alginfo *’ but argument is of type ‘uint8_t * {aka unsigned char *}’
 cnstr_shdsc_ipsec_new_encap(uint32_t *descbuf, bool ps,
 ^~~~~~~~~~~~~~~~~~~~~~~~~~~
/tmp/FC24_K4.9.13_GCC6.2.1/x86_64-native-linuxapp-gcc-shared/74427493f7bc49f9bc980a9c1db12576/dpdk/drivers/crypto/caam_jr/caam_jr.c:429:23: error: too many arguments to function ‘cnstr_shdsc_ipsec_new_encap’
     shared_desc_len = cnstr_shdsc_ipsec_new_encap(
                       ^~~~~~~~~~~~~~~~~~~~~~~~~~~
In file included from /tmp/FC24_K4.9.13_GCC6.2.1/x86_64-native-linuxapp-gcc-shared/74427493f7bc49f9bc980a9c1db12576/dpdk/drivers/crypto/caam_jr/caam_jr.c:24:0:
/tmp/FC24_K4.9.13_GCC6.2.1/x86_64-native-linuxapp-gcc-shared/74427493f7bc49f9bc980a9c1db12576/dpdk/drivers/crypto/dpaa2_sec/hw/desc/ipsec.h:1086:1: note: declared here
 cnstr_shdsc_ipsec_new_encap(uint32_t *descbuf, bool ps,
 ^~~~~~~~~~~~~~~~~~~~~~~~~~~
/tmp/FC24_K4.9.13_GCC6.2.1/x86_64-native-linuxapp-gcc-shared/74427493f7bc49f9bc980a9c1db12576/dpdk/drivers/crypto/caam_jr/caam_jr.c:438:19: warning: passing argument 4 of ‘cnstr_shdsc_ipsec_new_decap’ makes pointer from integer without a cast [-Wint-conversion]
       true, swap, SHR_SERIAL,
                   ^~~~~~~~~~
In file included from /tmp/FC24_K4.9.13_GCC6.2.1/x86_64-native-linuxapp-gcc-shared/74427493f7bc49f9bc980a9c1db12576/dpdk/drivers/crypto/caam_jr/caam_jr.c:24:0:
/tmp/FC24_K4.9.13_GCC6.2.1/x86_64-native-linuxapp-gcc-shared/74427493f7bc49f9bc980a9c1db12576/dpdk/drivers/crypto/dpaa2_sec/hw/desc/ipsec.h:1189:1: note: expected ‘struct ipsec_decap_pdb *’ but argument is of type ‘int’
 cnstr_shdsc_ipsec_new_decap(uint32_t *descbuf, bool ps,
 ^~~~~~~~~~~~~~~~~~~~~~~~~~~
/tmp/FC24_K4.9.13_GCC6.2.1/x86_64-native-linuxapp-gcc-shared/74427493f7bc49f9bc980a9c1db12576/dpdk/drivers/crypto/caam_jr/caam_jr.c:439:7: warning: passing argument 5 of ‘cnstr_shdsc_ipsec_new_decap’ from incompatible pointer type [-Wincompatible-pointer-types]
       &ses->decap_pdb,
       ^
In file included from /tmp/FC24_K4.9.13_GCC6.2.1/x86_64-native-linuxapp-gcc-shared/74427493f7bc49f9bc980a9c1db12576/dpdk/drivers/crypto/caam_jr/caam_jr.c:24:0:
/tmp/FC24_K4.9.13_GCC6.2.1/x86_64-native-linuxapp-gcc-shared/74427493f7bc49f9bc980a9c1db12576/dpdk/drivers/crypto/dpaa2_sec/hw/desc/ipsec.h:1189:1: note: expected ‘struct alginfo *’ but argument is of type ‘struct ipsec_decap_pdb *’
 cnstr_shdsc_ipsec_new_decap(uint32_t *descbuf, bool ps,
 ^~~~~~~~~~~~~~~~~~~~~~~~~~~
/tmp/FC24_K4.9.13_GCC6.2.1/x86_64-native-linuxapp-gcc-shared/74427493f7bc49f9bc980a9c1db12576/dpdk/drivers/crypto/caam_jr/caam_jr.c:436:23: error: too many arguments to function ‘cnstr_shdsc_ipsec_new_decap’
     shared_desc_len = cnstr_shdsc_ipsec_new_decap(
                       ^~~~~~~~~~~~~~~~~~~~~~~~~~~
In file included from /tmp/FC24_K4.9.13_GCC6.2.1/x86_64-native-linuxapp-gcc-shared/74427493f7bc49f9bc980a9c1db12576/dpdk/drivers/crypto/caam_jr/caam_jr.c:24:0:
/tmp/FC24_K4.9.13_GCC6.2.1/x86_64-native-linuxapp-gcc-shared/74427493f7bc49f9bc980a9c1db12576/dpdk/drivers/crypto/dpaa2_sec/hw/desc/ipsec.h:1189:1: note: declared here
 cnstr_shdsc_ipsec_new_decap(uint32_t *descbuf, bool ps,
 ^~~~~~~~~~~~~~~~~~~~~~~~~~~
/tmp/FC24_K4.9.13_GCC6.2.1/x86_64-native-linuxapp-gcc-shared/74427493f7bc49f9bc980a9c1db12576/dpdk/mk/internal/rte.compile-pre.mk:114: recipe for target 'caam_jr.o' failed
make[6]: *** [caam_jr.o] Error 1
/tmp/FC24_K4.9.13_GCC6.2.1/x86_64-native-linuxapp-gcc-shared/74427493f7bc49f9bc980a9c1db12576/dpdk/mk/rte.subdir.mk:35: recipe for target 'caam_jr' failed
make[5]: *** [caam_jr] Error 2
/tmp/FC24_K4.9.13_GCC6.2.1/x86_64-native-linuxapp-gcc-shared/74427493f7bc49f9bc980a9c1db12576/dpdk/mk/rte.subdir.mk:35: recipe for target 'crypto' failed
make[4]: *** [crypto] Error 2
make[4]: *** Waiting for unfinished jobs....
  CC ark_ethdev_tx.o
  CC ark_mpu.o
  CC ark_pktchkr.o
--
  CC rte_eth_softnic_cli.o
  CC parser.o
  CC conn.o
  LD librte_pmd_softnic.so.1.1
  INSTALL-LIB librte_pmd_softnic.so.1.1
/tmp/FC24_K4.9.13_GCC6.2.1/x86_64-native-linuxapp-gcc-shared/74427493f7bc49f9bc980a9c1db12576/dpdk/mk/rte.sdkbuild.mk:49: recipe for target 'drivers' failed
make[3]: *** [drivers] Error 2
/tmp/FC24_K4.9.13_GCC6.2.1/x86_64-native-linuxapp-gcc-shared/74427493f7bc49f9bc980a9c1db12576/dpdk/mk/rte.sdkroot.mk:100: recipe for target 'all' failed
make[2]: *** [all] Error 2
/tmp/FC24_K4.9.13_GCC6.2.1/x86_64-native-linuxapp-gcc-shared/74427493f7bc49f9bc980a9c1db12576/dpdk/mk/rte.sdkinstall.mk:57: recipe for target 'pre_install' failed
make[1]: *** [pre_install] Error 2
/tmp/FC24_K4.9.13_GCC6.2.1/x86_64-native-linuxapp-gcc-shared/74427493f7bc49f9bc980a9c1db12576/dpdk/mk/rte.sdkroot.mk:79: recipe for target 'install' failed
make: *** [install] Error 2

DPDK STV team


More information about the test-report mailing list