[dpdk-test-report] |FAILURE| pw52947net/tap: ipc add check for number of messages received

sys_stv at intel.com sys_stv at intel.com
Thu Apr 18 19:23:36 CEST 2019


Test-Label: Intel-compilation
Test-Status: FAILURE
http://dpdk.org/patch/52947

_Compilation issues_

Submitter: Herakliusz Lipiec <herakliusz.lipiec at intel.com>
Date: 2019-04-18 17:19:23
Reply_mail: 20190418171923.570-1-herakliusz.lipiec at intel.com
DPDK git baseline: Repo:dpdk-master, CommitID: cf47a68e5d9f52cdec3462961d313feb9c66859f

Build Summary: 17 Builds Done, 2 Successful, 15 Failures

Test environment and configuration as below:

OS: SUSE15
	Kernel Version: 4.12.14-lp150.11-default
	CPU info: Intel(R) Xeon(R) CPU E5-2699 v3 @ 2.30GHz
	GCC Version: gcc (SUSE Linux) 7.3.1 20180323 [gcc-7-branch revision 258812]
	Clang Version: 5.0.1 (tags/RELEASE_501/final 312548)
	x86_64-native-linuxapp-gcc

OS: SUSE12
	Kernel Version: 4.4.73-5-default
	CPU info: Intel(R) Xeon(R) CPU E5-2699 v4 @ 2.20GHz
	GCC Version: gcc (SUSE Linux) 7.1.1 20170607 [gcc-7-branch revision 248970]
	Clang Version: 3.8.0 (tags/RELEASE_380/final 262553)
	x86_64-native-linuxapp-gcc

OS: UBT164-32
	Kernel Version: 4.4.0-131-generic
	CPU info: Intel(R) Xeon(R) CPU E5-2699 v3 @ 2.30GHz
	GCC Version: gcc (Ubuntu 5.4.0-6ubuntu1~16.04.10) 5.4.0 20160609
	Clang Version: NA
	i686-native-linuxapp-gcc

OS: FreeBSD12.0
	Kernel Version: 12.0-RC3
	CPU info: Intel(R) Xeon(R) CPU E5-2699 v3 @ 2.30GHz (2294.74-MHz K8-class CPU)
	GCC Version: gcc (FreeBSD Ports Collection) 7.3.0
	Clang Version: 6.0.1 (tags/RELEASE_601/final 335540) (based on LLVM 6.0.1)
	x86_64-native-bsdapp-gcc
	x86_64-native-bsdapp-clang

OS: UBT1804
	Kernel Version: 4.15.0-29-generic
	CPU info: Intel(R) Xeon(R) Platinum 8180M CPU @ 2.50GHz
	GCC Version: gcc (Ubuntu 7.3.0-27ubuntu1~18.04) 7.3.0
	Clang Version: 6.0.0-1ubuntu2 (tags/RELEASE_600/final)
	x86_64-native-linuxapp-clang
	x86_64-native-linuxapp-icc
	x86_64-native-linuxapp-gcc

OS: UBT1810
	Kernel Version: 4.18.0-10-generic
	CPU info: Intel(R) Xeon(R) CPU E5-2699 v3 @ 2.30GHz
	GCC Version: gcc (Ubuntu 8.2.0-7ubuntu1) 8.2.0
	Clang Version: 7.0.0-3 (tags/RELEASE_700/final)
	x86_64-native-linuxapp-gcc

OS: CENTOS75
	Kernel Version: 3.10.0-957.5.1.el7.x86_64
	CPU info: Intel(R) Xeon(R) CPU E5-2699 v4 @ 2.20GHz
	GCC Version: gcc (GCC) 4.8.5 20150623 (Red Hat 4.8.5-36)
	Clang Version: 3.4.2 (tags/RELEASE_34/dot2-final)
	x86_64-native-linuxapp-gcc

OS: UBT164-64
	Kernel Version: 4.13.0-36-generic
	CPU info: Intel(R) Xeon(R) Platinum 8180 CPU @ 2.50GHz
	GCC Version: gcc (Ubuntu 5.4.0-6ubuntu1~16.04.9) 5.4.0 20160609
	Clang Version: NA
	x86_64-native-linuxapp-gcc

OS: CENTOS76
	Kernel Version: 3.10.0-957.5.1.el7.x86_64
	CPU info: Intel(R) Xeon(R) CPU E5-2699 v4 @ 2.20GHz
	GCC Version: gcc (GCC) 4.8.5 20150623 (Red Hat 4.8.5-36)
	Clang Version: 3.4.2 (tags/RELEASE_34/dot2-final)
	x86_64-native-linuxapp-gcc

OS: RHEL76
	Kernel Version: 3.10.0-957.el7.x86_64
	CPU info: Intel(R) Xeon(R) CPU E5-2699 v4 @ 2.20GHz
	GCC Version: gcc (GCC) 4.8.5 20150623 (Red Hat 4.8.5-36)
	Clang Version: NA
	x86_64-native-linuxapp-gcc

OS: FC29
	Kernel Version: 4.18.16-300.fc29.x86_64
	CPU info: Intel(R) Xeon(R) CPU E5-2699 v4 @ 2.20GHz
	GCC Version: gcc (GCC) 8.2.1 20181215 (Red Hat 8.2.1-6)
	Clang Version: 7.0.1 (Fedora 7.0.1-6.fc29)
	x86_64-native-linuxapp-gcc
	x86_64-native-linuxapp-clang
	x86_64-native-linuxapp-icc

OS: RHEL75
	Kernel Version: 3.10.0-862.el7.x86_64
	CPU info: Intel(R) Xeon(R) CPU E5-2699 v4 @ 2.20GHz
	GCC Version: gcc (GCC) 4.8.5 20150623 (Red Hat 4.8.5-28)
	Clang Version: NA
	x86_64-native-linuxapp-gcc

*Failed Build #1:
OS: SUSE15
Target: x86_64-native-linuxapp-gcc
  INSTALL-LIB librte_bpf.a
  AR librte_vhost.a
  INSTALL-LIB librte_vhost.a
  AR librte_eventdev.a
  INSTALL-LIB librte_eventdev.a
make[5]: warning:  Clock skew detected.  Your build may be incomplete.
  AR librte_port.a
  INSTALL-LIB librte_port.a
== Build lib/librte_table
  SYMLINK-FILE include/rte_table.h
  SYMLINK-FILE include/rte_table_lpm.h
--
  AR librte_pmd_atlantic.a
  INSTALL-LIB librte_pmd_atlantic.a
  INSTALL-LIB librte_pmd_virtio_crypto.a
  PMDINFO avp_ethdev.o.pmd.c
  CC avp_ethdev.o.pmd.o
make[6]: warning:  Clock skew detected.  Your build may be incomplete.
  LD avp_ethdev.o
== Build drivers/net/ena
  AR librte_pmd_avp.a
== Build drivers/net/enetc
  INSTALL-LIB librte_pmd_avp.a
--
  CC iavf_common.o
  CC base/vnic_wq.o
  AR librte_pmd_failsafe.a
  CC e1000_manage.o
  INSTALL-LIB librte_pmd_failsafe.a
make[6]: warning:  Clock skew detected.  Your build may be incomplete.
  CC fm10k_api.o
== Build drivers/net/ixgbe
  CC fm10k_rxtx_vec.o
  CC cxgbe_flow.o
  CC t4_hw.o
--
  LD sfc_ethdev.o
  CC bnxt_vnic.o
  CC sfc_kvargs.o
  CC ice_rxtx_vec_avx2.o
/tmp/SUSE15_K4.12.14_GCC7.3.1/x86_64-native-linuxapp-gcc/424feb3e09a84139a289c4faee775b64/dpdk/drivers/net/tap/rte_eth_tap.c: In function ‘tap_mp_attach_queues’:
/tmp/SUSE15_K4.12.14_GCC7.3.1/x86_64-native-linuxapp-gcc/424feb3e09a84139a289c4faee775b64/dpdk/drivers/net/tap/rte_eth_tap.c:2104:25: error: ‘struct rte_mp_reply’ has no member named ‘n_receieved’; did you mean ‘nb_received’?
  if (ret < 0 || replies.n_receieved != 1) {
                         ^~~~~~~~~~~
                         nb_received
make[6]: *** [/tmp/SUSE15_K4.12.14_GCC7.3.1/x86_64-native-linuxapp-gcc/424feb3e09a84139a289c4faee775b64/dpdk/mk/internal/rte.compile-pre.mk:116: rte_eth_tap.o] Error 1
make[5]: *** [/tmp/SUSE15_K4.12.14_GCC7.3.1/x86_64-native-linuxapp-gcc/424feb3e09a84139a289c4faee775b64/dpdk/mk/rte.subdir.mk:37: tap] Error 2

*Failed Build #2:
OS: UBT164-32
Target: i686-native-linuxapp-gcc
  CC rte_port_fd.o
  CC rte_port_source_sink.o
  CC rte_port_sym_crypto.o
  AR librte_eventdev.a
  INSTALL-LIB librte_eventdev.a
make[5]: warning:  Clock skew detected.  Your build may be incomplete.
  AR librte_vhost.a
  INSTALL-LIB librte_vhost.a
  AR librte_port.a
  INSTALL-LIB librte_port.a
== Build lib/librte_table
--
== Build drivers/net/ena
  CC axgbe_ethdev.o
  CC axgbe_dev.o
  AR librte_pmd_atlantic.a
  INSTALL-LIB librte_pmd_atlantic.a
make[6]: warning:  Clock skew detected.  Your build may be incomplete.
== Build drivers/net/enetc
  SYMLINK-FILE include/rte_eth_bond.h
  CC cxgbe_ethdev.o
  SYMLINK-FILE include/rte_eth_bond_8023ad.h
  PMDINFO axgbe_ethdev.o.pmd.c
--
  AR librte_pmd_cxgbe.a
  INSTALL-LIB librte_pmd_cxgbe.a
  AR librte_pmd_failsafe.a
== Build drivers/net/liquidio
  INSTALL-LIB librte_pmd_failsafe.a
make[6]: warning:  Clock skew detected.  Your build may be incomplete.
== Build drivers/net/netvsc
  CC igb_rxtx.o
  CC igb_pf.o
  SYMLINK-FILE include/rte_pmd_ixgbe.h
  AR librte_pmd_enic.a
--
  INSTALL-LIB librte_pmd_ring.a
== Build drivers/net/thunderx
  CC ice_ethdev.o
  CC ixgbe_mbx.o
/tmp/UBT164-32_K4.4.0_GCC5.4.0/i686-native-linuxapp-gcc/424feb3e09a84139a289c4faee775b64/dpdk/drivers/net/tap/rte_eth_tap.c: In function ‘tap_mp_attach_queues’:
/tmp/UBT164-32_K4.4.0_GCC5.4.0/i686-native-linuxapp-gcc/424feb3e09a84139a289c4faee775b64/dpdk/drivers/net/tap/rte_eth_tap.c:2104:24: error: ‘struct rte_mp_reply’ has no member named ‘n_receieved’
  if (ret < 0 || replies.n_receieved != 1) {
                        ^
/tmp/UBT164-32_K4.4.0_GCC5.4.0/i686-native-linuxapp-gcc/424feb3e09a84139a289c4faee775b64/dpdk/mk/internal/rte.compile-pre.mk:114: recipe for target 'rte_eth_tap.o' failed
make[6]: *** [rte_eth_tap.o] Error 1
make[6]: *** Waiting for unfinished jobs....
  CC ixgbe_rxtx.o
  CC ice_rxtx.o
  CC i40e_rxtx_vec_sse.o
  CC bnxt_stats.o
  CC i40e_ethdev_vf.o
  CC i40e_pf.o
  CC ecore_hw.o
/tmp/UBT164-32_K4.4.0_GCC5.4.0/i686-native-linuxapp-gcc/424feb3e09a84139a289c4faee775b64/dpdk/mk/rte.subdir.mk:35: recipe for target 'tap' failed
make[5]: *** [tap] Error 2
make[5]: *** Waiting for unfinished jobs....
  CC ecore_cxt.o
  CC bnxt_txq.o
  CC nicvf_rxtx.o
--
  LD qede_ethdev.o
  AR librte_pmd_ixgbe.a
  INSTALL-LIB librte_pmd_ixgbe.a
  AR librte_pmd_qede.a
  INSTALL-LIB librte_pmd_qede.a
/tmp/UBT164-32_K4.4.0_GCC5.4.0/i686-native-linuxapp-gcc/424feb3e09a84139a289c4faee775b64/dpdk/mk/rte.subdir.mk:35: recipe for target 'net' failed
make[4]: *** [net] Error 2
/tmp/UBT164-32_K4.4.0_GCC5.4.0/i686-native-linuxapp-gcc/424feb3e09a84139a289c4faee775b64/dpdk/mk/rte.sdkbuild.mk:46: recipe for target 'drivers' failed
make[3]: *** [drivers] Error 2
/tmp/UBT164-32_K4.4.0_GCC5.4.0/i686-native-linuxapp-gcc/424feb3e09a84139a289c4faee775b64/dpdk/mk/rte.sdkroot.mk:98: recipe for target 'all' failed
make[2]: *** [all] Error 2
/tmp/UBT164-32_K4.4.0_GCC5.4.0/i686-native-linuxapp-gcc/424feb3e09a84139a289c4faee775b64/dpdk/mk/rte.sdkinstall.mk:60: recipe for target 'pre_install' failed
make[1]: *** [pre_install] Error 2
/tmp/UBT164-32_K4.4.0_GCC5.4.0/i686-native-linuxapp-gcc/424feb3e09a84139a289c4faee775b64/dpdk/mk/rte.sdkroot.mk:77: recipe for target 'install' failed
make: *** [install] Error 2

*Failed Build #3:
OS: UBT1804
Target: x86_64-native-linuxapp-clang
  CC rte_port_kni.o
  CC rte_port_sym_crypto.o
  CC rte_port_source_sink.o
  AR librte_eventdev.a
  INSTALL-LIB librte_eventdev.a
make[5]: warning:  Clock skew detected.  Your build may be incomplete.
  AR librte_port.a
  INSTALL-LIB librte_port.a
== Build lib/librte_table
  SYMLINK-FILE include/rte_table.h
  SYMLINK-FILE include/rte_table_lpm_ipv6.h
--
  SYMLINK-FILE include/rte_pmd_dpaa.h
  CC dpaa_ethdev.o
  CC scheduler_pmd_ops.o
  AR librte_pmd_atlantic.a
  INSTALL-LIB librte_pmd_atlantic.a
make[6]: warning:  Clock skew detected.  Your build may be incomplete.
  CC cxgbevf_ethdev.o
  PMDINFO axgbe_ethdev.o.pmd.c
  CC axgbe_ethdev.o.pmd.o
  LD axgbe_ethdev.o
  CC axgbe_dev.o
--
  CC base/vnic_dev.o
== Build drivers/net/netvsc
  CC lio_ethdev.o
  AR librte_pmd_failsafe.a
  INSTALL-LIB librte_pmd_failsafe.a
make[6]: warning:  Clock skew detected.  Your build may be incomplete.
  CC hn_ethdev.o
  CC hn_rxtx.o
  CC i40e_dcb.o
  CC igb_flow.o
  CC ixgbe_api.o
--
  CC nicvf_mbox.o
  LD vdev_netvsc.o
  CC bcm_osal.o
  CC bnxt_util.o
  AR librte_pmd_vdev_netvsc.a
/tmp/UBT1804_K4.15.0_Clang6.0.0/x86_64-native-linuxapp-clang/424feb3e09a84139a289c4faee775b64/dpdk/drivers/net/tap/rte_eth_tap.c:2104:25: error: no member named 'n_receieved' in 'struct rte_mp_reply'; did you mean 'nb_received'?
        if (ret < 0 || replies.n_receieved != 1) {
                               ^~~~~~~~~~~
                               nb_received
/tmp/UBT1804_K4.15.0_Clang6.0.0/x86_64-native-linuxapp-clang/424feb3e09a84139a289c4faee775b64/dpdk/x86_64-native-linuxapp-clang/include/rte_eal.h:222:6: note: 'nb_received' declared here
        int nb_received;
            ^
  INSTALL-LIB librte_pmd_vdev_netvsc.a
1 error generated.
/tmp/UBT1804_K4.15.0_Clang6.0.0/x86_64-native-linuxapp-clang/424feb3e09a84139a289c4faee775b64/dpdk/mk/internal/rte.compile-pre.mk:114: recipe for target 'rte_eth_tap.o' failed
make[6]: *** [rte_eth_tap.o] Error 1
make[6]: *** Waiting for unfinished jobs....
  CC rte_pmd_bnxt.o
== Build drivers/net/virtio
  CC nicvf_ethdev.o
--
  CC sfc_rx.o
  PMDINFO nicvf_ethdev.o.pmd.c
  CC nicvf_ethdev.o.pmd.o
  LD nicvf_ethdev.o
  CC qede_main.o
/tmp/UBT1804_K4.15.0_Clang6.0.0/x86_64-native-linuxapp-clang/424feb3e09a84139a289c4faee775b64/dpdk/mk/rte.subdir.mk:35: recipe for target 'tap' failed
make[5]: *** [tap] Error 2
make[5]: *** Waiting for unfinished jobs....
  AR librte_pmd_thunderx_nicvf.a
  CC qede_rxtx.o
  INSTALL-LIB librte_pmd_thunderx_nicvf.a
--
  CC hunt_nic.o
  CC medford_nic.o
  CC medford2_nic.o
  AR librte_pmd_sfc_efx.a
  INSTALL-LIB librte_pmd_sfc_efx.a
/tmp/UBT1804_K4.15.0_Clang6.0.0/x86_64-native-linuxapp-clang/424feb3e09a84139a289c4faee775b64/dpdk/mk/rte.subdir.mk:35: recipe for target 'net' failed
make[4]: *** [net] Error 2
/tmp/UBT1804_K4.15.0_Clang6.0.0/x86_64-native-linuxapp-clang/424feb3e09a84139a289c4faee775b64/dpdk/mk/rte.sdkbuild.mk:46: recipe for target 'drivers' failed
make[3]: *** [drivers] Error 2
/tmp/UBT1804_K4.15.0_Clang6.0.0/x86_64-native-linuxapp-clang/424feb3e09a84139a289c4faee775b64/dpdk/mk/rte.sdkroot.mk:98: recipe for target 'all' failed
make[2]: *** [all] Error 2
/tmp/UBT1804_K4.15.0_Clang6.0.0/x86_64-native-linuxapp-clang/424feb3e09a84139a289c4faee775b64/dpdk/mk/rte.sdkinstall.mk:60: recipe for target 'pre_install' failed
make[1]: *** [pre_install] Error 2
/tmp/UBT1804_K4.15.0_Clang6.0.0/x86_64-native-linuxapp-clang/424feb3e09a84139a289c4faee775b64/dpdk/mk/rte.sdkroot.mk:77: recipe for target 'install' failed
make: *** [install] Error 2

*Failed Build #4:
OS: UBT1804
Target: x86_64-native-linuxapp-icc
  CC rte_port_sym_crypto.o
  AR librte_bpf.a
  INSTALL-LIB librte_bpf.a
  AR librte_eventdev.a
  INSTALL-LIB librte_eventdev.a
make[5]: warning:  Clock skew detected.  Your build may be incomplete.
  AR librte_port.a
  INSTALL-LIB librte_port.a
== Build lib/librte_table
  SYMLINK-FILE include/rte_table_lpm.h
  SYMLINK-FILE include/rte_table.h
--
  CC rte_eth_bond_args.o
  CC cxgbe_flow.o
  CC e1000_80003es2lan.o
  AR librte_pmd_atlantic.a
  INSTALL-LIB librte_pmd_atlantic.a
make[6]: warning:  Clock skew detected.  Your build may be incomplete.
== Build drivers/net/ena
  CC t4_hw.o
  CC axgbe_i2c.o
  CC ark_pktgen.o
  CC rte_eth_bond_8023ad.o
--
  CC em_rxtx.o
  CC i40e_hmc.o
  CC base/vnic_intr.o
  AR librte_pmd_failsafe.a
  INSTALL-LIB librte_pmd_failsafe.a
make[6]: warning:  Clock skew detected.  Your build may be incomplete.
== Build drivers/net/ice
  AR librte_pmd_iavf.a
  INSTALL-LIB librte_pmd_iavf.a
== Build drivers/net/ixgbe
  CC i40e_lan_hmc.o
--
  SYMLINK-FILE include/rte_eth_vhost.h
  INSTALL-LIB librte_pmd_kni.a
== Build drivers/net/ifc
  CC rte_eth_vhost.o
  LD rte_eth_softnic.o
/tmp/UBT1804_K4.15.0_ICC19.0.0/x86_64-native-linuxapp-icc/424feb3e09a84139a289c4faee775b64/dpdk/drivers/net/tap/rte_eth_tap.c(2104): error: struct "rte_mp_reply" has no field "n_receieved"
  	if (ret < 0 || replies.n_receieved != 1) {
  	                       ^

compilation aborted for /tmp/UBT1804_K4.15.0_ICC19.0.0/x86_64-native-linuxapp-icc/424feb3e09a84139a289c4faee775b64/dpdk/drivers/net/tap/rte_eth_tap.c (code 2)
/tmp/UBT1804_K4.15.0_ICC19.0.0/x86_64-native-linuxapp-icc/424feb3e09a84139a289c4faee775b64/dpdk/mk/internal/rte.compile-pre.mk:114: recipe for target 'rte_eth_tap.o' failed
make[6]: *** [rte_eth_tap.o] Error 2
/tmp/UBT1804_K4.15.0_ICC19.0.0/x86_64-native-linuxapp-icc/424feb3e09a84139a289c4faee775b64/dpdk/mk/rte.subdir.mk:35: recipe for target 'tap' failed
make[5]: *** [tap] Error 2
make[5]: *** Waiting for unfinished jobs....
  CC virtio_rxtx_simple.o
  CC nicvf_mbox.o
  CC vmxnet3_ethdev.o
--
  LD qede_ethdev.o
  AR librte_pmd_softnic.a
  INSTALL-LIB librte_pmd_softnic.a
  AR librte_pmd_qede.a
  INSTALL-LIB librte_pmd_qede.a
/tmp/UBT1804_K4.15.0_ICC19.0.0/x86_64-native-linuxapp-icc/424feb3e09a84139a289c4faee775b64/dpdk/mk/rte.subdir.mk:35: recipe for target 'net' failed
make[4]: *** [net] Error 2
/tmp/UBT1804_K4.15.0_ICC19.0.0/x86_64-native-linuxapp-icc/424feb3e09a84139a289c4faee775b64/dpdk/mk/rte.sdkbuild.mk:46: recipe for target 'drivers' failed
make[3]: *** [drivers] Error 2
/tmp/UBT1804_K4.15.0_ICC19.0.0/x86_64-native-linuxapp-icc/424feb3e09a84139a289c4faee775b64/dpdk/mk/rte.sdkroot.mk:98: recipe for target 'all' failed
make[2]: *** [all] Error 2
/tmp/UBT1804_K4.15.0_ICC19.0.0/x86_64-native-linuxapp-icc/424feb3e09a84139a289c4faee775b64/dpdk/mk/rte.sdkinstall.mk:60: recipe for target 'pre_install' failed
make[1]: *** [pre_install] Error 2
/tmp/UBT1804_K4.15.0_ICC19.0.0/x86_64-native-linuxapp-icc/424feb3e09a84139a289c4faee775b64/dpdk/mk/rte.sdkroot.mk:77: recipe for target 'install' failed
make: *** [install] Error 2

*Failed Build #5:
OS: UBT1810
Target: x86_64-native-linuxapp-gcc
  AR librte_eventdev.a
  SYMLINK-FILE include/rte_port_sched.h
  SYMLINK-FILE include/rte_port_fd.h
  INSTALL-LIB librte_eventdev.a
  CC ses.o
make[5]: warning:  Clock skew detected.  Your build may be incomplete.
  SYMLINK-FILE include/rte_port_kni.h
  SYMLINK-FILE include/rte_port_source_sink.h
  SYMLINK-FILE include/rte_port_sym_crypto.h
  CC bpf_jit_x86.o
  CC rte_port_ethdev.o
--
  AR librte_pmd_atlantic.a
  CC ark_udm.o
  INSTALL-LIB librte_pmd_atlantic.a
  CC virtio_cryptodev.o
  CC axgbe_mdio.o
make[6]: warning:  Clock skew detected.  Your build may be incomplete.
  CC axgbe_phy_impl.o
== Build drivers/net/bonding
  CC axgbe_i2c.o
  CC axgbe_rxtx.o
  AR librte_pmd_ark.a
--
  CC i40e_rxtx.o
  CC base/vnic_intr.o
  AR librte_pmd_failsafe.a
  INSTALL-LIB librte_pmd_failsafe.a
  CC base/vnic_rq.o
make[6]: warning:  Clock skew detected.  Your build may be incomplete.
== Build drivers/net/netvsc
  CC i40e_rxtx_vec_sse.o
  CC i40e_ethdev_vf.o
  PMDINFO igb_ethdev.o.pmd.c
  CC igb_ethdev.o.pmd.o
--
  CC sfc.o
  CC virtqueue.o
  CC sfc_mcdi.o
  CC virtio_pci.o
/tmp/UBT1810_K4.18.0_GCC8.2.0/x86_64-native-linuxapp-gcc/424feb3e09a84139a289c4faee775b64/dpdk/drivers/net/tap/rte_eth_tap.c: In function ‘tap_mp_attach_queues’:
/tmp/UBT1810_K4.18.0_GCC8.2.0/x86_64-native-linuxapp-gcc/424feb3e09a84139a289c4faee775b64/dpdk/drivers/net/tap/rte_eth_tap.c:2104:25: error: ‘struct rte_mp_reply’ has no member named ‘n_receieved’; did you mean ‘nb_received’?
  if (ret < 0 || replies.n_receieved != 1) {
                         ^~~~~~~~~~~
                         nb_received
make[6]: *** [/tmp/UBT1810_K4.18.0_GCC8.2.0/x86_64-native-linuxapp-gcc/424feb3e09a84139a289c4faee775b64/dpdk/mk/internal/rte.compile-pre.mk:116: rte_eth_tap.o] Error 1
make[5]: *** [/tmp/UBT1810_K4.18.0_GCC8.2.0/x86_64-native-linuxapp-gcc/424feb3e09a84139a289c4faee775b64/dpdk/mk/rte.subdir.mk:37: tap] Error 2

*Failed Build #6:
OS: RHEL75
Target: x86_64-native-linuxapp-gcc
  CC ixgbe_dcb.o
  CC bnxt_vnic.o
  CC rte_eth_tap.o
  CC bnxt_irq.o
/tmp/RHEL75_K3.10.0_GCC4.8.5/x86_64-native-linuxapp-gcc/424feb3e09a84139a289c4faee775b64/dpdk/drivers/net/tap/rte_eth_tap.c: In function ‘tap_mp_attach_queues’:
/tmp/RHEL75_K3.10.0_GCC4.8.5/x86_64-native-linuxapp-gcc/424feb3e09a84139a289c4faee775b64/dpdk/drivers/net/tap/rte_eth_tap.c:2104:24: error: ‘struct rte_mp_reply’ has no member named ‘n_receieved’
  if (ret < 0 || replies.n_receieved != 1) {
                        ^
  CC bnxt_util.o
make[6]: *** [rte_eth_tap.o] Error 1
make[5]: *** [tap] Error 2

*Failed Build #7:
OS: RHEL76
Target: x86_64-native-linuxapp-gcc
== Build drivers/net/vmxnet3
  CC rte_eth_tap.o
  CC sfc.o
  CC ecore_cxt.o
/tmp/RHEL76_K3.10.0_GCC4.8.5/x86_64-native-linuxapp-gcc/424feb3e09a84139a289c4faee775b64/dpdk/drivers/net/tap/rte_eth_tap.c: In function ‘tap_mp_attach_queues’:
/tmp/RHEL76_K3.10.0_GCC4.8.5/x86_64-native-linuxapp-gcc/424feb3e09a84139a289c4faee775b64/dpdk/drivers/net/tap/rte_eth_tap.c:2104:24: error: ‘struct rte_mp_reply’ has no member named ‘n_receieved’
  if (ret < 0 || replies.n_receieved != 1) {
                        ^
  AR librte_pmd_bnxt.a
make[6]: *** [rte_eth_tap.o] Error 1
make[5]: *** [tap] Error 2

*Failed Build #8:
OS: FC29
Target: x86_64-native-linuxapp-gcc
  CC bnxt_stats.o
  CC nicvf_rxtx.o
  CC nfp_nsp_cmds.o
== Build drivers/net/vdev_netvsc
/tmp/FC29_K4.20_GCC8.0.1/x86_64-native-linuxapp-gcc/424feb3e09a84139a289c4faee775b64/dpdk/drivers/net/tap/rte_eth_tap.c: In function ‘tap_mp_attach_queues’:
/tmp/FC29_K4.20_GCC8.0.1/x86_64-native-linuxapp-gcc/424feb3e09a84139a289c4faee775b64/dpdk/drivers/net/tap/rte_eth_tap.c:2104:25: error: ‘struct rte_mp_reply’ has no member named ‘n_receieved’; did you mean ‘nb_received’?
  if (ret < 0 || replies.n_receieved != 1) {
                         ^~~~~~~~~~~
                         nb_received
make[6]: *** [/tmp/FC29_K4.20_GCC8.0.1/x86_64-native-linuxapp-gcc/424feb3e09a84139a289c4faee775b64/dpdk/mk/internal/rte.compile-pre.mk:116: rte_eth_tap.o] Error 1
make[5]: *** [/tmp/FC29_K4.20_GCC8.0.1/x86_64-native-linuxapp-gcc/424feb3e09a84139a289c4faee775b64/dpdk/mk/rte.subdir.mk:37: tap] Error 2

*Failed Build #9:
OS: FC29
Target: x86_64-native-linuxapp-clang
  CC sfc_port.o
  CC bcm_osal.o
  CC i40e_rxtx_vec_avx2.o
  CC ecore_sriov.o
  CC sfc_rx.o
/tmp/FC29_K4.20_Clang6.0.1/x86_64-native-linuxapp-clang/424feb3e09a84139a289c4faee775b64/dpdk/drivers/net/tap/rte_eth_tap.c:2104:25: error: no member named 'n_receieved' in 'struct rte_mp_reply'; did you mean 'nb_received'?
        if (ret < 0 || replies.n_receieved != 1) {
                               ^~~~~~~~~~~
                               nb_received
/tmp/FC29_K4.20_Clang6.0.1/x86_64-native-linuxapp-clang/424feb3e09a84139a289c4faee775b64/dpdk/x86_64-native-linuxapp-clang/include/rte_eal.h:222:6: note: 'nb_received' declared here
        int nb_received;
            ^
1 error generated.
make[6]: *** [/tmp/FC29_K4.20_Clang6.0.1/x86_64-native-linuxapp-clang/424feb3e09a84139a289c4faee775b64/dpdk/mk/internal/rte.compile-pre.mk:116: rte_eth_tap.o] Error 1
  PMDINFO vdev_netvsc.o.pmd.c
  CC vdev_netvsc.o.pmd.o
  LD vdev_netvsc.o
  AR librte_pmd_vdev_netvsc.a

*Failed Build #10:
OS: UBT164-64
Target: x86_64-native-linuxapp-gcc
  CC base/vnic_rq.o
  CC enic_rxtx_vec_avx2.o
  CC i40e_rxtx_vec_sse.o
  AR librte_pmd_failsafe.a
  INSTALL-LIB librte_pmd_failsafe.a
make[6]: warning:  Clock skew detected.  Your build may be incomplete.
  CC iavf_vchnl.o
  PMDINFO iavf_ethdev.o.pmd.c
  CC iavf_ethdev.o.pmd.o
  LD iavf_ethdev.o
  CC iavf_rxtx.o
--
  CC nicvf_hw.o
  CC vdev_netvsc.o
  CC nicvf_mbox.o
  CC ecore_mcp.o
/tmp/UBT164-64_K4.4.0_GCC5.4.0/x86_64-native-linuxapp-gcc/424feb3e09a84139a289c4faee775b64/dpdk/drivers/net/tap/rte_eth_tap.c: In function ‘tap_mp_attach_queues’:
/tmp/UBT164-64_K4.4.0_GCC5.4.0/x86_64-native-linuxapp-gcc/424feb3e09a84139a289c4faee775b64/dpdk/drivers/net/tap/rte_eth_tap.c:2104:24: error: ‘struct rte_mp_reply’ has no member named ‘n_receieved’
  if (ret < 0 || replies.n_receieved != 1) {
                        ^
/tmp/UBT164-64_K4.4.0_GCC5.4.0/x86_64-native-linuxapp-gcc/424feb3e09a84139a289c4faee775b64/dpdk/mk/internal/rte.compile-pre.mk:114: recipe for target 'rte_eth_tap.o' failed
make[6]: *** [rte_eth_tap.o] Error 1
/tmp/UBT164-64_K4.4.0_GCC5.4.0/x86_64-native-linuxapp-gcc/424feb3e09a84139a289c4faee775b64/dpdk/mk/rte.subdir.mk:35: recipe for target 'tap' failed
make[5]: *** [tap] Error 2
make[5]: *** Waiting for unfinished jobs....
  CC ecore_int.o
  CC ice_rxtx_vec_avx2.o
  CC nicvf_ethdev.o
--
  INSTALL-LIB librte_pmd_qede.a
  CC medford_nic.o
  CC medford2_nic.o
  AR librte_pmd_sfc_efx.a
  INSTALL-LIB librte_pmd_sfc_efx.a
/tmp/UBT164-64_K4.4.0_GCC5.4.0/x86_64-native-linuxapp-gcc/424feb3e09a84139a289c4faee775b64/dpdk/mk/rte.subdir.mk:35: recipe for target 'net' failed
make[4]: *** [net] Error 2
/tmp/UBT164-64_K4.4.0_GCC5.4.0/x86_64-native-linuxapp-gcc/424feb3e09a84139a289c4faee775b64/dpdk/mk/rte.sdkbuild.mk:46: recipe for target 'drivers' failed
make[3]: *** [drivers] Error 2
/tmp/UBT164-64_K4.4.0_GCC5.4.0/x86_64-native-linuxapp-gcc/424feb3e09a84139a289c4faee775b64/dpdk/mk/rte.sdkroot.mk:98: recipe for target 'all' failed
make[2]: *** [all] Error 2
/tmp/UBT164-64_K4.4.0_GCC5.4.0/x86_64-native-linuxapp-gcc/424feb3e09a84139a289c4faee775b64/dpdk/mk/rte.sdkinstall.mk:60: recipe for target 'pre_install' failed
make[1]: *** [pre_install] Error 2
/tmp/UBT164-64_K4.4.0_GCC5.4.0/x86_64-native-linuxapp-gcc/424feb3e09a84139a289c4faee775b64/dpdk/mk/rte.sdkroot.mk:77: recipe for target 'install' failed
make: *** [install] Error 2

*Failed Build #11:
OS: UBT1804
Target: x86_64-native-linuxapp-gcc
  CC mps_tcam.o
  CC e1000_vf.o
  CC fm10k_tlv.o
  AR librte_pmd_failsafe.a
  INSTALL-LIB librte_pmd_failsafe.a
make[6]: warning:  Clock skew detected.  Your build may be incomplete.
  CC igb_ethdev.o
  CC fm10k_common.o
  CC fm10k_mbx.o
== Build drivers/net/ixgbe
  CC l2t.o
--
  CC tap_netlink.o
  AR librte_pmd_i40e.a
  INSTALL-LIB librte_pmd_i40e.a
  CC tap_tcmsgs.o
/tmp/UBT1804_K4.15.0_GCC7.3.0/x86_64-native-linuxapp-gcc/424feb3e09a84139a289c4faee775b64/dpdk/drivers/net/tap/rte_eth_tap.c: In function ‘tap_mp_attach_queues’:
/tmp/UBT1804_K4.15.0_GCC7.3.0/x86_64-native-linuxapp-gcc/424feb3e09a84139a289c4faee775b64/dpdk/drivers/net/tap/rte_eth_tap.c:2104:25: error: ‘struct rte_mp_reply’ has no member named ‘n_receieved’; did you mean ‘nb_received’?
  if (ret < 0 || replies.n_receieved != 1) {
                         ^~~~~~~~~~~
                         nb_received
  CC sfc.o
  PMDINFO rte_eth_ring.o.pmd.c
  CC rte_eth_ring.o.pmd.o
/tmp/UBT1804_K4.15.0_GCC7.3.0/x86_64-native-linuxapp-gcc/424feb3e09a84139a289c4faee775b64/dpdk/mk/internal/rte.compile-pre.mk:114: recipe for target 'rte_eth_tap.o' failed
make[6]: *** [rte_eth_tap.o] Error 1
make[6]: *** Waiting for unfinished jobs....
  CC sfc_mcdi.o
  LD rte_eth_ring.o
  CC nicvf_hw.o
--
  CC sfc_ethdev.o.pmd.o
  CC sfc_intr.o
  LD sfc_ethdev.o
  CC ecore_sp_commands.o
  CC bnxt_irq.o
/tmp/UBT1804_K4.15.0_GCC7.3.0/x86_64-native-linuxapp-gcc/424feb3e09a84139a289c4faee775b64/dpdk/mk/rte.subdir.mk:35: recipe for target 'tap' failed
make[5]: *** [tap] Error 2
make[5]: *** Waiting for unfinished jobs....
  CC sfc_ev.o
  CC sfc_port.o
  CC nicvf_ethdev.o
--
  CC hunt_nic.o
  CC medford_nic.o
  CC medford2_nic.o
  AR librte_pmd_sfc_efx.a
  INSTALL-LIB librte_pmd_sfc_efx.a
/tmp/UBT1804_K4.15.0_GCC7.3.0/x86_64-native-linuxapp-gcc/424feb3e09a84139a289c4faee775b64/dpdk/mk/rte.subdir.mk:35: recipe for target 'net' failed
make[4]: *** [net] Error 2
/tmp/UBT1804_K4.15.0_GCC7.3.0/x86_64-native-linuxapp-gcc/424feb3e09a84139a289c4faee775b64/dpdk/mk/rte.sdkbuild.mk:46: recipe for target 'drivers' failed
make[3]: *** [drivers] Error 2
/tmp/UBT1804_K4.15.0_GCC7.3.0/x86_64-native-linuxapp-gcc/424feb3e09a84139a289c4faee775b64/dpdk/mk/rte.sdkroot.mk:98: recipe for target 'all' failed
make[2]: *** [all] Error 2
/tmp/UBT1804_K4.15.0_GCC7.3.0/x86_64-native-linuxapp-gcc/424feb3e09a84139a289c4faee775b64/dpdk/mk/rte.sdkinstall.mk:60: recipe for target 'pre_install' failed
make[1]: *** [pre_install] Error 2
/tmp/UBT1804_K4.15.0_GCC7.3.0/x86_64-native-linuxapp-gcc/424feb3e09a84139a289c4faee775b64/dpdk/mk/rte.sdkroot.mk:77: recipe for target 'install' failed
make: *** [install] Error 2

*Failed Build #12:
OS: FC29
Target: x86_64-native-linuxapp-icc
  CC rte_eth_tap.o
  CC nfp_nsp_eth.o
  CC rte_pmd_bnxt.o
  CC tap_flow.o
  CC ixgbe_ipsec.o
/tmp/FC29_K4.20_ICC19.0.0/x86_64-native-linuxapp-icc/424feb3e09a84139a289c4faee775b64/dpdk/drivers/net/tap/rte_eth_tap.c(2104): error: struct "rte_mp_reply" has no field "n_receieved"
  	if (ret < 0 || replies.n_receieved != 1) {
  	                       ^

compilation aborted for /tmp/FC29_K4.20_ICC19.0.0/x86_64-native-linuxapp-icc/424feb3e09a84139a289c4faee775b64/dpdk/drivers/net/tap/rte_eth_tap.c (code 2)
make[6]: *** [/tmp/FC29_K4.20_ICC19.0.0/x86_64-native-linuxapp-icc/424feb3e09a84139a289c4faee775b64/dpdk/mk/internal/rte.compile-pre.mk:116: rte_eth_tap.o] Error 2

*Failed Build #13:
OS: CENTOS75
Target: x86_64-native-linuxapp-gcc
== Build drivers/net/vmxnet3
  CC ecore_sp_commands.o
  CC rte_eth_tap.o
  CC nicvf_rxtx.o
/tmp/CENTOS75_K3.10.0_GCC4.8.5/x86_64-native-linuxapp-gcc/424feb3e09a84139a289c4faee775b64/dpdk/drivers/net/tap/rte_eth_tap.c: In function ‘tap_mp_attach_queues’:
/tmp/CENTOS75_K3.10.0_GCC4.8.5/x86_64-native-linuxapp-gcc/424feb3e09a84139a289c4faee775b64/dpdk/drivers/net/tap/rte_eth_tap.c:2104:24: error: ‘struct rte_mp_reply’ has no member named ‘n_receieved’
  if (ret < 0 || replies.n_receieved != 1) {
                        ^
  CC vdev_netvsc.o
make[6]: *** [rte_eth_tap.o] Error 1
make[5]: *** [tap] Error 2

*Failed Build #14:
OS: SUSE12
Target: x86_64-native-linuxapp-gcc
  CC ecore_init_fw_funcs.o
  CC rte_eth_tap.o
  CC nfp_net.o
  CC nicvf_rxtx.o
/tmp/SUSE12_K3.7.10_GCC4.7.2/x86_64-native-linuxapp-gcc/424feb3e09a84139a289c4faee775b64/dpdk/drivers/net/tap/rte_eth_tap.c: In function ‘tap_mp_attach_queues’:
/tmp/SUSE12_K3.7.10_GCC4.7.2/x86_64-native-linuxapp-gcc/424feb3e09a84139a289c4faee775b64/dpdk/drivers/net/tap/rte_eth_tap.c:2104:25: error: ‘struct rte_mp_reply’ has no member named ‘n_receieved’; did you mean ‘nb_received’?
  if (ret < 0 || replies.n_receieved != 1) {
                         ^~~~~~~~~~~
                         nb_received
/tmp/SUSE12_K3.7.10_GCC4.7.2/x86_64-native-linuxapp-gcc/424feb3e09a84139a289c4faee775b64/dpdk/mk/internal/rte.compile-pre.mk:114: recipe for target 'rte_eth_tap.o' failed
make[6]: *** [rte_eth_tap.o] Error 1
/tmp/SUSE12_K3.7.10_GCC4.7.2/x86_64-native-linuxapp-gcc/424feb3e09a84139a289c4faee775b64/dpdk/mk/rte.subdir.mk:35: recipe for target 'tap' failed
make[5]: *** [tap] Error 2
make[5]: *** Waiting for unfinished jobs....
  CC sfc.o
  CC sfc_mcdi.o
  CC ecore_spq.o
--
  CC medford2_nic.o
  AR librte_pmd_qede.a
  AR librte_pmd_sfc_efx.a
  INSTALL-LIB librte_pmd_qede.a
  INSTALL-LIB librte_pmd_sfc_efx.a
/tmp/SUSE12_K3.7.10_GCC4.7.2/x86_64-native-linuxapp-gcc/424feb3e09a84139a289c4faee775b64/dpdk/mk/rte.subdir.mk:35: recipe for target 'net' failed
make[4]: *** [net] Error 2
/tmp/SUSE12_K3.7.10_GCC4.7.2/x86_64-native-linuxapp-gcc/424feb3e09a84139a289c4faee775b64/dpdk/mk/rte.sdkbuild.mk:46: recipe for target 'drivers' failed
make[3]: *** [drivers] Error 2
/tmp/SUSE12_K3.7.10_GCC4.7.2/x86_64-native-linuxapp-gcc/424feb3e09a84139a289c4faee775b64/dpdk/mk/rte.sdkroot.mk:98: recipe for target 'all' failed
make[2]: *** [all] Error 2
/tmp/SUSE12_K3.7.10_GCC4.7.2/x86_64-native-linuxapp-gcc/424feb3e09a84139a289c4faee775b64/dpdk/mk/rte.sdkinstall.mk:60: recipe for target 'pre_install' failed
make[1]: *** [pre_install] Error 2
/tmp/SUSE12_K3.7.10_GCC4.7.2/x86_64-native-linuxapp-gcc/424feb3e09a84139a289c4faee775b64/dpdk/mk/rte.sdkroot.mk:77: recipe for target 'install' failed
make: *** [install] Error 2

*Failed Build #15:
OS: CENTOS76
Target: x86_64-native-linuxapp-gcc
== Build drivers/net/vdev_netvsc
  CC sfc_ef10_rx.o
  CC ixgbe_pf.o
  CC ecore_mcp.o
/tmp/CENTOS76_K3.10.0_GCC4.8.5/x86_64-native-linuxapp-gcc/424feb3e09a84139a289c4faee775b64/dpdk/drivers/net/tap/rte_eth_tap.c: In function ‘tap_mp_attach_queues’:
/tmp/CENTOS76_K3.10.0_GCC4.8.5/x86_64-native-linuxapp-gcc/424feb3e09a84139a289c4faee775b64/dpdk/drivers/net/tap/rte_eth_tap.c:2104:24: error: ‘struct rte_mp_reply’ has no member named ‘n_receieved’
  if (ret < 0 || replies.n_receieved != 1) {
                        ^
  CC ecore_int.o
make[6]: *** [rte_eth_tap.o] Error 1
make[5]: *** [tap] Error 2

DPDK STV team


More information about the test-report mailing list